All pastes #146105 Raw Edit

Someone

public text v1 · immutable
#146105 ·published 2006-08-23 10:59 UTC
rendered paste body
include -I/home/users/iskorptix/Desktop/www/httpd-2.0.59/srclib/apr-util/include -I. -I/home/users/iskorptix/Desktop/www/httpd-2.0.59/os/unix -I/home/users/iskorptix/Desktop/www/httpd-2.0.59/server/mpm/prefork -I/home/users/iskorptix/Desktop/www/httpd-2.0.59/modules/http -I/home/users/iskorptix/Desktop/www/httpd-2.0.59/modules/filters -I/home/users/iskorptix/Desktop/www/httpd-2.0.59/modules/proxy -I/home/users/iskorptix/Desktop/www/httpd-2.0.59/include -I/home/users/iskorptix/Desktop/www/httpd-2.0.59/modules/generators -I../openssl-0.9.7j/include/openssl -I../openssl-0.9.7j/include -I/home/users/iskorptix/Desktop/www/httpd-2.0.59/modules/dav/main -prefer-non-pic -static -c mod_ssl.c && touch mod_ssl.lo
In file included from mod_ssl.c:27:
mod_ssl.h:92:17: ssl.h: No such file or directory
mod_ssl.h:94:18: x509.h: No such file or directory
mod_ssl.h:95:17: pem.h: No such file or directory
mod_ssl.h:96:20: crypto.h: No such file or directory
mod_ssl.h:97:17: evp.h: No such file or directory
mod_ssl.h:98:18: rand.h: No such file or directory
In file included from mod_ssl.h:110,
                 from mod_ssl.c:27:
ssl_toolkit_compat.h:222:2: #error "Unrecognized SSL Toolkit!"
In file included from mod_ssl.h:112,
                 from mod_ssl.c:27:
ssl_util_ssl.h:58: error: syntax error before '*' token
ssl_util_ssl.h:59: error: syntax error before '*' token
ssl_util_ssl.h:60: error: syntax error before '*' token
ssl_util_ssl.h:60: error: syntax error before "X509"
ssl_util_ssl.h:60: warning: data definition has no type or storage class
ssl_util_ssl.h:61: error: syntax error before '*' token
ssl_util_ssl.h:61: error: syntax error before "EVP_PKEY"
ssl_util_ssl.h:61: warning: data definition has no type or storage class
ssl_util_ssl.h:62: error: syntax error before '*' token
ssl_util_ssl.h:63: error: syntax error before '*' token
ssl_util_ssl.h:63: warning: data definition has no type or storage class
ssl_util_ssl.h:64: error: syntax error before '*' token
ssl_util_ssl.h:65: error: syntax error before "SSL"
ssl_util_ssl.h:66: error: syntax error before '*' token
ssl_util_ssl.h:67: error: syntax error before '*' token
ssl_util_ssl.h:68: error: syntax error before "X509"
ssl_util_ssl.h:69: error: syntax error before "STACK_OF"
ssl_util_ssl.h:70: error: syntax error before "STACK_OF"
ssl_util_ssl.h:71: error: syntax error before '*' token
ssl_util_ssl.h:75: error: syntax error before '*' token
ssl_util_ssl.h:77: error: syntax error before '*' token
ssl_util_ssl.h:78: warning: data definition has no type or storage class
In file included from mod_ssl.c:27:
mod_ssl.h:382: error: syntax error before "SSL"
mod_ssl.h:382: warning: no semicolon at end of struct or union
mod_ssl.h:384: error: syntax error before '*' token
mod_ssl.h:384: warning: data definition has no type or storage class
mod_ssl.h:392: error: syntax error before '}' token
mod_ssl.h:392: warning: data definition has no type or storage class
mod_ssl.h:429: error: syntax error before "X509"
mod_ssl.h:429: warning: no semicolon at end of struct or union
mod_ssl.h:430: warning: data definition has no type or storage class
mod_ssl.h:431: error: syntax error before '}' token
mod_ssl.h:431: warning: data definition has no type or storage class
mod_ssl.h:437: error: syntax error before "STACK_OF"
mod_ssl.h:437: warning: no semicolon at end of struct or union
mod_ssl.h:438: warning: data definition has no type or storage class
mod_ssl.h:457: error: syntax error before "SSL_CTX"
mod_ssl.h:457: warning: no semicolon at end of struct or union
mod_ssl.h:460: warning: data definition has no type or storage class
mod_ssl.h:461: error: syntax error before '*' token
mod_ssl.h:461: warning: data definition has no type or storage class
mod_ssl.h:474: error: syntax error before '*' token
mod_ssl.h:474: warning: data definition has no type or storage class
mod_ssl.h:477: error: syntax error before '}' token
mod_ssl.h:477: warning: data definition has no type or storage class
mod_ssl.h:486: error: syntax error before "modssl_ctx_t"
mod_ssl.h:486: warning: no semicolon at end of struct or union
mod_ssl.h:487: warning: data definition has no type or storage class
mod_ssl.h:488: error: syntax error before '}' token
mod_ssl.h:568: error: syntax error before '*' token
mod_ssl.h:568: warning: data definition has no type or storage class
mod_ssl.h:580: error: syntax error before '*' token
mod_ssl.h:580: error: syntax error before '*' token
mod_ssl.h:580: warning: data definition has no type or storage class
mod_ssl.h:581: error: syntax error before '*' token
mod_ssl.h:581: error: syntax error before '*' token
mod_ssl.h:581: warning: data definition has no type or storage class
mod_ssl.h:582: error: syntax error before "X509_STORE_CTX"
mod_ssl.h:583: error: syntax error before "X509_STORE_CTX"
mod_ssl.h:584: error: syntax error before '*' token
mod_ssl.h:585: error: syntax error before '*' token
mod_ssl.h:586: error: syntax error before '*' token
mod_ssl.h:586: error: syntax error before '*' token
mod_ssl.h:586: warning: data definition has no type or storage class
mod_ssl.h:587: error: syntax error before '*' token
mod_ssl.h:588: error: syntax error before "int"
mod_ssl.h:596: error: syntax error before "SSL_SESSION"
mod_ssl.h:597: error: syntax error before '*' token
mod_ssl.h:597: warning: data definition has no type or storage class
mod_ssl.h:604: error: syntax error before "SSL_SESSION"
mod_ssl.h:605: error: syntax error before '*' token
mod_ssl.h:605: warning: data definition has no type or storage class
mod_ssl.h:612: error: syntax error before "SSL_SESSION"
mod_ssl.h:613: error: syntax error before '*' token
mod_ssl.h:613: warning: data definition has no type or storage class
mod_ssl.h:620: error: syntax error before "SSL_SESSION"
mod_ssl.h:621: error: syntax error before '*' token
mod_ssl.h:621: warning: data definition has no type or storage class
mod_ssl.h:630: error: syntax error before '*' token
mod_ssl.h:630: warning: data definition has no type or storage class
mod_ssl.h:631: error: syntax error before '*' token
mod_ssl.h:631: warning: data definition has no type or storage class
mod_ssl.h:681: error: syntax error before "SSL"
mod_ssl.h:683: error: syntax error before '*' token
mod_ssl.h:699: error: syntax error before '*' token
mod_ssl.c:220: error: syntax error before '*' token
mod_ssl.c: In function `ssl_init_connection_ctx':
mod_ssl.c:222: error: `sslconn' undeclared (first use in this function)
mod_ssl.c:222: error: (Each undeclared identifier is reported only once
mod_ssl.c:222: error: for each function it appears in.)
mod_ssl.c:222: error: syntax error before ')' token
mod_ssl.c: In function `ssl_proxy_enable':
mod_ssl.c:239: error: `sslconn' undeclared (first use in this function)
mod_ssl.c:241: error: dereferencing pointer to incomplete type
mod_ssl.c:244: error: dereferencing pointer to incomplete type
mod_ssl.c: In function `ssl_engine_disable':
mod_ssl.c:259: error: `sslconn' undeclared (first use in this function)
mod_ssl.c:261: error: dereferencing pointer to incomplete type
mod_ssl.c: In function `ssl_hook_pre_connection':
mod_ssl.c:275: error: `SSL' undeclared (first use in this function)
mod_ssl.c:275: error: `ssl' undeclared (first use in this function)
mod_ssl.c:276: error: `sslconn' undeclared (first use in this function)
mod_ssl.c:276: error: syntax error before ')' token
mod_ssl.c:278: error: `mctx' undeclared (first use in this function)
mod_ssl.c:283: error: dereferencing pointer to incomplete type
mod_ssl.c:307: error: dereferencing pointer to incomplete type
mod_ssl.c:315: error: dereferencing pointer to incomplete type
mod_ssl.c:315: error: dereferencing pointer to incomplete type
mod_ssl.c:333: error: dereferencing pointer to incomplete type
mod_ssl.c:334: error: dereferencing pointer to incomplete type
mod_ssl.c:359: error: `X509_V_OK' undeclared (first use in this function)
mod_ssl.c: In function `ssl_hook_http_method':
mod_ssl.c:370: error: dereferencing pointer to incomplete type
mod_ssl.c: In function `ssl_hook_default_port':
mod_ssl.c:381: error: dereferencing pointer to incomplete type
make[3]: *** [mod_ssl.lo] Error 1
make[3]: Leaving directory `/home/users/iskorptix/Desktop/www/httpd-2.0.59/modules/ssl'
make[2]: *** [all-recursive] Error 1
make[2]: Leaving directory `/home/users/iskorptix/Desktop/www/httpd-2.0.59/modules/ssl'
make[1]: *** [all-recursive] Error 1
make[1]: Leaving directory `/home/users/iskorptix/Desktop/www/httpd-2.0.59/modules'
make: *** [all-recursive] Error 1