All pastes #145958 Raw Edit

Mine

public text v1 · immutable
#145958 ·published 2006-08-23 07:03 UTC
rendered paste body
zen:/usr/src/modules/ndiswrapper/debian# CC=gcc-4.0 m-a a-i -t ndiswrapper
Extracting the package tarball, /usr/src/ndiswrapper-source.tar.bz2, please wait...
/usr/bin/gcc-4.0
for templ in ; do \
    cp $templ `echo $templ | sed -e 's/_KVERS_/2.6.16-2-686-smp/g'` ; \
  done
for templ in `ls debian/*.modules.in` ; do \
    test -e ${templ%.modules.in}.backup || cp ${templ%.modules.in} ${templ%.modules.in}.backup 2>/dev/null || true; \
    sed -e 's/##KVERS##/2.6.16-2-686-smp/g ;s/#KVERS#/2.6.16-2-686-smp/g ; s/_KVERS_/2.6.16-2-686-smp/g ; s/##KDREV##/2.6.16-14bpo1/g ; s/#KDREV#/2.6.16-14bpo1/g ; s/_KDREV_/2.6.16-14bpo1/g' < $templ > ${templ%.modules.in}; \
  done
dh_clean
/usr/bin/make clean
make[1]: Entering directory `/usr/src/modules/ndiswrapper'
rm -rf ndiswrapper.ko ndiswrapper.o hal.o iw_ndis.o loader.o misc_funcs.o ndis.o ntoskernel.o ntoskernel_io.o pe_linker.o pnp.o proc.o wrapmem.o wrapndis.o wrapper.o usb.o divdi3.o usb.o x86_64_stubs.o \
           divdi3.o workqueue.o .*.ko.cmd .*.o.cmd \
           ndiswrapper.mod.[oc] *~ .tmp_versions
make[1]: Leaving directory `/usr/src/modules/ndiswrapper'
/usr/bin/make  -f debian/rules kdist_clean kdist_config binary-modules
make[1]: Entering directory `/usr/src/modules/ndiswrapper'
/usr/bin/gcc-4.0
for templ in ; do \
    cp $templ `echo $templ | sed -e 's/_KVERS_/2.6.16-2-686-smp/g'` ; \
  done
for templ in `ls debian/*.modules.in` ; do \
    test -e ${templ%.modules.in}.backup || cp ${templ%.modules.in} ${templ%.modules.in}.backup 2>/dev/null || true; \
    sed -e 's/##KVERS##/2.6.16-2-686-smp/g ;s/#KVERS#/2.6.16-2-686-smp/g ; s/_KVERS_/2.6.16-2-686-smp/g ; s/##KDREV##/2.6.16-14bpo1/g ; s/#KDREV#/2.6.16-14bpo1/g ; s/_KDREV_/2.6.16-14bpo1/g' < $templ > ${templ%.modules.in}; \
  done
dh_clean
/usr/bin/make clean
make[2]: Entering directory `/usr/src/modules/ndiswrapper'
rm -rf ndiswrapper.ko ndiswrapper.o hal.o iw_ndis.o loader.o misc_funcs.o ndis.o ntoskernel.o ntoskernel_io.o pe_linker.o pnp.o proc.o wrapmem.o wrapndis.o wrapper.o usb.o divdi3.o usb.o x86_64_stubs.o \
           divdi3.o workqueue.o .*.ko.cmd .*.o.cmd \
           ndiswrapper.mod.[oc] *~ .tmp_versions
make[2]: Leaving directory `/usr/src/modules/ndiswrapper'
make[1]: Nothing to be done for `kdist_config'.
dh_testdir
dh_testroot
dh_clean -k
dh_installdirs lib/modules/2.6.16-2-686-smp/misc
# build and install the module
/usr/bin/make KPKG_EXTRAV_ARG= KSRC=/lib/modules/2.6.16-2-686-smp/build \
        KBUILD=/lib/modules/2.6.16-2-686-smp/build KVER=2.6.16-2-686-smp \
        INST_DIR=debian/ndiswrapper-modules-2.6.16-2-686-smp/lib/modules/2.6.16-2-686-smp/misc/ install
make[2]: Entering directory `/usr/src/modules/ndiswrapper'
/usr/bin/make -C /lib/modules/2.6.16-2-686-smp/build SUBDIRS=/usr/src/modules/ndiswrapper \
                DRIVER_VERSION=1.21
make[3]: Entering directory `/usr/src/linux-headers-2.6.16-2-686-smp'
  LD      /usr/src/modules/ndiswrapper/built-in.o
  CC [M]  /usr/src/modules/ndiswrapper/hal.o
In file included from /usr/src/modules/ndiswrapper/ntoskernel.h:49,
                 from /usr/src/modules/ndiswrapper/hal.c:24:
/usr/src/modules/ndiswrapper/winnt_types.h:125:2: #error "gcc 3.4 or newer should be used for compiling this module"
In file included from /usr/src/modules/ndiswrapper/hal.c:24:
/usr/src/modules/ndiswrapper/ntoskernel.h:655: error: syntax error before "wfastcall"
/usr/src/modules/ndiswrapper/ntoskernel.h:655: warning: type defaults to `int' in declaration of `wfastcall'
/usr/src/modules/ndiswrapper/ntoskernel.h:655: warning: data definition has no type or storage class
/usr/src/modules/ndiswrapper/ntoskernel.h:656: error: syntax error before "wfastcall"
/usr/src/modules/ndiswrapper/ntoskernel.h:656: warning: type defaults to `int' in declaration of `wfastcall'
/usr/src/modules/ndiswrapper/ntoskernel.h:656: warning: data definition has no type or storage class
/usr/src/modules/ndiswrapper/ntoskernel.h:659: error: syntax error before "wfastcall"
/usr/src/modules/ndiswrapper/ntoskernel.h:659: warning: type defaults to `int' in declaration of `wfastcall'
/usr/src/modules/ndiswrapper/ntoskernel.h:659: warning: data definition has no type or storage class
/usr/src/modules/ndiswrapper/ntoskernel.h:662: error: syntax error before "wfastcall"
/usr/src/modules/ndiswrapper/ntoskernel.h:662: warning: type defaults to `int' in declaration of `wfastcall'
/usr/src/modules/ndiswrapper/ntoskernel.h:662: warning: data definition has no type or storage class
/usr/src/modules/ndiswrapper/ntoskernel.h:664: error: syntax error before "wfastcall"
/usr/src/modules/ndiswrapper/ntoskernel.h:664: warning: type defaults to `int' in declaration of `wfastcall'
/usr/src/modules/ndiswrapper/ntoskernel.h:664: warning: data definition has no type or storage class
/usr/src/modules/ndiswrapper/ntoskernel.h:665: error: syntax error before "wfastcall"
/usr/src/modules/ndiswrapper/ntoskernel.h:665: warning: type defaults to `int' in declaration of `wfastcall'
/usr/src/modules/ndiswrapper/ntoskernel.h:665: warning: data definition has no type or storage class
/usr/src/modules/ndiswrapper/ntoskernel.h:666: error: syntax error before "wfastcall"
/usr/src/modules/ndiswrapper/ntoskernel.h:666: warning: type defaults to `int' in declaration of `wfastcall'
/usr/src/modules/ndiswrapper/ntoskernel.h:666: warning: data definition has no type or storage class
/usr/src/modules/ndiswrapper/ntoskernel.h:667: error: syntax error before "wfastcall"
/usr/src/modules/ndiswrapper/ntoskernel.h:667: warning: type defaults to `int' in declaration of `wfastcall'
/usr/src/modules/ndiswrapper/ntoskernel.h:667: warning: data definition has no type or storage class
/usr/src/modules/ndiswrapper/ntoskernel.h:668: error: syntax error before "wfastcall"
/usr/src/modules/ndiswrapper/ntoskernel.h:668: warning: type defaults to `int' in declaration of `wfastcall'
/usr/src/modules/ndiswrapper/ntoskernel.h:668: warning: data definition has no type or storage class
/usr/src/modules/ndiswrapper/ntoskernel.h:669: error: syntax error before "wfastcall"
/usr/src/modules/ndiswrapper/ntoskernel.h:669: warning: type defaults to `int' in declaration of `wfastcall'
/usr/src/modules/ndiswrapper/ntoskernel.h:669: warning: data definition has no type or storage class
/usr/src/modules/ndiswrapper/ntoskernel.h:670: error: syntax error before "wfastcall"
/usr/src/modules/ndiswrapper/ntoskernel.h:670: warning: type defaults to `int' in declaration of `wfastcall'
/usr/src/modules/ndiswrapper/ntoskernel.h:670: warning: data definition has no type or storage class
/usr/src/modules/ndiswrapper/ntoskernel.h:671: error: syntax error before "wfastcall"
/usr/src/modules/ndiswrapper/ntoskernel.h:671: warning: type defaults to `int' in declaration of `wfastcall'
/usr/src/modules/ndiswrapper/ntoskernel.h:671: warning: data definition has no type or storage class
/usr/src/modules/ndiswrapper/ntoskernel.h:673: error: syntax error before "wfastcall"
/usr/src/modules/ndiswrapper/ntoskernel.h:673: warning: type defaults to `int' in declaration of `wfastcall'
/usr/src/modules/ndiswrapper/ntoskernel.h:673: warning: data definition has no type or storage class
/usr/src/modules/ndiswrapper/ntoskernel.h:674: error: syntax error before "wfastcall"
/usr/src/modules/ndiswrapper/ntoskernel.h:674: warning: type defaults to `int' in declaration of `wfastcall'
/usr/src/modules/ndiswrapper/ntoskernel.h:674: warning: data definition has no type or storage class
/usr/src/modules/ndiswrapper/hal.c:122: error: syntax error before "KIRQL"
/usr/src/modules/ndiswrapper/hal.c:132: error: syntax error before "void"
/usr/src/modules/ndiswrapper/hal.c:140: error: syntax error before "KIRQL"
/usr/src/modules/ndiswrapper/hal.c:147: error: syntax error before "void"
/usr/src/modules/ndiswrapper/hal.c:154: error: syntax error before "void"
/usr/src/modules/ndiswrapper/hal.c:166: error: syntax error before "void"
make[4]: *** [/usr/src/modules/ndiswrapper/hal.o] Error 1
make[3]: *** [_module_/usr/src/modules/ndiswrapper] Error 2
make[3]: Leaving directory `/usr/src/linux-headers-2.6.16-2-686-smp'
make[2]: *** [default] Error 2
make[2]: Leaving directory `/usr/src/modules/ndiswrapper'
make[1]: *** [binary-modules] Error 2
make[1]: Leaving directory `/usr/src/modules/ndiswrapper'
make: *** [kdist_build] Error 2