All pastes #14580 Raw Edit

Miscellany

public text v1 · immutable
#14580 ·published 2005-06-15 03:29 UTC
rendered paste body
AT -DSSL_ENGINE -I/usr/local/ssl/include -DMOD_SSL_VERSION=\"2.8.22\" ssl_engine_init.c
ssl_engine_init.c: In function `ssl_init_ConfigureServer':
ssl_engine_init.c:707: warning: passing arg 2 of `d2i_X509' from incompatible pointer type
ssl_engine_init.c:726: warning: passing arg 2 of `d2i_X509' from incompatible pointer type
ssl_engine_init.c:800: warning: passing arg 3 of `d2i_PrivateKey' from incompatible pointer type
ssl_engine_init.c:826: warning: passing arg 3 of `d2i_PrivateKey' from incompatible pointer type
gcc -c  -I../../os/unix -I../../include   -DMOD_SSL=208122 -DEAPI -DUSE_EXPAT -I../../lib/expat-lite `../../apaci` -DSSL_COMPAT -DSSL_ENGINE -I/usr/local/ssl/include -DMOD_SSL_VERSION=\"2.8.22\" ssl_engine_kernel.c
gcc -c  -I../../os/unix -I../../include   -DMOD_SSL=208122 -DEAPI -DUSE_EXPAT -I../../lib/expat-lite `../../apaci` -DSSL_COMPAT -DSSL_ENGINE -I/usr/local/ssl/include -DMOD_SSL_VERSION=\"2.8.22\" ssl_engine_rand.c
gcc -c  -I../../os/unix -I../../include   -DMOD_SSL=208122 -DEAPI -DUSE_EXPAT -I../../lib/expat-lite `../../apaci` -DSSL_COMPAT -DSSL_ENGINE -I/usr/local/ssl/include -DMOD_SSL_VERSION=\"2.8.22\" ssl_engine_io.c
gcc -c  -I../../os/unix -I../../include   -DMOD_SSL=208122 -DEAPI -DUSE_EXPAT -I../../lib/expat-lite `../../apaci` -DSSL_COMPAT -DSSL_ENGINE -I/usr/local/ssl/include -DMOD_SSL_VERSION=\"2.8.22\" ssl_engine_log.c
gcc -c  -I../../os/unix -I../../include   -DMOD_SSL=208122 -DEAPI -DUSE_EXPAT -I../../lib/expat-lite `../../apaci` -DSSL_COMPAT -DSSL_ENGINE -I/usr/local/ssl/include -DMOD_SSL_VERSION=\"2.8.22\" ssl_engine_mutex.c
gcc -c  -I../../os/unix -I../../include   -DMOD_SSL=208122 -DEAPI -DUSE_EXPAT -I../../lib/expat-lite `../../apaci` -DSSL_COMPAT -DSSL_ENGINE -I/usr/local/ssl/include -DMOD_SSL_VERSION=\"2.8.22\" ssl_engine_pphrase.c
ssl_engine_pphrase.c: In function `ssl_pphrase_Handle_CB':
ssl_engine_pphrase.c:496: `PEM_F_DEF_CALLBACK' undeclared (first use in this function)
ssl_engine_pphrase.c:496: (Each undeclared identifier is reported only once
ssl_engine_pphrase.c:496: for each function it appears in.)
gmake[4]: *** [ssl_engine_pphrase.o] Error 1
gmake[4]: Leaving directory `/usr/local/Apache/src/modules/ssl'
gmake[3]: *** [all] Error 1
gmake[3]: Leaving directory `/usr/local/Apache/src/modules'
gmake[2]: *** [subdirs] Error 1
gmake[2]: Leaving directory `/usr/local/Apache/src'
gmake[1]: *** [build-std] Error 2
gmake[1]: Leaving directory `/usr/local/Apache'
gmake: *** [build] Error 2
#