/opt/local/bin/cmake -H/Users/philip/Development/pedigree -B/Users/philip/Development/pedigree/build --check-build-system CMakeFiles/Makefile.cmake 0
/opt/local/bin/cmake -E cmake_progress_start /Users/philip/Development/pedigree/build/CMakeFiles /Users/philip/Development/pedigree/build/CMakeFiles/progress.make
make -f CMakeFiles/Makefile2 all
make -f src/subsys/posix/CMakeFiles/pedigree-glue.o.dir/build.make src/subsys/posix/CMakeFiles/pedigree-glue.o.dir/depend
cd /Users/philip/Development/pedigree/build && /opt/local/bin/cmake -E cmake_depends "Unix Makefiles" /Users/philip/Development/pedigree /Users/philip/Development/pedigree/src/subsys/posix /Users/philip/Development/pedigree/build /Users/philip/Development/pedigree/build/src/subsys/posix /Users/philip/Development/pedigree/build/src/subsys/posix/CMakeFiles/pedigree-glue.o.dir/DependInfo.cmake --color=
make -f src/subsys/posix/CMakeFiles/pedigree-glue.o.dir/build.make src/subsys/posix/CMakeFiles/pedigree-glue.o.dir/build
/opt/local/bin/cmake -E cmake_progress_report /Users/philip/Development/pedigree/build/CMakeFiles 91
[ 1%] Building C object src/subsys/posix/CMakeFiles/pedigree-glue.o.dir/glue.c.o
cd /Users/philip/Development/pedigree/build/src/subsys/posix && /Users/philip/.pedigree-cross/bin/i686-pedigree-gcc -DADDITIONAL_CHECKS=1 -DBITS_32=1 -DLITTLE_ENDIAN=1 -DKERNEL_STANDALONE=1 -DX86_COMMON=1 -DX86=1 -DKERNEL_NEEDS_ADDRESS_SPACE_SWITCH=1 -DDEBUGGER=1 -DDWARF=1 -DDEBUGGER_QWERTY=1 -DECHO_CONSOLE_TO_SERIAL=1 -DSERIAL_IS_FILE=1 -DVERBOSE_LINKER=1 -DCRIPPLE_HDD=1 -DTHREADS=1 -march=i486 -fno-builtin -fno-stack-protector -nostdlib -m32 -g3 -O2 -gdwarf-2 -I/Users/philip/Development/pedigree/src/subsys/posix/../../system/include -I/Users/philip/Development/pedigree/src/subsys/posix/../../system/kernel/linker -I/Users/philip/Development/pedigree/src/subsys/posix/../../system/modules -I/Users/philip/Development/pedigree/src/subsys/posix/. -I/Users/philip/Development/pedigree/src/subsys/posix/./include -o CMakeFiles/pedigree-glue.o.dir/glue.c.o -c /Users/philip/Development/pedigree/src/subsys/posix/glue.c
/opt/local/bin/cmake -E cmake_progress_report /Users/philip/Development/pedigree/build/CMakeFiles
[ 1%] Building C object src/subsys/posix/CMakeFiles/pedigree-glue.o.dir/glue-sysconf.c.o
cd /Users/philip/Development/pedigree/build/src/subsys/posix && /Users/philip/.pedigree-cross/bin/i686-pedigree-gcc -DADDITIONAL_CHECKS=1 -DBITS_32=1 -DLITTLE_ENDIAN=1 -DKERNEL_STANDALONE=1 -DX86_COMMON=1 -DX86=1 -DKERNEL_NEEDS_ADDRESS_SPACE_SWITCH=1 -DDEBUGGER=1 -DDWARF=1 -DDEBUGGER_QWERTY=1 -DECHO_CONSOLE_TO_SERIAL=1 -DSERIAL_IS_FILE=1 -DVERBOSE_LINKER=1 -DCRIPPLE_HDD=1 -DTHREADS=1 -march=i486 -fno-builtin -fno-stack-protector -nostdlib -m32 -g3 -O2 -gdwarf-2 -I/Users/philip/Development/pedigree/src/subsys/posix/../../system/include -I/Users/philip/Development/pedigree/src/subsys/posix/../../system/kernel/linker -I/Users/philip/Development/pedigree/src/subsys/posix/../../system/modules -I/Users/philip/Development/pedigree/src/subsys/posix/. -I/Users/philip/Development/pedigree/src/subsys/posix/./include -o CMakeFiles/pedigree-glue.o.dir/glue-sysconf.c.o -c /Users/philip/Development/pedigree/src/subsys/posix/glue-sysconf.c
Linking C executable pedigree-glue.o
cd /Users/philip/Development/pedigree/build/src/subsys/posix && /opt/local/bin/cmake -E cmake_link_script CMakeFiles/pedigree-glue.o.dir/link.txt --verbose=1
/Users/philip/.pedigree-cross/bin/i686-pedigree-gcc -march=i486 -fno-builtin -fno-stack-protector -nostdlib -m32 -g3 -O2 -gdwarf-2 -Wl,-search_paths_first -headerpad_max_install_names -r CMakeFiles/pedigree-glue.o.dir/glue.c.o CMakeFiles/pedigree-glue.o.dir/glue-sysconf.c.o -o pedigree-glue.o -lgcc
i686-pedigree-gcc: unrecognized option '-headerpad_max_install_names'
/Users/philip/.pedigree-cross/bin/../lib/gcc/i686-pedigree/4.3.2/../../../../i686-pedigree/bin/ld: warning: cannot find entry symbol arch_paths_first; defaulting to 00000000
/opt/local/bin/cmake -E cmake_progress_report /Users/philip/Development/pedigree/build/CMakeFiles 91
[ 1%] Built target pedigree-glue.o
make -f src/subsys/posix/CMakeFiles/posix-usermode.dir/build.make src/subsys/posix/CMakeFiles/posix-usermode.dir/depend
cd /Users/philip/Development/pedigree/build && /opt/local/bin/cmake -E cmake_depends "Unix Makefiles" /Users/philip/Development/pedigree /Users/philip/Development/pedigree/src/subsys/posix /Users/philip/Development/pedigree/build /Users/philip/Development/pedigree/build/src/subsys/posix /Users/philip/Development/pedigree/build/src/subsys/posix/CMakeFiles/posix-usermode.dir/DependInfo.cmake --color=
make -f src/subsys/posix/CMakeFiles/posix-usermode.dir/build.make src/subsys/posix/CMakeFiles/posix-usermode.dir/build
perl /Users/philip/Development/pedigree/scripts/posixBlendLibc.pl /Users/philip/Development/pedigree/src/subsys/posix/newlib-i686-libc.a /Users/philip/Development/pedigree/src/subsys/posix/newlib-i686-libm.a /Users/philip/Development/pedigree/build/src/subsys/posix/pedigree-glue.o /Users/philip/Development/pedigree/src/subsys/posix/include /Users/philip/.pedigree-cross/bin/i686-pedigree-gcc /usr/bin/ar /Users/philip/Development/pedigree/build /Users/philip/.pedigree-cross/bin/../lib/gcc/i686-pedigree/4.3.2/
ar: /: Is a directory
ar: //: Is a directory
ar: lib_a-a64l.o/: No such file or directory
ar: lib_a-abort.o/: No such file or directory
ar: lib_a-abs.o/: No such file or directory
ar: lib_a-asctime.o/: No such file or directory
ar: lib_a-assert.o/: No such file or directory
ar: lib_a-atexit.o/: No such file or directory
ar: lib_a-atoff.o/: No such file or directory
ar: lib_a-atof.o/: No such file or directory
ar: lib_a-atoi.o/: No such file or directory
ar: lib_a-atoll.o/: No such file or directory
ar: lib_a-atol.o/: No such file or directory
ar: lib_a-bcmp.o/: No such file or directory
ar: lib_a-bcopy.o/: No such file or directory
ar: lib_a-bsearch.o/: No such file or directory
ar: lib_a-btowc.o/: No such file or directory
ar: lib_a-bzero.o/: No such file or directory
ar: lib_a-calloc.o/: No such file or directory
ar: lib_a-callocr.o/: No such file or directory
ar: lib_a-cfreer.o/: No such file or directory
ar: lib_a-clock.o/: No such file or directory
ar: lib_a-closer.o/: No such file or directory
ar: lib_a-collate.o/: No such file or directory
ar: lib_a-collcmp.o/: No such file or directory
ar: lib_a-creat.o/: No such file or directory
ar: lib_a-ctime.o/: No such file or directory
ar: lib_a-ctime_r.o/: No such file or directory
ar: lib_a-ctype_.o/: No such file or directory
ar: lib_a-dirname.o/: No such file or directory
ar: lib_a-div.o/: No such file or directory
ar: lib_a-dprintf.o/: No such file or directory
ar: lib_a-drand48.o/: No such file or directory
ar: lib_a-dtoa.o/: No such file or directory
ar: lib_a-dummy.o/: No such file or directory
ar: lib_a-ecvtbuf.o/: No such file or directory
ar: lib_a-efgcvt.o/: No such file or directory
ar: lib_a-environ.o/: No such file or directory
ar: lib_a-envlock.o/: No such file or directory
ar: lib_a-eprintf.o/: No such file or directory
ar: lib_a-erand48.o/: No such file or directory
ar: lib_a-errno.o/: No such file or directory
ar: lib_a-execle.o/: No such file or directory
ar: lib_a-execl.o/: No such file or directory
ar: lib_a-execlp.o/: No such file or directory
ar: lib_a-execr.o/: No such file or directory
ar: lib_a-execve.o/: No such file or directory
ar: lib_a-execv.o/: No such file or directory
ar: lib_a-execvp.o/: No such file or directory
ar: lib_a-exit.o/: No such file or directory
ar: lib_a-_Exit.o/: No such file or directory
ar: lib_a-__exp10.o/: No such file or directory
ar: lib_a-fclose.o/: No such file or directory
ar: lib_a-fcntlr.o/: No such file or directory
ar: lib_a-fdopen.o/: No such file or directory
ar: lib_a-feof.o/: No such file or directory
ar: lib_a-ferror.o/: No such file or directory
ar: lib_a-fflush.o/: No such file or directory
ar: lib_a-ffs.o/: No such file or directory
ar: lib_a-fgetc.o/: No such file or directory
ar: lib_a-fgetpos.o/: No such file or directory
ar: lib_a-fgets.o/: No such file or directory
ar: lib_a-fgetwc.o/: No such file or directory
ar: lib_a-fgetws.o/: No such file or directory
ar: lib_a-fileno.o/: No such file or directory
ar: lib_a-findfp.o/: No such file or directory
ar: lib_a-fiscanf.o/: No such file or directory
ar: lib_a-flags.o/: No such file or directory
ar: lib_a-fnmatch.o/: No such file or directory
ar: lib_a-fopen.o/: No such file or directory
ar: lib_a-fprintf.o/: No such file or directory
ar: lib_a-fputc.o/: No such file or directory
ar: lib_a-fputs.o/: No such file or directory
ar: lib_a-fputwc.o/: No such file or directory
ar: lib_a-fputws.o/: No such file or directory
ar: lib_a-fread.o/: No such file or directory
ar: lib_a-freer.o/: No such file or directory
ar: lib_a-freopen.o/: No such file or directory
ar: lib_a-fscanf.o/: No such file or directory
ar: lib_a-fseek.o/: No such file or directory
ar: lib_a-fseeko.o/: No such file or directory
ar: lib_a-fsetpos.o/: No such file or directory
ar: lib_a-fstatr.o/: No such file or directory
ar: lib_a-ftell.o/: No such file or directory
ar: lib_a-ftello.o/: No such file or directory
ar: lib_a-funopen.o/: No such file or directory
ar: lib_a-fvwrite.o/: No such file or directory
ar: lib_a-fwalk.o/: No such file or directory
ar: lib_a-fwide.o/: No such file or directory
ar: lib_a-fwrite.o/: No such file or directory
ar: lib_a-getchar.o/: No such file or directory
ar: lib_a-getc.o/: No such file or directory
ar: lib_a-getc_u.o/: No such file or directory
ar: lib_a-getcwd.o/: No such file or directory
ar: lib_a-getenv.o/: No such file or directory
ar: lib_a-getline.o/: No such file or directory
ar: lib_a-getopt.o/: No such file or directory
ar: lib_a-getpass.o/: No such file or directory
ar: lib_a-gets.o/: No such file or directory
ar: lib_a-getut.o/: No such file or directory
ar: lib_a-getwc.o/: No such file or directory
ar: lib_a-getw.o/: No such file or directory
ar: lib_a-glob.o/: No such file or directory
ar: lib_a-gmtime.o/: No such file or directory
ar: lib_a-hash.o/: No such file or directory
ar: lib_a-hcreate.o/: No such file or directory
ar: lib_a-impure.o/: No such file or directory
ar: lib_a-index.o/: No such file or directory
ar: lib_a-init.o/: No such file or directory
ar: lib_a-iprintf.o/: No such file or directory
ar: lib_a-isalnum.o/: No such file or directory
ar: lib_a-isalpha.o/: No such file or directory
ar: lib_a-isascii.o/: No such file or directory
ar: lib_a-_isatty.o/: No such file or directory
ar: lib_a-isatty.o/: No such file or directory
ar: lib_a-isattyr.o/: No such file or directory
ar: lib_a-isblank.o/: No such file or directory
ar: lib_a-iscanf.o/: No such file or directory
ar: lib_a-iscntrl.o/: No such file or directory
ar: lib_a-isdigit.o/: No such file or directory
ar: lib_a-islower.o/: No such file or directory
ar: lib_a-isprint.o/: No such file or directory
ar: lib_a-ispunct.o/: No such file or directory
ar: lib_a-isspace.o/: No such file or directory
ar: lib_a-isupper.o/: No such file or directory
ar: lib_a-jp2uc.o/: No such file or directory
ar: lib_a-jrand48.o/: No such file or directory
ar: lib_a-l64a.o/: No such file or directory
ar: lib_a-labs.o/: No such file or directory
ar: lib_a-lcltime.o/: No such file or directory
ar: lib_a-lcong48.o/: No such file or directory
ar: lib_a-ldiv.o/: No such file or directory
ar: lib_a-ldpart.o/: No such file or directory
ar: lib_a-ldtoa.o/: No such file or directory
ar: lib_a-linkr.o/: No such file or directory
ar: lib_a-llabs.o/: No such file or directory
ar: lib_a-lldiv.o/: No such file or directory
ar: lib_a-locale.o/: No such file or directory
ar: lib_a-lrand48.o/: No such file or directory
ar: lib_a-lseekr.o/: No such file or directory
ar: lib_a-makebuf.o/: No such file or directory
ar: lib_a-malign.o/: No such file or directory
ar: lib_a-malignr.o/: No such file or directory
ar: lib_a-malloc.o/: No such file or directory
ar: lib_a-mallocr.o/: No such file or directory
ar: lib_a-mblen.o/: No such file or directory
ar: lib_a-mblen_r.o/: No such file or directory
ar: lib_a-mbrlen.o/: No such file or directory
ar: lib_a-mbrtowc.o/: No such file or directory
ar: lib_a-mbsinit.o/: No such file or directory
ar: lib_a-mbtowc.o/: No such file or directory
ar: lib_a-memccpy.o/: No such file or directory
ar: lib_a-memchr.o/: No such file or directory
ar: lib_a-memcmp.o/: No such file or directory
ar: lib_a-memcpy.o/: No such file or directory
ar: lib_a-memmem.o/: No such file or directory
ar: lib_a-memmove.o/: No such file or directory
ar: lib_a-mempcpy.o/: No such file or directory
ar: lib_a-memset.o/: No such file or directory
ar: lib_a-mktemp.o/: No such file or directory
ar: lib_a-mktime.o/: No such file or directory
ar: lib_a-mktm_r.o/: No such file or directory
ar: lib_a-mlock.o/: No such file or directory
ar: lib_a-mprec.o/: No such file or directory
ar: lib_a-mrand48.o/: No such file or directory
ar: lib_a-msize.o/: No such file or directory
ar: lib_a-msizer.o/: No such file or directory
ar: lib_a-mstats.o/: No such file or directory
ar: lib_a-mtrim.o/: No such file or directory
ar: lib_a-nrand48.o/: No such file or directory
ar: lib_a-on_exit.o/: No such file or directory
ar: lib_a-opendir.o/: No such file or directory
ar: lib_a-openr.o/: No such file or directory
ar: lib_a-perror.o/: No such file or directory
ar: lib_a-popen.o/: No such file or directory
ar: lib_a-pread.o/: No such file or directory
ar: lib_a-printf.o/: No such file or directory
ar: lib_a-putchar.o/: No such file or directory
ar: lib_a-putc.o/: No such file or directory
ar: lib_a-putc_u.o/: No such file or directory
ar: lib_a-putenv.o/: No such file or directory
ar: lib_a-puts.o/: No such file or directory
ar: lib_a-putwc.o/: No such file or directory
ar: lib_a-putw.o/: No such file or directory
ar: lib_a-pwrite.o/: No such file or directory
ar: lib_a-qsort.o/: No such file or directory
ar: lib_a-raise.o/: No such file or directory
ar: lib_a-rand48.o/: No such file or directory
ar: lib_a-rand.o/: No such file or directory
ar: lib_a-rand_r.o/: No such file or directory
ar: lib_a-readdir.o/: No such file or directory
ar: lib_a-readr.o/: No such file or directory
ar: lib_a-realloc.o/: No such file or directory
ar: lib_a-reent.o/: No such file or directory
ar: lib_a-refill.o/: No such file or directory
ar: lib_a-regcomp.o/: No such file or directory
ar: lib_a-regexec.o/: No such file or directory
ar: lib_a-regfree.o/: No such file or directory
ar: lib_a-remove.o/: No such file or directory
ar: lib_a-rename.o/: No such file or directory
ar: lib_a-renamer.o/: No such file or directory
ar: lib_a-rewind.o/: No such file or directory
ar: lib_a-rget.o/: No such file or directory
ar: lib_a-rindex.o/: No such file or directory
ar: lib_a-sbrkr.o/: No such file or directory
ar: lib_a-scandir.o/: No such file or directory
ar: lib_a-scanf.o/: No such file or directory
ar: lib_a-sccl.o/: No such file or directory
ar: lib_a-seed48.o/: No such file or directory
ar: lib_a-seekdir.o/: No such file or directory
ar: lib_a-setbuf.o/: No such file or directory
ar: lib_a-setenv.o/: No such file or directory
ar: lib_a-setjmp.o/: No such file or directory
ar: lib_a-setvbuf.o/: No such file or directory
ar: lib_a-sf_modf.o/: No such file or directory
ar: lib_a-sf_nan.o/: No such file or directory
ar: lib_a-s_frexp.o/: No such file or directory
ar: lib_a-signal.o/: No such file or directory
ar: lib_a-signalr.o/: No such file or directory
ar: lib_a-signgam.o/: No such file or directory
ar: lib_a-sigset.o/: No such file or directory
ar: lib_a-siscanf.o/: No such file or directory
ar: lib_a-s_isinf.o/: No such file or directory
ar: lib_a-s_isnan.o/: No such file or directory
ar: lib_a-s_ldexp.o/: No such file or directory
ar: lib_a-sleep.o/: No such file or directory
ar: lib_a-s_modf.o/: No such file or directory
ar: lib_a-s_nan.o/: No such file or directory
ar: lib_a-sprintf.o/: No such file or directory
ar: lib_a-srand48.o/: No such file or directory
ar: lib_a-sscanf.o/: No such file or directory
ar: lib_a-statr.o/: No such file or directory
ar: lib_a-stdio.o/: No such file or directory
ar: lib_a-stpcpy.o/: No such file or directory
ar: lib_a-stpncpy.o/: No such file or directory
ar: lib_a-strcat.o/: No such file or directory
ar: lib_a-strchr.o/: No such file or directory
ar: lib_a-strcmp.o/: No such file or directory
ar: lib_a-strcoll.o/: No such file or directory
ar: lib_a-strcpy.o/: No such file or directory
ar: lib_a-strcspn.o/: No such file or directory
ar: lib_a-strdup.o/: No such file or directory
ar: lib_a-strlcat.o/: No such file or directory
ar: lib_a-strlcpy.o/: No such file or directory
ar: lib_a-strlen.o/: No such file or directory
ar: lib_a-strlwr.o/: No such file or directory
ar: lib_a-strncat.o/: No such file or directory
ar: lib_a-strncmp.o/: No such file or directory
ar: lib_a-strncpy.o/: No such file or directory
ar: lib_a-strndup.o/: No such file or directory
ar: lib_a-strnlen.o/: No such file or directory
ar: lib_a-strpbrk.o/: No such file or directory
ar: lib_a-strrchr.o/: No such file or directory
ar: lib_a-strsep.o/: No such file or directory
ar: lib_a-strspn.o/: No such file or directory
ar: lib_a-strstr.o/: No such file or directory
ar: lib_a-strtod.o/: No such file or directory
ar: lib_a-strtok.o/: No such file or directory
ar: lib_a-strtoll.o/: No such file or directory
ar: lib_a-strtol.o/: No such file or directory
ar: lib_a-strtoul.o/: No such file or directory
ar: lib_a-strupr.o/: No such file or directory
ar: lib_a-strxfrm.o/: No such file or directory
ar: lib_a-swab.o/: No such file or directory
ar: lib_a-system.o/: No such file or directory
ar: lib_a-tdelete.o/: No such file or directory
ar: lib_a-telldir.o/: No such file or directory
ar: lib_a-tfind.o/: No such file or directory
ar: lib_a-time.o/: No such file or directory
ar: lib_a-timesr.o/: No such file or directory
ar: lib_a-tmpfile.o/: No such file or directory
ar: lib_a-tmpnam.o/: No such file or directory
ar: lib_a-toascii.o/: No such file or directory
ar: lib_a-tolower.o/: No such file or directory
ar: lib_a-toupper.o/: No such file or directory
ar: lib_a-tsearch.o/: No such file or directory
ar: lib_a-ttyname.o/: No such file or directory
ar: lib_a-twalk.o/: No such file or directory
ar: lib_a-tzlock.o/: No such file or directory
ar: lib_a-tzset.o/: No such file or directory
ar: lib_a-tzset_r.o/: No such file or directory
ar: lib_a-tzvars.o/: No such file or directory
ar: lib_a-unctrl.o/: No such file or directory
ar: lib_a-ungetc.o/: No such file or directory
ar: lib_a-ungetwc.o/: No such file or directory
ar: lib_a-unlinkr.o/: No such file or directory
ar: lib_a-usleep.o/: No such file or directory
ar: lib_a-valloc.o/: No such file or directory
ar: lib_a-vallocr.o/: No such file or directory
ar: lib_a-vfscanf.o/: No such file or directory
ar: lib_a-viscanf.o/: No such file or directory
ar: lib_a-vprintf.o/: No such file or directory
ar: lib_a-vscanf.o/: No such file or directory
ar: lib_a-vsscanf.o/: No such file or directory
ar: lib_a-wbuf.o/: No such file or directory
ar: lib_a-wcpcpy.o/: No such file or directory
ar: lib_a-wcpncpy.o/: No such file or directory
ar: lib_a-wcrtomb.o/: No such file or directory
ar: lib_a-wcscat.o/: No such file or directory
ar: lib_a-wcschr.o/: No such file or directory
ar: lib_a-wcscmp.o/: No such file or directory
ar: lib_a-wcscoll.o/: No such file or directory
ar: lib_a-wcscpy.o/: No such file or directory
ar: lib_a-wcscspn.o/: No such file or directory
ar: lib_a-wcslcat.o/: No such file or directory
ar: lib_a-wcslcpy.o/: No such file or directory
ar: lib_a-wcslen.o/: No such file or directory
ar: lib_a-wcsncat.o/: No such file or directory
ar: lib_a-wcsncmp.o/: No such file or directory
ar: lib_a-wcsncpy.o/: No such file or directory
ar: lib_a-wcsnlen.o/: No such file or directory
ar: lib_a-wcspbrk.o/: No such file or directory
ar: lib_a-wcsrchr.o/: No such file or directory
ar: lib_a-wcsspn.o/: No such file or directory
ar: lib_a-wcsstr.o/: No such file or directory
ar: lib_a-wcstok.o/: No such file or directory
ar: lib_a-wcstoll.o/: No such file or directory
ar: lib_a-wcstol.o/: No such file or directory
ar: lib_a-wcstoul.o/: No such file or directory
ar: lib_a-wcsxfrm.o/: No such file or directory
ar: lib_a-wctob.o/: No such file or directory
ar: lib_a-wctomb.o/: No such file or directory
ar: lib_a-wctrans.o/: No such file or directory
ar: lib_a-wctype.o/: No such file or directory
ar: lib_a-wcwidth.o/: No such file or directory
ar: lib_a-wmemchr.o/: No such file or directory
ar: lib_a-wmemcmp.o/: No such file or directory
ar: lib_a-wmemcpy.o/: No such file or directory
ar: lib_a-wmemset.o/: No such file or directory
ar: lib_a-wordexp.o/: No such file or directory
ar: lib_a-writer.o/: No such file or directory
ar: lib_a-wsetup.o/: No such file or directory
rm: /tmp/pedigree-tmp/lib_a-init.o: No such file or directory
rm: /tmp/pedigree-tmp/lib_a-getpwent.o: No such file or directory
rm: /tmp/pedigree-tmp/lib_a-signal.o: No such file or directory
rm: /tmp/pedigree-tmp/lib_a-getcwd.o: No such file or directory
rm: /tmp/pedigree-tmp/lib_a-rename.o: No such file or directory
rm: /tmp/pedigree-tmp/lib_a-rewinddir.o: No such file or directory
rm: /tmp/pedigree-tmp/lib_a-opendir.o: No such file or directory
rm: /tmp/pedigree-tmp/lib_a-readdir.o: No such file or directory
rm: /tmp/pedigree-tmp/lib_a-closedir.o: No such file or directory
rm: /tmp/pedigree-tmp/lib_a-_isatty.o: No such file or directory
ar: /: Is a directory
ar: //: Is a directory
ar: lib_a-e_acosh.o/: No such file or directory
ar: lib_a-e_acos.o/: No such file or directory
ar: lib_a-e_asin.o/: No such file or directory
ar: lib_a-e_atan2.o/: No such file or directory
ar: lib_a-e_atanh.o/: No such file or directory
ar: lib_a-e_cosh.o/: No such file or directory
ar: lib_a-e_exp.o/: No such file or directory
ar: lib_a-ef_acos.o/: No such file or directory
ar: lib_a-ef_asin.o/: No such file or directory
ar: lib_a-ef_cosh.o/: No such file or directory
ar: lib_a-ef_exp.o/: No such file or directory
ar: lib_a-ef_fmod.o/: No such file or directory
ar: lib_a-ef_j0.o/: No such file or directory
ar: lib_a-ef_j1.o/: No such file or directory
ar: lib_a-ef_jn.o/: No such file or directory
ar: lib_a-ef_log.o/: No such file or directory
ar: lib_a-e_fmod.o/: No such file or directory
ar: lib_a-ef_pow.o/: No such file or directory
ar: lib_a-ef_sinh.o/: No such file or directory
ar: lib_a-ef_sqrt.o/: No such file or directory
ar: lib_a-e_hypot.o/: No such file or directory
ar: lib_a-e_j0.o/: No such file or directory
ar: lib_a-e_j1.o/: No such file or directory
ar: lib_a-e_jn.o/: No such file or directory
ar: lib_a-e_log10.o/: No such file or directory
ar: lib_a-e_log.o/: No such file or directory
ar: lib_a-e_pow.o/: No such file or directory
ar: lib_a-e_scalb.o/: No such file or directory
ar: lib_a-e_sinh.o/: No such file or directory
ar: lib_a-e_sqrt.o/: No such file or directory
ar: lib_a-f_atan2.o/: No such file or directory
ar: lib_a-f_expf.o/: No such file or directory
ar: lib_a-f_exp.o/: No such file or directory
ar: lib_a-f_frexp.o/: No such file or directory
ar: lib_a-f_ldexp.o/: No such file or directory
ar: lib_a-f_log10.o/: No such file or directory
ar: lib_a-f_logf.o/: No such file or directory
ar: lib_a-f_log.o/: No such file or directory
ar: lib_a-f_lrint.o/: No such file or directory
ar: lib_a-f_powf.o/: No such file or directory
ar: lib_a-f_pow.o/: No such file or directory
ar: lib_a-f_rintf.o/: No such file or directory
ar: lib_a-f_rintl.o/: No such file or directory
ar: lib_a-f_rint.o/: No such file or directory
ar: lib_a-f_tanf.o/: No such file or directory
ar: lib_a-f_tan.o/: No such file or directory
ar: lib_a-k_cos.o/: No such file or directory
ar: lib_a-kf_cos.o/: No such file or directory
ar: lib_a-kf_sin.o/: No such file or directory
ar: lib_a-kf_tan.o/: No such file or directory
ar: lib_a-k_sin.o/: No such file or directory
ar: lib_a-k_tan.o/: No such file or directory
ar: lib_a-s_asinh.o/: No such file or directory
ar: lib_a-s_atan.o/: No such file or directory
ar: lib_a-s_cbrt.o/: No such file or directory
ar: lib_a-s_ceil.o/: No such file or directory
ar: lib_a-s_cos.o/: No such file or directory
ar: lib_a-s_erf.o/: No such file or directory
ar: lib_a-s_exp10.o/: No such file or directory
ar: lib_a-s_expm1.o/: No such file or directory
ar: lib_a-s_fabs.o/: No such file or directory
ar: lib_a-sf_atan.o/: No such file or directory
ar: lib_a-sf_cbrt.o/: No such file or directory
ar: lib_a-sf_ceil.o/: No such file or directory
ar: lib_a-sf_cos.o/: No such file or directory
ar: lib_a-s_fdim.o/: No such file or directory
ar: lib_a-sf_erf.o/: No such file or directory
ar: lib_a-sf_fabs.o/: No such file or directory
ar: lib_a-sf_fdim.o/: No such file or directory
ar: lib_a-sf_fma.o/: No such file or directory
ar: lib_a-sf_fmax.o/: No such file or directory
ar: lib_a-sf_fmin.o/: No such file or directory
ar: lib_a-sf_logb.o/: No such file or directory
ar: lib_a-s_floor.o/: No such file or directory
ar: lib_a-s_fma.o/: No such file or directory
ar: lib_a-s_fmax.o/: No such file or directory
ar: lib_a-s_fmin.o/: No such file or directory
ar: lib_a-sf_modf.o/: No such file or directory
ar: lib_a-sf_nan.o/: No such file or directory
ar: lib_a-s_frexp.o/: No such file or directory
ar: lib_a-sf_rint.o/: No such file or directory
ar: lib_a-sf_sin.o/: No such file or directory
ar: lib_a-sf_tanh.o/: No such file or directory
ar: lib_a-sf_tan.o/: No such file or directory
ar: lib_a-s_ilogb.o/: No such file or directory
ar: lib_a-s_isinf.o/: No such file or directory
ar: lib_a-s_isnan.o/: No such file or directory
ar: lib_a-s_ldexp.o/: No such file or directory
ar: lib_a-s_log1p.o/: No such file or directory
ar: lib_a-s_logb.o/: No such file or directory
ar: lib_a-s_lrint.o/: No such file or directory
ar: lib_a-s_modf.o/: No such file or directory
ar: lib_a-s_nan.o/: No such file or directory
ar: lib_a-s_pow10.o/: No such file or directory
ar: lib_a-s_rint.o/: No such file or directory
ar: lib_a-s_round.o/: No such file or directory
ar: lib_a-s_sin.o/: No such file or directory
ar: lib_a-s_tanh.o/: No such file or directory
ar: lib_a-s_tan.o/: No such file or directory
ar: lib_a-s_trunc.o/: No such file or directory
ar: lib_a-w_acosh.o/: No such file or directory
ar: lib_a-w_acos.o/: No such file or directory
ar: lib_a-w_asin.o/: No such file or directory
ar: lib_a-w_atan2.o/: No such file or directory
ar: lib_a-w_atanh.o/: No such file or directory
ar: lib_a-w_cabs.o/: No such file or directory
ar: lib_a-w_cosh.o/: No such file or directory
ar: lib_a-w_drem.o/: No such file or directory
ar: lib_a-w_exp2.o/: No such file or directory
ar: lib_a-w_exp.o/: No such file or directory
ar: lib_a-wf_acos.o/: No such file or directory
ar: lib_a-wf_asin.o/: No such file or directory
ar: lib_a-wf_cabs.o/: No such file or directory
ar: lib_a-wf_cosh.o/: No such file or directory
ar: lib_a-wf_drem.o/: No such file or directory
ar: lib_a-wf_exp2.o/: No such file or directory
ar: lib_a-wf_exp.o/: No such file or directory
ar: lib_a-wf_fmod.o/: No such file or directory
ar: lib_a-wf_j0.o/: No such file or directory
ar: lib_a-wf_j1.o/: No such file or directory
ar: lib_a-wf_jn.o/: No such file or directory
ar: lib_a-wf_log.o/: No such file or directory
ar: lib_a-w_fmod.o/: No such file or directory
ar: lib_a-wf_pow.o/: No such file or directory
ar: lib_a-wf_sinh.o/: No such file or directory
ar: lib_a-wf_sqrt.o/: No such file or directory
ar: lib_a-w_gamma.o/: No such file or directory
ar: lib_a-w_hypot.o/: No such file or directory
ar: lib_a-w_j0.o/: No such file or directory
ar: lib_a-w_j1.o/: No such file or directory
ar: lib_a-w_jn.o/: No such file or directory
ar: lib_a-w_log10.o/: No such file or directory
ar: lib_a-w_log.o/: No such file or directory
ar: lib_a-w_pow.o/: No such file or directory
ar: lib_a-w_scalb.o/: No such file or directory
ar: lib_a-w_sinh.o/: No such file or directory
ar: lib_a-w_sqrt.o/: No such file or directory
i686-pedigree-gcc: /tmp/pedigree-tmp/*.o: No such file or directory
/opt/local/bin/cmake -E cmake_progress_report /Users/philip/Development/pedigree/build/CMakeFiles
[ 1%] Built target posix-usermode
make -f src/subsys/posix/CMakeFiles/crt0.o.dir/build.make src/subsys/posix/CMakeFiles/crt0.o.dir/depend
cd /Users/philip/Development/pedigree/build && /opt/local/bin/cmake -E cmake_depends "Unix Makefiles" /Users/philip/Development/pedigree /Users/philip/Development/pedigree/src/subsys/posix /Users/philip/Development/pedigree/build /Users/philip/Development/pedigree/build/src/subsys/posix /Users/philip/Development/pedigree/build/src/subsys/posix/CMakeFiles/crt0.o.dir/DependInfo.cmake --color=
make -f src/subsys/posix/CMakeFiles/crt0.o.dir/build.make src/subsys/posix/CMakeFiles/crt0.o.dir/build
/opt/local/bin/cmake -E cmake_progress_report /Users/philip/Development/pedigree/build/CMakeFiles
[ 1%] Building C object src/subsys/posix/CMakeFiles/crt0.o.dir/crt0.c.o
cd /Users/philip/Development/pedigree/build/src/subsys/posix && /Users/philip/.pedigree-cross/bin/i686-pedigree-gcc -DADDITIONAL_CHECKS=1 -DBITS_32=1 -DLITTLE_ENDIAN=1 -DKERNEL_STANDALONE=1 -DX86_COMMON=1 -DX86=1 -DKERNEL_NEEDS_ADDRESS_SPACE_SWITCH=1 -DDEBUGGER=1 -DDWARF=1 -DDEBUGGER_QWERTY=1 -DECHO_CONSOLE_TO_SERIAL=1 -DSERIAL_IS_FILE=1 -DVERBOSE_LINKER=1 -DCRIPPLE_HDD=1 -DTHREADS=1 -march=i486 -fno-builtin -fno-stack-protector -nostdlib -m32 -g3 -O2 -gdwarf-2 -I/Users/philip/Development/pedigree/src/subsys/posix/../../system/include -I/Users/philip/Development/pedigree/src/subsys/posix/../../system/kernel/linker -I/Users/philip/Development/pedigree/src/subsys/posix/../../system/modules -I/Users/philip/Development/pedigree/src/subsys/posix/. -I/Users/philip/Development/pedigree/src/subsys/posix/./include -o CMakeFiles/crt0.o.dir/crt0.c.o -c /Users/philip/Development/pedigree/src/subsys/posix/crt0.c
Linking C executable crt0.o
cd /Users/philip/Development/pedigree/build/src/subsys/posix && /opt/local/bin/cmake -E cmake_link_script CMakeFiles/crt0.o.dir/link.txt --verbose=1
/Users/philip/.pedigree-cross/bin/i686-pedigree-gcc -march=i486 -fno-builtin -fno-stack-protector -nostdlib -m32 -g3 -O2 -gdwarf-2 -Wl,-search_paths_first -headerpad_max_install_names -r CMakeFiles/crt0.o.dir/crt0.c.o -o crt0.o
i686-pedigree-gcc: unrecognized option '-headerpad_max_install_names'
/Users/philip/.pedigree-cross/bin/../lib/gcc/i686-pedigree/4.3.2/../../../../i686-pedigree/bin/ld: warning: cannot find entry symbol arch_paths_first; defaulting to 00000000
/opt/local/bin/cmake -E cmake_progress_report /Users/philip/Development/pedigree/build/CMakeFiles
[ 1%] Built target crt0.o
make -f src/user/applications/login/CMakeFiles/login.dir/build.make src/user/applications/login/CMakeFiles/login.dir/depend
cd /Users/philip/Development/pedigree/build && /opt/local/bin/cmake -E cmake_depends "Unix Makefiles" /Users/philip/Development/pedigree /Users/philip/Development/pedigree/src/user/applications/login /Users/philip/Development/pedigree/build /Users/philip/Development/pedigree/build/src/user/applications/login /Users/philip/Development/pedigree/build/src/user/applications/login/CMakeFiles/login.dir/DependInfo.cmake --color=
make -f src/user/applications/login/CMakeFiles/login.dir/build.make src/user/applications/login/CMakeFiles/login.dir/build
/opt/local/bin/cmake -E cmake_progress_report /Users/philip/Development/pedigree/build/CMakeFiles 100
[ 2%] Building C object src/user/applications/login/CMakeFiles/login.dir/login.c.o
cd /Users/philip/Development/pedigree/build/src/user/applications/login && /Users/philip/.pedigree-cross/bin/i686-pedigree-gcc -DADDITIONAL_CHECKS=1 -DBITS_32=1 -DLITTLE_ENDIAN=1 -DKERNEL_STANDALONE=1 -DX86_COMMON=1 -DX86=1 -DKERNEL_NEEDS_ADDRESS_SPACE_SWITCH=1 -DDEBUGGER=1 -DDWARF=1 -DDEBUGGER_QWERTY=1 -DECHO_CONSOLE_TO_SERIAL=1 -DSERIAL_IS_FILE=1 -DVERBOSE_LINKER=1 -DCRIPPLE_HDD=1 -DTHREADS=1 -fno-builtin -fno-stack-protector -U__svr4__ -nostdlib -I/Users/philip/Development/pedigree/build/include-posix -o CMakeFiles/login.dir/login.c.o -c /Users/philip/Development/pedigree/src/user/applications/login/login.c
Linking C executable login
cd /Users/philip/Development/pedigree/build/src/user/applications/login && /opt/local/bin/cmake -E cmake_link_script CMakeFiles/login.dir/link.txt --verbose=1
/Users/philip/.pedigree-cross/bin/i686-pedigree-gcc -fno-builtin -fno-stack-protector -U__svr4__ -nostdlib -Wl,-search_paths_first -headerpad_max_install_names -Wl,-Bdynamic -L /Users/philip/Development/pedigree/build CMakeFiles/login.dir/login.c.o ../../../subsys/posix/crt0.o -o login -lc -lgcc -lm
i686-pedigree-gcc: unrecognized option '-headerpad_max_install_names'
/Users/philip/.pedigree-cross/bin/../lib/gcc/i686-pedigree/4.3.2/../../../../i686-pedigree/bin/ld: warning: cannot find entry symbol arch_paths_first; defaulting to 08048420
CMakeFiles/login.dir/login.c.o: In function `main':
login.c:(.text+0x24): undefined reference to `fopen'
login.c:(.text+0x52): undefined reference to `fread'
login.c:(.text+0x76): undefined reference to `printf'
login.c:(.text+0x84): undefined reference to `printf'
login.c:(.text+0x90): undefined reference to `printf'
login.c:(.text+0x95): undefined reference to `_impure_ptr'
login.c:(.text+0xa0): undefined reference to `fflush'
login.c:(.text+0x107): undefined reference to `printf'
login.c:(.text+0x12f): undefined reference to `printf'
login.c:(.text+0x13d): undefined reference to `_impure_ptr'
login.c:(.text+0x155): undefined reference to `_impure_ptr'
login.c:(.text+0x15e): undefined reference to `_impure_ptr'
login.c:(.text+0x16a): undefined reference to `__srget_r'
login.c:(.text+0x177): undefined reference to `_impure_ptr'
login.c:(.text+0x1e1): undefined reference to `printf'
login.c:(.text+0x219): undefined reference to `printf'
login.c:(.text+0x22a): undefined reference to `getpass'
login.c:(.text+0x232): undefined reference to `_impure_ptr'
login.c:(.text+0x23d): undefined reference to `fflush'
login.c:(.text+0x264): undefined reference to `printf'
login.c:(.text+0x287): undefined reference to `malloc'
login.c:(.text+0x2ae): undefined reference to `sprintf'
login.c:(.text+0x2d5): undefined reference to `execle'
login.c:(.text+0x2eb): undefined reference to `printf'
login.c:(.text+0x2f7): undefined reference to `exit'
../../../subsys/posix/crt0.o: In function `_start':
(.text+0x65): undefined reference to `setenv'
../../../subsys/posix/crt0.o: In function `_start':
(.text+0x84): undefined reference to `environ'
/Users/philip/Development/pedigree/build/libc.so: undefined reference to `strcpy'
/Users/philip/Development/pedigree/build/libc.so: undefined reference to `strerror'
/Users/philip/Development/pedigree/build/libc.so: undefined reference to `__errno'
/Users/philip/Development/pedigree/build/libc.so: undefined reference to `memcpy'
/Users/philip/Development/pedigree/build/libc.so: undefined reference to `memset'
/Users/philip/Development/pedigree/build/libc.so: undefined reference to `strcmp'
/Users/philip/Development/pedigree/build/libc.so: undefined reference to `isdigit'
/Users/philip/Development/pedigree/build/libc.so: undefined reference to `atoi'
/Users/philip/Development/pedigree/build/libc.so: undefined reference to `strlen'
/Users/philip/Development/pedigree/build/libc.so: undefined reference to `free'
collect2: ld returned 1 exit status
make[2]: *** [src/user/applications/login/login] Error 1
make[1]: *** [src/user/applications/login/CMakeFiles/login.dir/all] Error 2
make: *** [all] Error 2