Unnamed
public text v1 · immutable collect2: ld returned 1 exit status
make[2]: *** [vchkpw] Error 1
make[2]: Leaving directory `/downloads/qmailrocks/vpopmail-5.4.13'
make[1]: *** [all-recursive] Error 1
make[1]: Leaving directory `/downloads/qmailrocks/vpopmail-5.4.13'
make: *** [all] Error 2
tandem:/downloads/qmailrocks/vpopmail-5.4.13#