rendered paste bodyIn file included from nsFontMetricsXlib.cpp:79:
@@ ../../../dist/include/xprintutil/xprintutil.h:42:34: X11/extensions/Print.h: No such file or directory
In file included from nsFontMetricsXlib.cpp:79:
../../../dist/include/xprintutil/xprintutil.h:141: error: type specifier
omitted for parameter `XPContext'
../../../dist/include/xprintutil/xprintutil.h:141: error: parse error before `*
' token
../../../dist/include/xprintutil/xprintutil.h:142: error: type specifier
omitted for parameter `XPContext'
../../../dist/include/xprintutil/xprintutil.h:142: error: parse error before `)
' token
../../../dist/include/xprintutil/xprintutil.h:145: error: type specifier
omitted for parameter `XPContext'
../../../dist/include/xprintutil/xprintutil.h:145: error: parse error before `,
' token
../../../dist/include/xprintutil/xprintutil.h:147: error: type specifier
omitted for parameter `XPContext'
../../../dist/include/xprintutil/xprintutil.h:147: error: parse error before `,
' token
../../../dist/include/xprintutil/xprintutil.h:149: error: type specifier
omitted for parameter `XPContext'
../../../dist/include/xprintutil/xprintutil.h:149: error: parse error before `,
' token
../../../dist/include/xprintutil/xprintutil.h:150: error: type specifier
omitted for parameter `XPContext'
../../../dist/include/xprintutil/xprintutil.h:150: error: parse error before `,
' token
../../../dist/include/xprintutil/xprintutil.h:151: error: type specifier
omitted for parameter `XPContext'
../../../dist/include/xprintutil/xprintutil.h:151: error: parse error before `,
' token
../../../dist/include/xprintutil/xprintutil.h:158: error: parse error before `
char'
../../../dist/include/xprintutil/xprintutil.h:159: error: `XPPrinterList' was
not declared in this scope
../../../dist/include/xprintutil/xprintutil.h:159: error: parse error before `)
' token
../../../dist/include/xprintutil/xprintutil.h:162: error: type specifier
omitted for parameter `XPContext'
../../../dist/include/xprintutil/xprintutil.h:162: error: parse error before `,
' token
../../../dist/include/xprintutil/xprintutil.h:165: error: type specifier
omitted for parameter `XPContext'
../../../dist/include/xprintutil/xprintutil.h:165: error: parse error before `,
' token
../../../dist/include/xprintutil/xprintutil.h:167: error: type specifier
omitted for parameter `XPContext'
../../../dist/include/xprintutil/xprintutil.h:167: error: parse error before `,
' token
../../../dist/include/xprintutil/xprintutil.h:168: error: type specifier
omitted for parameter `XPContext'
../../../dist/include/xprintutil/xprintutil.h:168: error: parse error before `,
' token
../../../dist/include/xprintutil/xprintutil.h:180: error: type specifier
omitted for parameter `XPContext'
../../../dist/include/xprintutil/xprintutil.h:180: error: parse error before `,
' token
../../../dist/include/xprintutil/xprintutil.h:182: error: type specifier
omitted for parameter `XPContext'
../../../dist/include/xprintutil/xprintutil.h:182: error: parse error before `,
' token
../../../dist/include/xprintutil/xprintutil.h:183: error: type specifier
omitted for parameter `XPContext'
../../../dist/include/xprintutil/xprintutil.h:183: error: parse error before `,
' token
../../../dist/include/xprintutil/xprintutil.h:184: error: type specifier
omitted for parameter `XPContext'
../../../dist/include/xprintutil/xprintutil.h:184: error: parse error before `,
' token
../../../dist/include/xprintutil/xprintutil.h:188: error: type specifier
omitted for parameter `XPContext'
../../../dist/include/xprintutil/xprintutil.h:188: error: parse error before `,
' token
../../../dist/include/xprintutil/xprintutil.h:192: error: type specifier
omitted for parameter `XPContext'
../../../dist/include/xprintutil/xprintutil.h:192: error: parse error before `,
' token
../../../dist/include/xprintutil/xprintutil.h:193: error: type specifier
omitted for parameter `XPContext'
../../../dist/include/xprintutil/xprintutil.h:193: error: parse error before `,
' token
../../../dist/include/xprintutil/xprintutil.h:196: error: type specifier
omitted for parameter `XPContext'
../../../dist/include/xprintutil/xprintutil.h:196: error: parse error before `,
' token
../../../dist/include/xprintutil/xprintutil.h:199: error: type specifier
omitted for parameter `XPContext'
../../../dist/include/xprintutil/xprintutil.h:199: error: parse error before `,
' token
../../../dist/include/xprintutil/xprintutil.h:200: error: type specifier
omitted for parameter `XPContext'
../../../dist/include/xprintutil/xprintutil.h:200: error: parse error before `,
' token
../../../dist/include/xprintutil/xprintutil.h:204: error: type specifier
omitted for parameter `XPContext'
../../../dist/include/xprintutil/xprintutil.h:204: error: parse error before `,
' token
../../../dist/include/xprintutil/xprintutil.h:205: error: parse error before `*
' token
../../../dist/include/xprintutil/xprintutil.h:208: error: type specifier
omitted for parameter `XPContext'
../../../dist/include/xprintutil/xprintutil.h:208: error: parse error before `)
' token
../../../dist/include/xprintutil/xprintutil.h:209: error: type specifier
omitted for parameter `XPContext'
../../../dist/include/xprintutil/xprintutil.h:209: error: parse error before `)
' token
../../../dist/include/xprintutil/xprintutil.h:210: error: type specifier
omitted for parameter `XPContext'
../../../dist/include/xprintutil/xprintutil.h:210: error: parse error before `)
' token
nsFontMetricsXlib.cpp: In member function `void nsFontXlib::LoadFont()':
nsFontMetricsXlib.cpp:2873: error: `XpGetContext' undeclared (first use this
function)
nsFontMetricsXlib.cpp:2873: error: (Each undeclared identifier is reported only
once for each function it appears in.)
nsFontMetricsXlib.cpp: In function `void
GetFontNames(nsFontMetricsXlibContext*, const char*, int, int,
nsFontNodeArrayXlib*)':
nsFontMetricsXlib.cpp:4549: error: `XpGetContext' undeclared (first use this
function)
gmake[4]: *** [nsFontMetricsXlib.o] Error 1
gmake[4]: Leaving directory `/home/ghoseb/src/cvs/gnome2/mozilla/gfx/src/xprint'
gmake[3]: *** [libs] Error 2
gmake[3]: Leaving directory `/home/ghoseb/src/cvs/gnome2/mozilla/gfx/src'
gmake[2]: *** [libs] Error 2
gmake[2]: Leaving directory `/home/ghoseb/src/cvs/gnome2/mozilla/gfx'
gmake[1]: *** [tier_9] Error 2
gmake[1]: Leaving directory `/home/ghoseb/src/cvs/gnome2/mozilla'
make: *** [default] Error 2