All pastes #143450 Raw Edit

Someone

public text v1 · immutable
#143450 ·published 2006-08-22 01:47 UTC
rendered paste body
make  all-recursive
make[1]: Entering directory `/root/k9copy-1.1.0-beta1'
Making all in k9vamps
make[2]: Entering directory `/root/k9copy-1.1.0-beta1/k9vamps'
if /bin/sh ../libtool --silent --mode=compile --tag=CXX g++ -DHAVE_CONFIG_H -I. -I. -I.. -I../libk9copy -I. -I/usr/include/kde -I/usr/share/qt3/include -I/usr/X11R6/include   -DQT_THREAD_SUPPORT  -D_REENTRANT  -Wnon-virtual-dtor -Wno-long-long -Wundef -Wall -W -Wpointer-arith -Wwrite-strings -ansi -D_XOPEN_SOURCE=500 -D_BSD_SOURCE -Wcast-align -Wconversion -Wchar-subscripts -O2 -Wformat-security -Wmissing-format-attribute -fno-exceptions -fno-check-new -fno-common  -MT k9vamps.lo -MD -MP -MF ".deps/k9vamps.Tpo" -c -o k9vamps.lo k9vamps.cpp; \
then mv -f ".deps/k9vamps.Tpo" ".deps/k9vamps.Plo"; else rm -f ".deps/k9vamps.Tpo"; exit 1; fi
In file included from k9vamps.h:15,
                 from k9vamps.cpp:13:
../libk9copy/k9common.h:28:31: dvdread/ifo_types.h: No such file or directory
../libk9copy/k9common.h:29:32: dvdread/dvd_reader.h: No such file or directory
../libk9copy/k9common.h:30:30: dvdread/ifo_read.h: No such file or directory
../libk9copy/k9common.h:31:31: dvdread/ifo_print.h: No such file or directory
../libk9copy/k9common.h:32:30: dvdread/nav_read.h: No such file or directory
../libk9copy/k9common.h:33:31: dvdread/nav_types.h: No such file or directory
In file included from ../libk9copy/k9dvdbackup.h:23,
                 from k9vamps.h:30,
                 from k9vamps.cpp:13:
../libk9copy/k9common.h:28:31: dvdread/ifo_types.h: No such file or directory
../libk9copy/k9common.h:29:32: dvdread/dvd_reader.h: No such file or directory
../libk9copy/k9common.h:30:30: dvdread/ifo_read.h: No such file or directory
../libk9copy/k9common.h:31:31: dvdread/ifo_print.h: No such file or directory
../libk9copy/k9common.h:32:30: dvdread/nav_read.h: No such file or directory
../libk9copy/k9common.h:33:31: dvdread/nav_types.h: No such file or directory
In file included from ../libk9copy/k9cell.h:23,
                 from ../libk9copy/k9dvdbackup.h:24,
                 from k9vamps.h:30,
                 from k9vamps.cpp:13:
../libk9copy/k9common.h:28:31: dvdread/ifo_types.h: No such file or directory
../libk9copy/k9common.h:29:32: dvdread/dvd_reader.h: No such file or directory
../libk9copy/k9common.h:30:30: dvdread/ifo_read.h: No such file or directory
../libk9copy/k9common.h:31:31: dvdread/ifo_print.h: No such file or directory
../libk9copy/k9common.h:32:30: dvdread/nav_read.h: No such file or directory
../libk9copy/k9common.h:33:31: dvdread/nav_types.h: No such file or directory
In file included from ../libk9copy/k9dvdtitle.h:23,
                 from ../libk9copy/k9cell.h:24,
                 from ../libk9copy/k9dvdbackup.h:24,
                 from k9vamps.h:30,
                 from k9vamps.cpp:13:
../libk9copy/k9common.h:28:31: dvdread/ifo_types.h: No such file or directory
../libk9copy/k9common.h:29:32: dvdread/dvd_reader.h: No such file or directory
../libk9copy/k9common.h:30:30: dvdread/ifo_read.h: No such file or directory
../libk9copy/k9common.h:31:31: dvdread/ifo_print.h: No such file or directory
../libk9copy/k9common.h:32:30: dvdread/nav_read.h: No such file or directory
../libk9copy/k9common.h:33:31: dvdread/nav_types.h: No such file or directory
In file included from ../libk9copy/k9dvd.h:22,
                 from ../libk9copy/k9dvdtitle.h:24,
                 from ../libk9copy/k9cell.h:24,
                 from ../libk9copy/k9dvdbackup.h:24,
                 from k9vamps.h:30,
                 from k9vamps.cpp:13:
../libk9copy/k9common.h:28:31: dvdread/ifo_types.h: No such file or directory
../libk9copy/k9common.h:29:32: dvdread/dvd_reader.h: No such file or directory
../libk9copy/k9common.h:30:30: dvdread/ifo_read.h: No such file or directory
../libk9copy/k9common.h:31:31: dvdread/ifo_print.h: No such file or directory
../libk9copy/k9common.h:32:30: dvdread/nav_read.h: No such file or directory
../libk9copy/k9common.h:33:31: dvdread/nav_types.h: No such file or directory
In file included from ../libk9copy/k9dvdread.h:14,
                 from ../libk9copy/k9dvd.h:23,
                 from ../libk9copy/k9dvdtitle.h:24,
                 from ../libk9copy/k9cell.h:24,
                 from ../libk9copy/k9dvdbackup.h:24,
                 from k9vamps.h:30,
                 from k9vamps.cpp:13:
../libk9copy/k9common.h:28:31: dvdread/ifo_types.h: No such file or directory
../libk9copy/k9common.h:29:32: dvdread/dvd_reader.h: No such file or directory
../libk9copy/k9common.h:30:30: dvdread/ifo_read.h: No such file or directory
../libk9copy/k9common.h:31:31: dvdread/ifo_print.h: No such file or directory
../libk9copy/k9common.h:32:30: dvdread/nav_read.h: No such file or directory
../libk9copy/k9common.h:33:31: dvdread/nav_types.h: No such file or directory
In file included from ../libk9copy/k9dvd.h:23,
                 from ../libk9copy/k9dvdtitle.h:24,
                 from ../libk9copy/k9cell.h:24,
                 from ../libk9copy/k9dvdbackup.h:24,
                 from k9vamps.h:30,
                 from k9vamps.cpp:13:
../libk9copy/k9dvdread.h:24: error: syntax error before `*' token
../libk9copy/k9dvdread.h:42: error: syntax error before `*' token
../libk9copy/k9dvdread.h:55: error: syntax error before `*' token
In file included from ../libk9copy/k9dvdtitle.h:24,
                 from ../libk9copy/k9cell.h:24,
                 from ../libk9copy/k9dvdbackup.h:24,
                 from k9vamps.h:30,
                 from k9vamps.cpp:13:
../libk9copy/k9dvd.h:148: error: `ifo_handle_t' was not declared in this scope
../libk9copy/k9dvd.h:148: error: `_ifo' was not declared in this scope
../libk9copy/k9dvd.h:148: error: parse error before `*' token
../libk9copy/k9dvd.h:151: error: `dvd_time_t' was not declared in this scope
../libk9copy/k9dvd.h:151: error: `dt' was not declared in this scope
../libk9copy/k9dvd.h:151: error: invalid data member initialization
../libk9copy/k9dvd.h:151: error: (use `=' to initialize static data members)
../libk9copy/k9dvd.h:157: error: `ifo_handle_t' was not declared in this scope
../libk9copy/k9dvd.h:157: error: `ifo' was not declared in this scope
../libk9copy/k9dvd.h:157: error: parse error before `,' token
In file included from ../libk9copy/k9cellcopylist.h:23,
                 from ../libk9copy/k9dvdbackup.h:25,
                 from k9vamps.h:30,
                 from k9vamps.cpp:13:
../libk9copy/k9common.h:28:31: dvdread/ifo_types.h: No such file or directory
../libk9copy/k9common.h:29:32: dvdread/dvd_reader.h: No such file or directory
../libk9copy/k9common.h:30:30: dvdread/ifo_read.h: No such file or directory
../libk9copy/k9common.h:31:31: dvdread/ifo_print.h: No such file or directory
../libk9copy/k9common.h:32:30: dvdread/nav_read.h: No such file or directory
../libk9copy/k9common.h:33:31: dvdread/nav_types.h: No such file or directory
In file included from ../libk9copy/k9ifo.h:22,
                 from ../libk9copy/k9dvdbackup.h:27,
                 from k9vamps.h:30,
                 from k9vamps.cpp:13:
../libk9copy/k9common.h:28:31: dvdread/ifo_types.h: No such file or directory
../libk9copy/k9common.h:29:32: dvdread/dvd_reader.h: No such file or directory
../libk9copy/k9common.h:30:30: dvdread/ifo_read.h: No such file or directory
../libk9copy/k9common.h:31:31: dvdread/ifo_print.h: No such file or directory
../libk9copy/k9common.h:32:30: dvdread/nav_read.h: No such file or directory
../libk9copy/k9common.h:33:31: dvdread/nav_types.h: No such file or directory
In file included from ../libk9copy/k9dvdbackup.h:27,
                 from k9vamps.h:30,
                 from k9vamps.cpp:13:
../libk9copy/k9ifo.h:38: error: syntax error before `*' token
../libk9copy/k9ifo.h:41: error: syntax error before `*' token
../libk9copy/k9ifo.h:42: error: `pci_t' was not declared in this scope
../libk9copy/k9ifo.h:42: error: `pci' was not declared in this scope
../libk9copy/k9ifo.h:42: error: parse error before `*' token
../libk9copy/k9ifo.h:46: error: syntax error before `*' token
../libk9copy/k9ifo.h:57: error: type specifier omitted for parameter `
   pgc_command_tbl_t'
../libk9copy/k9ifo.h:57: error: parse error before `*' token
../libk9copy/k9ifo.h:58: error: type specifier omitted for parameter `
   pgc_program_map_t'
../libk9copy/k9ifo.h:58: error: parse error before `*' token
../libk9copy/k9ifo.h:59: error: type specifier omitted for parameter `
   cell_playback_t'
../libk9copy/k9ifo.h:59: error: parse error before `*' token
../libk9copy/k9ifo.h:60: error: type specifier omitted for parameter `
   cell_position_t'
../libk9copy/k9ifo.h:60: error: parse error before `*' token
../libk9copy/k9ifo.h:61: error: type specifier omitted for parameter `pgc_t'
../libk9copy/k9ifo.h:61: error: parse error before `*' token
../libk9copy/k9ifo.h:70: error: type specifier omitted for parameter `pgcit_t'
../libk9copy/k9ifo.h:70: error: parse error before `*' token
../libk9copy/k9ifo.h:74: error: type specifier omitted for parameter `c_adt_t'
../libk9copy/k9ifo.h:74: error: parse error before `*' token
../libk9copy/k9ifo.h:75: error: type specifier omitted for parameter `
   vobu_admap_t'
../libk9copy/k9ifo.h:75: error: parse error before `*' token
In file included from k9vamps.h:30,
                 from k9vamps.cpp:13:
../libk9copy/k9dvdbackup.h:58: error: `cell_adr_t' was not declared in this
   scope
../libk9copy/k9dvdbackup.h:58: error: template argument 1 is invalid
../libk9copy/k9dvdbackup.h:58: error: invalid base-class specification
../libk9copy/k9dvdbackup.h:94: error: syntax error before `*' token
../libk9copy/k9dvdbackup.h:113: error: `ifo_handle_t' was not declared in this
   scope
../libk9copy/k9dvdbackup.h:113: error: `_hifo' was not declared in this scope
../libk9copy/k9dvdbackup.h:113: error: invalid data member initialization
../libk9copy/k9dvdbackup.h:113: error: variable or field `updatePgci_ut'
   declared void
../libk9copy/k9dvdbackup.h:114: error: `ifo_handle_t' was not declared in this
   scope
../libk9copy/k9dvdbackup.h:114: error: `_hifo' was not declared in this scope
../libk9copy/k9dvdbackup.h:114: error: invalid data member initialization
../libk9copy/k9dvdbackup.h:114: error: variable or field `update4Menu' declared
   void
In file included from k9requant.h:14,
                 from k9vamps.h:31,
                 from k9vamps.cpp:13:
../libk9copy/k9common.h:28:31: dvdread/ifo_types.h: No such file or directory
../libk9copy/k9common.h:29:32: dvdread/dvd_reader.h: No such file or directory
../libk9copy/k9common.h:30:30: dvdread/ifo_read.h: No such file or directory
../libk9copy/k9common.h:31:31: dvdread/ifo_print.h: No such file or directory
../libk9copy/k9common.h:32:30: dvdread/nav_read.h: No such file or directory
../libk9copy/k9common.h:33:31: dvdread/nav_types.h: No such file or directory
In file included from ac.h:30,
                 from k9vamps.cpp:15:
../libk9copy/k9common.h:28:31: dvdread/ifo_types.h: No such file or directory
../libk9copy/k9common.h:29:32: dvdread/dvd_reader.h: No such file or directory
../libk9copy/k9common.h:30:30: dvdread/ifo_read.h: No such file or directory
../libk9copy/k9common.h:31:31: dvdread/ifo_print.h: No such file or directory
../libk9copy/k9common.h:32:30: dvdread/nav_read.h: No such file or directory
../libk9copy/k9common.h:33:31: dvdread/nav_types.h: No such file or directory
k9vamps.cpp: In member function `virtual void k9vamps::run()':
k9vamps.cpp:215: warning: deprecated conversion from string constant to `char*'
k9vamps.cpp: In member function `int k9vamps::lock(int)':
k9vamps.cpp:275: warning: deprecated conversion from string constant to `char*'
k9vamps.cpp: In member function `void k9vamps::copy(int)':
k9vamps.cpp:290: warning: deprecated conversion from string constant to `char*'
k9vamps.cpp: In member function `int k9vamps::check_video_packet(uchar*)':
k9vamps.cpp:387: warning: deprecated conversion from string constant to `char*'
k9vamps.cpp:394: warning: deprecated conversion from string constant to `char*'
k9vamps.cpp:399: warning: deprecated conversion from string constant to `char*'
k9vamps.cpp:429: warning: deprecated conversion from string constant to `char*'
k9vamps.cpp:439: warning: deprecated conversion from string constant to `char*'
k9vamps.cpp: In member function `int k9vamps::new_private_1_type(uchar*)':
k9vamps.cpp:535: warning: deprecated conversion from string constant to `char*'
k9vamps.cpp: In member function `void k9vamps::vap_leader()':
k9vamps.cpp:658: warning: deprecated conversion from string constant to `char*'
k9vamps.cpp: In member function `void k9vamps::vap_trailer(int)':
k9vamps.cpp:702: warning: deprecated conversion from string constant to `char*'
k9vamps.cpp: In member function `int k9vamps::vap_phase1()':
k9vamps.cpp:765: warning: comparison between signed and unsigned integer
   expressions
k9vamps.cpp:775: warning: deprecated conversion from string constant to `char*'
k9vamps.cpp:823: warning: deprecated conversion from string constant to `char*'
k9vamps.cpp: In member function `void k9vamps::vap_phase2(int)':
k9vamps.cpp:960: warning: deprecated conversion from string constant to `char*'
k9vamps.cpp: In member function `void k9vamps::fatal(char*, ...)':
k9vamps.cpp:1093: warning: function might be possible candidate for `printf'
   format attribute
make[2]: *** [k9vamps.lo] Error 1
make[2]: Leaving directory `/root/k9copy-1.1.0-beta1/k9vamps'
make[1]: *** [all-recursive] Error 1
make[1]: Leaving directory `/root/k9copy-1.1.0-beta1'
make: *** [all] Error 2