rendered paste bodyccache arm-linux-g++ -march=armv5te -mtune=xscale -DHAVE_CONFIG_H -I. -I/home/enpsgp/dev/build/tmp/work/giac-0.5.0-r0/giac-0.5.0/src -I.. -I/home/enpsgp/dev/build/tmp/work/giac-0.5.0-r0/giac-0.5.0/src -I/home/enpsgp/dev/build/tmp/work/giac-0.5.0-r0/giac-0.5.0 -I/home/enpsgp/dev/build/tmp/staging/arm-linux/include -I/home/enpsgp/dev/build/tmp/staging/arm-linux/include -fexpensive-optimizations -fomit-frame-pointer -frename-registers -O2 -fpermissive -c sheet.cc
| In file included from plotfltk.h:5,
| from xcas.h:9,
| from sheet.cc:45:
| plot.h:38: error: multiple definition of `enum Fl_Color'
| /home/enpsgp/dev/build/tmp/staging/arm-linux/include/FL/Enumerations.H:286: error: previous definition here
| plot.h:39: error: conflicting declaration 'FL_BLACK'
| /home/enpsgp/dev/build/tmp/staging/arm-linux/include/FL/Enumerations.H:305: error: 'FL_BLACK' has a previous declaration as `Fl_Color FL_BLACK'
| plot.h:39: error: declaration of `FL_BLACK'
| /home/enpsgp/dev/build/tmp/staging/arm-linux/include/FL/Enumerations.H:305: error: conflicts with previous declaration `Fl_Color FL_BLACK'
| plot.h:40: error: conflicting declaration 'FL_RED'
| /home/enpsgp/dev/build/tmp/staging/arm-linux/include/FL/Enumerations.H:306: error: 'FL_RED' has a previous declaration as `Fl_Color FL_RED'
| plot.h:40: error: declaration of `FL_RED'
| /home/enpsgp/dev/build/tmp/staging/arm-linux/include/FL/Enumerations.H:306: error: conflicts with previous declaration `Fl_Color FL_RED'
| plot.h:41: error: conflicting declaration 'FL_GREEN'
| /home/enpsgp/dev/build/tmp/staging/arm-linux/include/FL/Enumerations.H:307: error: 'FL_GREEN' has a previous declaration as `Fl_Color FL_GREEN'
| plot.h:41: error: declaration of `FL_GREEN'
| /home/enpsgp/dev/build/tmp/staging/arm-linux/include/FL/Enumerations.H:307: error: conflicts with previous declaration `Fl_Color FL_GREEN'
| plot.h:42: error: conflicting declaration 'FL_YELLOW'
| /home/enpsgp/dev/build/tmp/staging/arm-linux/include/FL/Enumerations.H:308: error: 'FL_YELLOW' has a previous declaration as `Fl_Color FL_YELLOW'
| plot.h:42: error: declaration of `FL_YELLOW'
| /home/enpsgp/dev/build/tmp/staging/arm-linux/include/FL/Enumerations.H:308: error: conflicts with previous declaration `Fl_Color FL_YELLOW'
| plot.h:43: error: conflicting declaration 'FL_BLUE'
| /home/enpsgp/dev/build/tmp/staging/arm-linux/include/FL/Enumerations.H:309: error: 'FL_BLUE' has a previous declaration as `Fl_Color FL_BLUE'
| plot.h:43: error: declaration of `FL_BLUE'
| /home/enpsgp/dev/build/tmp/staging/arm-linux/include/FL/Enumerations.H:309: error: conflicts with previous declaration `Fl_Color FL_BLUE'
| plot.h:44: error: conflicting declaration 'FL_MAGENTA'
| /home/enpsgp/dev/build/tmp/staging/arm-linux/include/FL/Enumerations.H:310: error: 'FL_MAGENTA' has a previous declaration as `Fl_Color FL_MAGENTA'
| plot.h:44: error: declaration of `FL_MAGENTA'
| /home/enpsgp/dev/build/tmp/staging/arm-linux/include/FL/Enumerations.H:310: error: conflicts with previous declaration `Fl_Color FL_MAGENTA'
| plot.h:45: error: conflicting declaration 'FL_CYAN'
| /home/enpsgp/dev/build/tmp/staging/arm-linux/include/FL/Enumerations.H:311: error: 'FL_CYAN' has a previous declaration as `Fl_Color FL_CYAN'
| plot.h:45: error: declaration of `FL_CYAN'
| /home/enpsgp/dev/build/tmp/staging/arm-linux/include/FL/Enumerations.H:311: error: conflicts with previous declaration `Fl_Color FL_CYAN'
| plot.h:46: error: conflicting declaration 'FL_WHITE'
| /home/enpsgp/dev/build/tmp/staging/arm-linux/include/FL/Enumerations.H:321: error: 'FL_WHITE' has a previous declaration as `Fl_Color FL_WHITE'
| plot.h:46: error: declaration of `FL_WHITE'
| /home/enpsgp/dev/build/tmp/staging/arm-linux/include/FL/Enumerations.H:321: error: conflicts with previous declaration `Fl_Color FL_WHITE'
| plot.h:47: error: conflicting declaration 'FL_INACTIVE_COLOR'
| /home/enpsgp/dev/build/tmp/staging/arm-linux/include/FL/Enumerations.H:290: error: 'FL_INACTIVE_COLOR' has a previous declaration as `Fl_Color FL_INACTIVE_COLOR'
| plot.h:47: error: declaration of `FL_INACTIVE_COLOR'
| /home/enpsgp/dev/build/tmp/staging/arm-linux/include/FL/Enumerations.H:290: error: conflicts with previous declaration `Fl_Color FL_INACTIVE_COLOR'
| plot.h:48: error: conflicting declaration 'FL_SELECTION_COLOR'
| /home/enpsgp/dev/build/tmp/staging/arm-linux/include/FL/Enumerations.H:291: error: 'FL_SELECTION_COLOR' has a previous declaration as `Fl_Color FL_SELECTION_COLOR'
| plot.h:48: error: declaration of `FL_SELECTION_COLOR'
| /home/enpsgp/dev/build/tmp/staging/arm-linux/include/FL/Enumerations.H:291: error: conflicts with previous declaration `Fl_Color FL_SELECTION_COLOR'
| plot.h:50: error: expected identifier before '(' token
| plot.h:50: error: expected `}' before '(' token
| plot.h:50: error: expected init-declarator before numeric constant
| plot.h:50: error: expected `,' or `;' before numeric constant
| plot.h:66: error: expected declaration before '}' token
| make[2]: *** [sheet.o] Error 1
| make[2]: Leaving directory `/home/enpsgp/dev/build/tmp/work/giac-0.5.0-r0/giac-0.5.0/src'
| make[1]: *** [all-recursive] Error 1
| make[1]: Leaving directory `/home/enpsgp/dev/build/tmp/work/giac-0.5.0-r0/giac-0.5.0'
| make: *** [all-recursive-am] Error 2
| FATAL: oe_runmake failed
NOTE: Task failed:
NOTE: package giac-0.5.0-r0: task do_compile: failed
ERROR: TaskFailed event exception, aborting
NOTE: package giac-0.5.0: failed
ERROR: Build of giac failed