In file included from modperl_common_includes.h:23,
from mod_perl.h:20,
from mod_perl.c:16:
modperl_perl_includes.h:64:20: error: EXTERN.h: No such file or directory
In file included from modperl_perl_includes.h:65,
from modperl_common_includes.h:23,
from mod_perl.h:20,
from mod_perl.c:16:
/usr/lib/perl5/5.8.7/i386-linux/CORE/perl.h:718:21: error: embed.h: No such file or directory
/usr/lib/perl5/5.8.7/i386-linux/CORE/perl.h:2056:19: error: handy.h: No such file or directory
/usr/lib/perl5/5.8.7/i386-linux/CORE/perl.h:2220:24: error: unixish.h: No such file or directory
In file included from modperl_perl_includes.h:65,
from modperl_common_includes.h:23,
from mod_perl.h:20,
from mod_perl.c:16:
/usr/lib/perl5/5.8.7/i386-linux/CORE/perl.h:2541: error: syntax error before 'I32'
/usr/lib/perl5/5.8.7/i386-linux/CORE/perl.h:2541: warning: no semicolon at end of struct or union
/usr/lib/perl5/5.8.7/i386-linux/CORE/perl.h:2544: error: syntax error before 'any_bool'
/usr/lib/perl5/5.8.7/i386-linux/CORE/perl.h:2544: warning: data definition has no type or storage class
/usr/lib/perl5/5.8.7/i386-linux/CORE/perl.h:2547: error: syntax error before '}' token
/usr/lib/perl5/5.8.7/i386-linux/CORE/perl.h:2556: error: syntax error before '*' token
/usr/lib/perl5/5.8.7/i386-linux/CORE/perl.h:2556: error: 'I32' declared as function returning a function
/usr/lib/perl5/5.8.7/i386-linux/CORE/perl.h:2579:24: error: iperlsys.h: No such file or directory
In file included from /usr/lib/perl5/5.8.7/i386-linux/CORE/perl.h:2592,
from modperl_perl_includes.h:65,
from modperl_common_includes.h:23,
from mod_perl.h:20,
from mod_perl.c:16:
/usr/include/regexp.h: In function 'compile':
/usr/include/regexp.h:115: error: 'INIT' undeclared (first use in this function)
/usr/include/regexp.h:115: error: (Each undeclared identifier is reported only once
/usr/include/regexp.h:115: error: for each function it appears in.)
/usr/include/regexp.h:115: error: syntax error before 'regex_t'
/usr/include/regexp.h:129: error: '__expr_ptr' undeclared (first use in this function)
/usr/lib/perl5/5.8.7/i386-linux/CORE/perl.h:2593:16: error: sv.h: No such file or directory
/usr/lib/perl5/5.8.7/i386-linux/CORE/perl.h:2594:18: error: util.h: No such file or directory
/usr/lib/perl5/5.8.7/i386-linux/CORE/perl.h:2596:16: error: gv.h: No such file or directory
/usr/lib/perl5/5.8.7/i386-linux/CORE/perl.h:2597:17: error: pad.h: No such file or directory
/usr/lib/perl5/5.8.7/i386-linux/CORE/perl.h:2598:16: error: cv.h: No such file or directory
/usr/lib/perl5/5.8.7/i386-linux/CORE/perl.h:2599:21: error: opnames.h: No such file or directory
/usr/lib/perl5/5.8.7/i386-linux/CORE/perl.h:2600:16: error: op.h: No such file or directory
/usr/lib/perl5/5.8.7/i386-linux/CORE/perl.h:2601:17: error: cop.h: No such file or directory
/usr/lib/perl5/5.8.7/i386-linux/CORE/perl.h:2602:16: error: av.h: No such file or directory
/usr/lib/perl5/5.8.7/i386-linux/CORE/perl.h:2603:16: error: hv.h: No such file or directory
/usr/lib/perl5/5.8.7/i386-linux/CORE/perl.h:2604:16: error: mg.h: No such file or directory
/usr/lib/perl5/5.8.7/i386-linux/CORE/perl.h:2605:19: error: scope.h: No such file or directory
/usr/lib/perl5/5.8.7/i386-linux/CORE/perl.h:2606:22: error: warnings.h: No such file or directory
/usr/lib/perl5/5.8.7/i386-linux/CORE/perl.h:2607:18: error: utf8.h: No such file or directory
In file included from modperl_perl_includes.h:65,
from modperl_common_includes.h:23,
from mod_perl.h:20,
from mod_perl.c:16:
/usr/lib/perl5/5.8.7/i386-linux/CORE/perl.h: At top level:
/usr/lib/perl5/5.8.7/i386-linux/CORE/perl.h:2617: error: syntax error before 'regnode'
/usr/lib/perl5/5.8.7/i386-linux/CORE/perl.h:2617: warning: no semicolon at end of struct or union
/usr/lib/perl5/5.8.7/i386-linux/CORE/perl.h:2618: warning: data definition has no type or storage class
/usr/lib/perl5/5.8.7/i386-linux/CORE/perl.h:2621: error: syntax error before '}' token
/usr/lib/perl5/5.8.7/i386-linux/CORE/perl.h:2625: error: field 'super_state' declared as a function
/usr/lib/perl5/5.8.7/i386-linux/CORE/perl.h:2626: error: field 'sub_inwhat' declared as a function
/usr/lib/perl5/5.8.7/i386-linux/CORE/perl.h:3043: error: 'uf_val' declared as function returning a function
/usr/lib/perl5/5.8.7/i386-linux/CORE/perl.h:3044: error: 'uf_set' declared as function returning a function
In file included from modperl_perl_includes.h:65,
from modperl_common_includes.h:23,
from mod_perl.h:20,
from mod_perl.c:16:
/usr/lib/perl5/5.8.7/i386-linux/CORE/perl.h:3295: error: syntax error before 'char'
/usr/lib/perl5/5.8.7/i386-linux/CORE/perl.h:3296: error: syntax error before 'INIT'
/usr/lib/perl5/5.8.7/i386-linux/CORE/perl.h:3296: warning: data definition has no type or storage class
/usr/lib/perl5/5.8.7/i386-linux/CORE/perl.h:3297: error: syntax error before 'char'
/usr/lib/perl5/5.8.7/i386-linux/CORE/perl.h:3298: error: syntax error before 'INIT'
/usr/lib/perl5/5.8.7/i386-linux/CORE/perl.h:3298: warning: data definition has no type or storage class
/usr/lib/perl5/5.8.7/i386-linux/CORE/perl.h:3299: error: syntax error before 'char'
/usr/lib/perl5/5.8.7/i386-linux/CORE/perl.h:3300: error: syntax error before 'INIT'
/usr/lib/perl5/5.8.7/i386-linux/CORE/perl.h:3300: warning: data definition has no type or storage class
/usr/lib/perl5/5.8.7/i386-linux/CORE/perl.h:3301: error: syntax error before 'char'
/usr/lib/perl5/5.8.7/i386-linux/CORE/perl.h:3302: error: syntax error before 'INIT'
/usr/lib/perl5/5.8.7/i386-linux/CORE/perl.h:3302: warning: data definition has no type or storage class
/usr/lib/perl5/5.8.7/i386-linux/CORE/perl.h:3303: error: syntax error before 'char'
/usr/lib/perl5/5.8.7/i386-linux/CORE/perl.h:3304: error: syntax error before 'INIT'
/usr/lib/perl5/5.8.7/i386-linux/CORE/perl.h:3304: warning: data definition has no type or storage class
/usr/lib/perl5/5.8.7/i386-linux/CORE/perl.h:3305: error: syntax error before 'char'
/usr/lib/perl5/5.8.7/i386-linux/CORE/perl.h:3306: error: syntax error before 'INIT'
/usr/lib/perl5/5.8.7/i386-linux/CORE/perl.h:3306: warning: data definition has no type or storage class
/usr/lib/perl5/5.8.7/i386-linux/CORE/perl.h:3307: error: syntax error before 'char'
/usr/lib/perl5/5.8.7/i386-linux/CORE/perl.h:3308: error: syntax error before 'INIT'
/usr/lib/perl5/5.8.7/i386-linux/CORE/perl.h:3308: warning: data definition has no type or storage class
/usr/lib/perl5/5.8.7/i386-linux/CORE/perl.h:3309: error: syntax error before 'char'
/usr/lib/perl5/5.8.7/i386-linux/CORE/perl.h:3310: error: syntax error before 'INIT'
/usr/lib/perl5/5.8.7/i386-linux/CORE/perl.h:3310: warning: data definition has no type or storage class
/usr/lib/perl5/5.8.7/i386-linux/CORE/perl.h:3311: error: syntax error before 'char'
/usr/lib/perl5/5.8.7/i386-linux/CORE/perl.h:3312: error: syntax error before 'INIT'
/usr/lib/perl5/5.8.7/i386-linux/CORE/perl.h:3312: warning: data definition has no type or storage class
/usr/lib/perl5/5.8.7/i386-linux/CORE/perl.h:3313: error: syntax error before 'char'
/usr/lib/perl5/5.8.7/i386-linux/CORE/perl.h:3314: error: syntax error before 'INIT'
/usr/lib/perl5/5.8.7/i386-linux/CORE/perl.h:3314: warning: data definition has no type or storage class
/usr/lib/perl5/5.8.7/i386-linux/CORE/perl.h:3315: error: syntax error before 'char'
/usr/lib/perl5/5.8.7/i386-linux/CORE/perl.h:3316: error: syntax error before 'INIT'
/usr/lib/perl5/5.8.7/i386-linux/CORE/perl.h:3316: warning: data definition has no type or storage class
/usr/lib/perl5/5.8.7/i386-linux/CORE/perl.h:3317: error: syntax error before 'char'
/usr/lib/perl5/5.8.7/i386-linux/CORE/perl.h:3318: error: syntax error before 'INIT'
/usr/lib/perl5/5.8.7/i386-linux/CORE/perl.h:3318: warning: data definition has no type or storage class
/usr/lib/perl5/5.8.7/i386-linux/CORE/perl.h:3319: error: syntax error before 'char'
/usr/lib/perl5/5.8.7/i386-linux/CORE/perl.h:3320: error: syntax error before 'INIT'
/usr/lib/perl5/5.8.7/i386-linux/CORE/perl.h:3320: warning: data definition has no type or storage class
/usr/lib/perl5/5.8.7/i386-linux/CORE/perl.h:3321: error: syntax error before 'char'
/usr/lib/perl5/5.8.7/i386-linux/CORE/perl.h:3322: error: syntax error before 'INIT'
/usr/lib/perl5/5.8.7/i386-linux/CORE/perl.h:3322: warning: data definition has no type or storage class
/usr/lib/perl5/5.8.7/i386-linux/CORE/perl.h:3323: error: syntax error before 'char'
/usr/lib/perl5/5.8.7/i386-linux/CORE/perl.h:3324: error: syntax error before 'INIT'
/usr/lib/perl5/5.8.7/i386-linux/CORE/perl.h:3324: warning: data definition has no type or storage class
/usr/lib/perl5/5.8.7/i386-linux/CORE/perl.h:3325: error: syntax error before 'char'
/usr/lib/perl5/5.8.7/i386-linux/CORE/perl.h:3326: error: syntax error before 'INIT'
/usr/lib/perl5/5.8.7/i386-linux/CORE/perl.h:3326: warning: data definition has no type or storage class
/usr/lib/perl5/5.8.7/i386-linux/CORE/perl.h:3327: error: syntax error before 'char'
/usr/lib/perl5/5.8.7/i386-linux/CORE/perl.h:3328: error: syntax error before 'INIT'
/usr/lib/perl5/5.8.7/i386-linux/CORE/perl.h:3328: warning: data definition has no type or storage class
/usr/lib/perl5/5.8.7/i386-linux/CORE/perl.h:3330: error: syntax error before 'char'
/usr/lib/perl5/5.8.7/i386-linux/CORE/perl.h:3331: error: syntax error before 'INIT'
/usr/lib/perl5/5.8.7/i386-linux/CORE/perl.h:3331: warning: data definition has no type or storage class
/usr/lib/perl5/5.8.7/i386-linux/CORE/perl.h:3334: error: syntax error before 'char'
/usr/lib/perl5/5.8.7/i386-linux/CORE/perl.h:3335: error: syntax error before 'INIT'
/usr/lib/perl5/5.8.7/i386-linux/CORE/perl.h:3335: warning: data definition has no type or storage class
/usr/lib/perl5/5.8.7/i386-linux/CORE/perl.h:3342: error: syntax error before 'char'
/usr/lib/perl5/5.8.7/i386-linux/CORE/perl.h:3343: error: syntax error before 'int'
/usr/lib/perl5/5.8.7/i386-linux/CORE/perl.h:3421: error: syntax error before 'unsigned'
/usr/lib/perl5/5.8.7/i386-linux/CORE/perl.h:3460: error: syntax error before 'unsigned'
/usr/lib/perl5/5.8.7/i386-linux/CORE/perl.h:3536: error: syntax error before 'unsigned'
/usr/lib/perl5/5.8.7/i386-linux/CORE/perl.h:3571:19: error: perly.h: No such file or directory
/usr/lib/perl5/5.8.7/i386-linux/CORE/perl.h:3668: error: array type has incomplete element type
/usr/lib/perl5/5.8.7/i386-linux/CORE/perl.h:3676: error: syntax error before '*' token
/usr/lib/perl5/5.8.7/i386-linux/CORE/perl.h:3676: warning: data definition has no type or storage class
/usr/lib/perl5/5.8.7/i386-linux/CORE/perl.h:3677: error: syntax error before '*' token
/usr/lib/perl5/5.8.7/i386-linux/CORE/perl.h:3679: error: 'regexec_t' declared as function returning a function
/usr/lib/perl5/5.8.7/i386-linux/CORE/perl.h:3680: error: syntax error before '*' token
/usr/lib/perl5/5.8.7/i386-linux/CORE/perl.h:3684: error: syntax error before '*' token
/usr/lib/perl5/5.8.7/i386-linux/CORE/perl.h:3690: error: 'SVCOMPARE_t' declared as function returning a function
/usr/lib/perl5/5.8.7/i386-linux/CORE/perl.h:3784: error: field 'code' declared as a function
/usr/lib/perl5/5.8.7/i386-linux/CORE/perl.h:3785: error: field 'length' declared as a function
/usr/lib/perl5/5.8.7/i386-linux/CORE/perl.h:3788: error: syntax error before 'U32'
/usr/lib/perl5/5.8.7/i386-linux/CORE/perl.h:3788: warning: no semicolon at end of struct or union
/usr/lib/perl5/5.8.7/i386-linux/CORE/perl.h:3790: warning: data definition has no type or storage class
/usr/lib/perl5/5.8.7/i386-linux/CORE/perl.h:3792:20: error: thread.h: No such file or directory
/usr/lib/perl5/5.8.7/i386-linux/CORE/perl.h:3793:16: error: pp.h: No such file or directory
/usr/lib/perl5/5.8.7/i386-linux/CORE/perl.h:3813:19: error: proto.h: No such file or directory
/usr/lib/perl5/5.8.7/i386-linux/CORE/perl.h:3816:20: error: opcode.h: No such file or directory
/usr/lib/perl5/5.8.7/i386-linux/CORE/perl.h:3821:24: error: embedvar.h: No such file or directory
/usr/lib/perl5/5.8.7/i386-linux/CORE/perl.h:3836:24: error: intrpvar.h: No such file or directory
/usr/lib/perl5/5.8.7/i386-linux/CORE/perl.h:3838:25: error: thrdvar.h: No such file or directory
/usr/lib/perl5/5.8.7/i386-linux/CORE/perl.h:3851:24: error: perlvars.h: No such file or directory
/usr/lib/perl5/5.8.7/i386-linux/CORE/perl.h:3856:22: error: reentr.inc: No such file or directory
/usr/lib/perl5/5.8.7/i386-linux/CORE/perl.h:3967: error: syntax error before 'MGVTBL'
/usr/lib/perl5/5.8.7/i386-linux/CORE/perl.h:3968: error: syntax error before 'MGVTBL'
/usr/lib/perl5/5.8.7/i386-linux/CORE/perl.h:3969: error: syntax error before 'MGVTBL'
/usr/lib/perl5/5.8.7/i386-linux/CORE/perl.h:3970: error: syntax error before 'MGVTBL'
/usr/lib/perl5/5.8.7/i386-linux/CORE/perl.h:3971: error: syntax error before 'MGVTBL'
/usr/lib/perl5/5.8.7/i386-linux/CORE/perl.h:3972: error: syntax error before 'MGVTBL'
/usr/lib/perl5/5.8.7/i386-linux/CORE/perl.h:3973: error: syntax error before 'MGVTBL'
/usr/lib/perl5/5.8.7/i386-linux/CORE/perl.h:3974: error: syntax error before 'MGVTBL'
/usr/lib/perl5/5.8.7/i386-linux/CORE/perl.h:3975: error: syntax error before 'MGVTBL'
/usr/lib/perl5/5.8.7/i386-linux/CORE/perl.h:3976: error: syntax error before 'MGVTBL'
/usr/lib/perl5/5.8.7/i386-linux/CORE/perl.h:3977: error: syntax error before 'MGVTBL'
/usr/lib/perl5/5.8.7/i386-linux/CORE/perl.h:3978: error: syntax error before 'MGVTBL'
/usr/lib/perl5/5.8.7/i386-linux/CORE/perl.h:3979: error: syntax error before 'MGVTBL'
/usr/lib/perl5/5.8.7/i386-linux/CORE/perl.h:3980: error: syntax error before 'MGVTBL'
/usr/lib/perl5/5.8.7/i386-linux/CORE/perl.h:3981: error: syntax error before 'MGVTBL'
/usr/lib/perl5/5.8.7/i386-linux/CORE/perl.h:3982: error: syntax error before 'MGVTBL'
/usr/lib/perl5/5.8.7/i386-linux/CORE/perl.h:3983: error: syntax error before 'MGVTBL'
/usr/lib/perl5/5.8.7/i386-linux/CORE/perl.h:3984: error: syntax error before 'MGVTBL'
/usr/lib/perl5/5.8.7/i386-linux/CORE/perl.h:3985: error: syntax error before 'MGVTBL'
/usr/lib/perl5/5.8.7/i386-linux/CORE/perl.h:3986: error: syntax error before 'MGVTBL'
/usr/lib/perl5/5.8.7/i386-linux/CORE/perl.h:3987: error: syntax error before 'MGVTBL'
/usr/lib/perl5/5.8.7/i386-linux/CORE/perl.h:3988: error: syntax error before 'MGVTBL'
/usr/lib/perl5/5.8.7/i386-linux/CORE/perl.h:3994: error: syntax error before 'MGVTBL'
/usr/lib/perl5/5.8.7/i386-linux/CORE/perl.h:3995: error: syntax error before 'MGVTBL'
/usr/lib/perl5/5.8.7/i386-linux/CORE/perl.h:3996: error: syntax error before 'MGVTBL'
/usr/lib/perl5/5.8.7/i386-linux/CORE/perl.h:3997: error: syntax error before 'MGVTBL'
/usr/lib/perl5/5.8.7/i386-linux/CORE/perl.h:4000: error: syntax error before 'MGVTBL'
/usr/lib/perl5/5.8.7/i386-linux/CORE/perl.h:4003: error: syntax error before 'MGVTBL'
/usr/lib/perl5/5.8.7/i386-linux/CORE/perl.h:4004: error: syntax error before 'MGVTBL'
/usr/lib/perl5/5.8.7/i386-linux/CORE/perl.h:4006: error: syntax error before 'MGVTBL'
/usr/lib/perl5/5.8.7/i386-linux/CORE/perl.h:4007: error: syntax error before 'MGVTBL'
/usr/lib/perl5/5.8.7/i386-linux/CORE/perl.h:4094: error: syntax error before 'char'
/usr/lib/perl5/5.8.7/i386-linux/CORE/perl.h:4100: error: syntax error before 'U32'
/usr/lib/perl5/5.8.7/i386-linux/CORE/perl.h:4100: warning: no semicolon at end of struct or union
/usr/lib/perl5/5.8.7/i386-linux/CORE/perl.h:4102: error: syntax error before 'flags'
/usr/lib/perl5/5.8.7/i386-linux/CORE/perl.h:4102: warning: data definition has no type or storage class
/usr/lib/perl5/5.8.7/i386-linux/CORE/perl.h:4105: error: syntax error before '}' token
/usr/lib/perl5/5.8.7/i386-linux/CORE/perl.h:4107: error: syntax error before 'U32'
/usr/lib/perl5/5.8.7/i386-linux/CORE/perl.h:4107: warning: no semicolon at end of struct or union
/usr/lib/perl5/5.8.7/i386-linux/CORE/perl.h:4109: error: syntax error before 'flags'
/usr/lib/perl5/5.8.7/i386-linux/CORE/perl.h:4109: warning: data definition has no type or storage class
/usr/lib/perl5/5.8.7/i386-linux/CORE/perl.h:4738:24: error: patchlevel.h: No such file or directory
In file included from modperl_common_includes.h:23,
from mod_perl.h:20,
from mod_perl.c:16:
modperl_perl_includes.h:66:18: error: XSUB.h: No such file or directory
In file included from mod_perl.h:32,
from mod_perl.c:16:
modperl_flags.h:309: error: syntax error before 'modperl_flags_lookup_dir'
modperl_flags.h:309: warning: data definition has no type or storage class
modperl_flags.h:514: error: syntax error before 'modperl_flags_lookup_srv'
modperl_flags.h:514: warning: data definition has no type or storage class
In file included from mod_perl.h:34,
from mod_perl.c:16:
modperl_perl_global.h:29: error: field 'len' declared as a function
modperl_perl_global.h:30: error: syntax error before 'U32'
modperl_perl_global.h:30: warning: no semicolon at end of struct or union
modperl_perl_global.h:31: warning: data definition has no type or storage class
modperl_perl_global.h:62: error: field 'cur' declared as a function
modperl_perl_global.h:75: error: syntax error before '*' token
modperl_perl_global.h:75: warning: data definition has no type or storage class
modperl_perl_global.h:81: error: syntax error before '*' token
modperl_perl_global.h:84: error: syntax error before '*' token
modperl_perl_global.h:87: error: syntax error before '*' token
In file included from mod_perl.h:37,
from mod_perl.c:16:
modperl_const.h:25: warning: parameter names (without types) in function declaration
modperl_const.h:25: warning: data definition has no type or storage class
In file included from mod_perl.h:71,
from mod_perl.c:16:
modperl_types.h:109: error: syntax error before 'modperl_opts_t'
modperl_types.h:109: warning: data definition has no type or storage class
modperl_types.h:112: error: syntax error before 'modperl_opts_t'
modperl_types.h:112: warning: no semicolon at end of struct or union
modperl_types.h:113: warning: data definition has no type or storage class
modperl_types.h:114: error: syntax error before 'opts_remove'
modperl_types.h:114: warning: data definition has no type or storage class
modperl_types.h:115: error: syntax error before 'opts_override'
modperl_types.h:115: warning: data definition has no type or storage class
modperl_types.h:116: error: syntax error before 'opts_seen'
modperl_types.h:116: warning: data definition has no type or storage class
modperl_types.h:118: error: syntax error before '}' token
modperl_types.h:118: warning: data definition has no type or storage class
modperl_types.h:150: error: syntax error before 'modperl_options_t'
modperl_types.h:150: warning: no semicolon at end of struct or union
modperl_types.h:153: error: syntax error before '}' token
modperl_types.h:153: warning: data definition has no type or storage class
modperl_types.h:162: error: syntax error before 'modperl_options_t'
modperl_types.h:162: warning: no semicolon at end of struct or union
modperl_types.h:166: warning: data definition has no type or storage class
modperl_types.h:170: error: syntax error before 'modperl_config_dir_t'
modperl_types.h:170: warning: no semicolon at end of struct or union
modperl_types.h:171: warning: data definition has no type or storage class
modperl_types.h:197: error: syntax error before 'U8'
modperl_types.h:197: warning: no semicolon at end of struct or union
modperl_types.h:198: warning: data definition has no type or storage class
modperl_types.h:199: error: conflicting types for 'next'
/usr/lib/perl5/5.8.7/i386-linux/CORE/perl.h:2618: error: previous declaration of 'next' was here
modperl_types.h:200: error: syntax error before '}' token
modperl_types.h:249: error: syntax error before 'U8'
modperl_types.h:249: warning: no semicolon at end of struct or union
modperl_types.h:258: error: syntax error before '}' token
modperl_types.h:258: warning: data definition has no type or storage class
In file included from mod_perl.h:72,
from mod_perl.c:16:
modperl_util.h:65: error: syntax error before '*' token
modperl_util.h:68: error: syntax error before 'hash'
modperl_util.h:68: warning: data definition has no type or storage class
In file included from mod_perl.h:73,
from mod_perl.c:16:
modperl_config.h:23: error: syntax error before '*' token
modperl_config.h:23: warning: data definition has no type or storage class
modperl_config.h:25: error: syntax error before '*' token
modperl_config.h:25: warning: data definition has no type or storage class
modperl_config.h:27: error: syntax error before '*' token
modperl_config.h:27: warning: data definition has no type or storage class
modperl_config.h:33: error: syntax error before '*' token
modperl_config.h:118: error: syntax error before 'modperl_config_srv_t'
modperl_config.h:122: error: syntax error before 'modperl_config_srv_t'
modperl_config.h:126: error: syntax error before 'modperl_config_srv_t'
In file included from mod_perl.h:75,
from mod_perl.c:16:
modperl_handler.h:60: error: syntax error before '*' token
In file included from mod_perl.h:80,
from mod_perl.c:16:
modperl_options.h:19: error: syntax error before '*' token
modperl_options.h:19: warning: data definition has no type or storage class
modperl_options.h:21: error: syntax error before 'modperl_options_t'
modperl_options.h:24: error: syntax error before '*' token
modperl_options.h:25: error: syntax error before 'modperl_options_t'
modperl_options.h:26: warning: data definition has no type or storage class
In file included from mod_perl.h:89,
from mod_perl.c:16:
modperl_env.h:39: error: syntax error before 'modperl_config_srv_t'
modperl_env.h:42: error: syntax error before 'modperl_config_dir_t'
In file included from mod_perl.h:91,
from mod_perl.c:16:
modperl_perl.h:29: error: field 'pid' declared as a function
mod_perl.c: In function 'modperl_boot':
mod_perl.c:108: warning: initialization makes pointer from integer without a cast
mod_perl.c:109: error: 'PL_defstash' undeclared (first use in this function)
mod_perl.c:113: error: 'XS_modperl_const_compile' undeclared (first use in this function)
mod_perl.c:122: error: 'PL_stderrgv' undeclared (first use in this function)
mod_perl.c:122: error: 'IOf_FLUSH' undeclared (first use in this function)
mod_perl.c: In function 'set_taint_var':
mod_perl.c:178: error: 'GV_ADDMULTI' undeclared (first use in this function)
mod_perl.c:178: error: 'SVt_PV' undeclared (first use in this function)
mod_perl.c:178: warning: initialization makes pointer from integer without a cast
mod_perl.c:179: error: 'PL_tainting' undeclared (first use in this function)
mod_perl.c: In function 'modperl_startup':
mod_perl.c:190: error: 'scfg' undeclared (first use in this function)
mod_perl.c:190: error: syntax error before ')' token
mod_perl.c:237: warning: assignment makes pointer from integer without a cast
mod_perl.c:252: error: 'PL_perl_destruct_level' undeclared (first use in this function)
mod_perl.c:264: error: 'PL_endav' undeclared (first use in this function)
mod_perl.c:265: error: 'Nullav' undeclared (first use in this function)
mod_perl.c:278: error: 'PL_origalen' undeclared (first use in this function)
mod_perl.c:309: error: 'PL_incgv' undeclared (first use in this function)
mod_perl.c: In function 'modperl_init_vhost':
mod_perl.c:347: error: 'scfg' undeclared (first use in this function)
mod_perl.c:347: error: syntax error before ')' token
mod_perl.c:348: error: 'base_scfg' undeclared (first use in this function)
mod_perl.c:371: error: syntax error before ')' token
mod_perl.c: In function 'modperl_init':
mod_perl.c:442: error: 'base_scfg' undeclared (first use in this function)
mod_perl.c:445: error: syntax error before ')' token
mod_perl.c: In function 'modperl_post_config_require':
mod_perl.c:477: error: 'scfg' undeclared (first use in this function)
mod_perl.c:477: error: syntax error before ')' token
mod_perl.c: In function 'modperl_hook_post_config_last':
mod_perl.c:714: error: 'PL_patchlevel' undeclared (first use in this function)
mod_perl.c:714: warning: passing argument 2 of 'ap_add_version_component' makes pointer from integer without a cast
mod_perl.c: In function 'modperl_hook_create_request':
mod_perl.c:733: error: 'rcfg' undeclared (first use in this function)
mod_perl.c:733: error: syntax error before ')' token
mod_perl.c: In function 'modperl_response_init':
mod_perl.c:959: error: 'rcfg' undeclared (first use in this function)
mod_perl.c:959: error: syntax error before ')' token
mod_perl.c:960: error: 'dcfg' undeclared (first use in this function)
mod_perl.c:960: error: syntax error before ')' token
mod_perl.c: In function 'modperl_response_finish':
mod_perl.c:982: error: 'rcfg' undeclared (first use in this function)
mod_perl.c:982: error: syntax error before ')' token
mod_perl.c: In function 'modperl_response_handler':
mod_perl.c:1012: error: 'dcfg' undeclared (first use in this function)
mod_perl.c:1012: error: syntax error before ')' token
mod_perl.c: In function 'modperl_response_handler_cgi':
mod_perl.c:1048: error: 'dcfg' undeclared (first use in this function)
mod_perl.c:1048: error: syntax error before ')' token
mod_perl.c:1051: error: 'rcfg' undeclared (first use in this function)
mod_perl.c:1051: error: syntax error before ')' token
mod_perl.c:1083: error: 'ENTER' undeclared (first use in this function)
mod_perl.c:1083: error: 'SAVETMPS' undeclared (first use in this function)
mod_perl.c:1097: error: 'FREETMPS' undeclared (first use in this function)
mod_perl.c:1097: error: 'LEAVE' undeclared (first use in this function)
make[1]: *** [mod_perl.lo] Error 1
make: *** [modperl_lib] Error 2