SGML_SEARCH_PATH=../..:../../doc:.. \
jade -t sgml -i html -d ../../docbook-utils.dsl\#html \
-V '%use-id-as-filename%' ../../doc/docbook-utils.sgml
jade: error while loading shared libraries: libosp.so.3: cannot open shared object file: No such file or directory
make[2]: *** [api.html] Error 127
make[2]: *** Waiting for unfinished jobs....
jade: error while loading shared libraries: libosp.so.3: cannot open shared object file: No such file or directory
make[2]: *** [backend-spec.html] Error 127
make[2]: Leaving directory `/var/tmp/portage/docbook-sgml-utils-0.6.14/work/docbook-utils-0.6.14/doc/HTML'
make[1]: *** [all-recursive] Error 1
make[1]: Leaving directory `/var/tmp/portage/docbook-sgml-utils-0.6.14/work/docbook-utils-0.6.14/doc'
make: *** [all-recursive] Error 1
!!! ERROR: app-text/docbook-sgml-utils-0.6.14 failed.
!!! Function src_compile, Line 556, Exitcode 2
!!! emake failed
!!! If you need support, post the topmost build error, NOT this status message.