All pastes #14151 Raw Edit

Anonymous

public text v1 · immutable
#14151 ·published 2005-06-12 20:25 UTC
rendered paste body
NOTE: package xserver-kdrive-0.0cvs20050612: started
NOTE: package xserver-kdrive-0.0cvs20050612-r10: task do_fetch: started
NOTE: package xserver-kdrive-0.0cvs20050612-r10: task do_fetch: completed
NOTE: package xserver-kdrive-0.0cvs20050612-r10: task do_compile: started
ERROR: function do_compile failed
ERROR: log data follows (/home/enpsgp/dev/build/conf/tmp/work/xserver-kdrive-0.0cvs20050612-r10/temp/log.do_compile.26779)
| NOTE: make
| Making all in include
| make[1]: Entering directory `/home/enpsgp/dev/build/conf/tmp/work/xserver-kdrive-0.0cvs20050612-r10/xserver/include'
| make  all-am
| make[2]: Entering directory `/home/enpsgp/dev/build/conf/tmp/work/xserver-kdrive-0.0cvs20050612-r10/xserver/include'
| make[2]: Nothing to be done for `all-am'.
| make[2]: Leaving directory `/home/enpsgp/dev/build/conf/tmp/work/xserver-kdrive-0.0cvs20050612-r10/xserver/include'
| make[1]: Leaving directory `/home/enpsgp/dev/build/conf/tmp/work/xserver-kdrive-0.0cvs20050612-r10/xserver/include'
| Making all in dix
| make[1]: Entering directory `/home/enpsgp/dev/build/conf/tmp/work/xserver-kdrive-0.0cvs20050612-r10/xserver/dix'
| make[1]: Nothing to be done for `all'.
| make[1]: Leaving directory `/home/enpsgp/dev/build/conf/tmp/work/xserver-kdrive-0.0cvs20050612-r10/xserver/dix'
| Making all in fb
| make[1]: Entering directory `/home/enpsgp/dev/build/conf/tmp/work/xserver-kdrive-0.0cvs20050612-r10/xserver/fb'
| if ccache arm-linux-gcc -march=armv5te -mtune=xscale -DHAVE_CONFIG_H -I. -I/home/enpsgp/dev/build/conf/tmp/work/xserver-kdrive-0.0cvs20050612-r10/xserver/fb -I../include -I/home/enpsgp/dev/build/conf/tmp/work/xserver-kdrive-0.0cvs20050612-r10/xserver/mi -I/home/enpsgp/dev/build/conf/tmp/work/xserver-kdrive-0.0cvs20050612-r10/xserver/Xext -I/home/enpsgp/dev/build/conf/tmp/work/xserver-kdrive-0.0cvs20050612-r10/xserver/render -Wall -Wpointer-arith -Wstrict-prototypes        -Wmissing-prototypes -Wmissing-declarations      -Wnested-externs -fno-strict-aliasing -D_XOPEN_SOURCE=500 -I/home/enpsgp/dev/build/conf/tmp/staging/arm-linux/include -I/home/enpsgp/dev/build/conf/tmp/staging/arm-linux/include/X11/fonts -I/home/enpsgp/dev/build/conf/tmp/staging/arm-linux/include/X11/Xtrans   -D_BSD_SOURCE -I/home/enpsgp/dev/build/conf/tmp/work/xserver-kdrive-0.0cvs20050612-r10/xserver/include -I/home/enpsgp/dev/build/conf/tmp/work/xserver-kdrive-0.0cvs20050612-r10/xserver/Xext  -I/home/enpsgp/dev/build/conf/tmp/staging/arm-linux/include  -I/home/enpsgp/dev/build/conf/tmp/staging/arm-linux/include -fexpensive-optimizations -fomit-frame-pointer -frename-registers -O2 -MT fboverlay.o -MD -MP -MF ".deps/fboverlay.Tpo" -c -o fboverlay.o fboverlay.c; \
| then mv -f ".deps/fboverlay.Tpo" ".deps/fboverlay.Po"; else rm -f ".deps/fboverlay.Tpo"; exit 1; fi
| In file included from fboverlay.c:31:
| /home/enpsgp/dev/build/conf/tmp/work/xserver-kdrive-0.0cvs20050612-r10/xserver/Xext/shmint.h:36: error: syntax error before "ShmFuncsPtr"
| /home/enpsgp/dev/build/conf/tmp/work/xserver-kdrive-0.0cvs20050612-r10/xserver/Xext/shmint.h:36: warning: function declaration isn't a prototype
| make[1]: *** [fboverlay.o] Error 1
| make[1]: Leaving directory `/home/enpsgp/dev/build/conf/tmp/work/xserver-kdrive-0.0cvs20050612-r10/xserver/fb'
| make: *** [all-recursive] Error 1
| FATAL: oe_runmake failed
NOTE: Task failed: 
NOTE: package xserver-kdrive-0.0cvs20050612-r10: task do_compile: failed
ERROR: TaskFailed event exception, aborting
NOTE: package xserver-kdrive-0.0cvs20050612: failed
ERROR: Build of gpe-image failed
[enpsgp@eapc-pg21 conf]$