All pastes #14138 Raw Edit

Someone

public text v1 · immutable
#14138 ·published 2005-06-12 19:14 UTC
rendered paste body
--->  Cleaning libsdl
--->  Fetching libsdl
--->  Verifying checksum(s) for libsdl
--->  Extracting libsdl
--->  Configuring libsdl
--->  Building libsdl with target all
Error: Target com.apple.build returned: shell command "cd "/opt/local/var/db/dports/build/file._opt_local_var_db_dports_sources_rsync.rsync.opendarwin.org_dpupdate_dports_devel_libsdl/work/SDL-1.2.8" && make all" returned error 2
Command output: SDL_coreaudio.c:225: error: `kLinearPCMFormatFlagIsBigEndian' undeclared (first use in this function)
SDL_coreaudio.c:233: error: `desc' undeclared (first use in this function)
SDL_coreaudio.c:233: error: `kAudioUnitComponentType' undeclared (first use in this function)
SDL_coreaudio.c:234: error: `kAudioUnitSubType_Output' undeclared (first use in this function)
SDL_coreaudio.c:235: error: `kAudioUnitID_DefaultOutput' undeclared (first use in this function)
SDL_coreaudio.c:239: error: `comp' undeclared (first use in this function)
SDL_coreaudio.c:239: warning: implicit declaration of function `FindNextComponent'
SDL_coreaudio.c:246: error: `result' undeclared (first use in this function)
SDL_coreaudio.c:246: warning: implicit declaration of function `OpenAComponent'
SDL_coreaudio.c:246: error: dereferencing pointer to incomplete type
SDL_coreaudio.c:247: error: `noErr' undeclared (first use in this function)
SDL_coreaudio.c:249: warning: implicit declaration of function `AudioUnitInitialize'
SDL_coreaudio.c:249: error: dereferencing pointer to incomplete type
SDL_coreaudio.c:253: error: dereferencing pointer to incomplete type
SDL_coreaudio.c:254: error: `kAudioUnitProperty_StreamFormat' undeclared (first use in this function)
SDL_coreaudio.c:255: error: `kAudioUnitScope_Input' undeclared (first use in this function)
SDL_coreaudio.c:264: error: dereferencing pointer to incomplete type
SDL_coreaudio.c:265: error: `kAudioUnitProperty_SetInputCallback' undeclared (first use in this function)
SDL_coreaudio.c:276: error: dereferencing pointer to incomplete type
SDL_coreaudio.c:276: error: dereferencing pointer to incomplete type
SDL_coreaudio.c:277: error: dereferencing pointer to incomplete type
SDL_coreaudio.c:277: error: dereferencing pointer to incomplete type
SDL_coreaudio.c:278: error: dereferencing pointer to incomplete type
SDL_coreaudio.c:281: warning: implicit declaration of function `AudioOutputUnitStart'
SDL_coreaudio.c:281: error: dereferencing pointer to incomplete type
SDL_coreaudio.c:212: warning: unused variable `callback'
make[3]: *** [SDL_coreaudio.lo] Error 1
make[2]: *** [all-recursive] Error 1
make[1]: *** [all-recursive] Error 1
make: *** [all-recursive] Error 1