All pastes #1393792 Raw Edit

errors2

public text v1 · immutable
#1393792 ·published 2009-04-16 12:04 UTC
rendered paste body
1>------ Build started: Project: WorldPvPScripts, Configuration: Release Win32 ------2>------ Build started: Project: SunEventScripts, Configuration: Release Win32 ------1>Compiling...2>Compiling...2>Setup.cpp1>ZoneZangarmarsh.cpp1>..\src\WorldPvPScripts\ZoneZangarmarsh.cpp(187) : error C2039: 'InStealth' : is not a member of 'Player'1>        c:\documents and settings\administrator\desktop\archive\wow\server\3_1_0\src\hearthstone-world\Player.h(765) : see declaration of 'Player'1>ZoneTerokkarForest.cpp2>Base.cpp1>..\src\WorldPvPScripts\ZoneTerokkarForest.cpp(153) : error C2039: 'InStealth' : is not a member of 'Player'1>        c:\documents and settings\administrator\desktop\archive\wow\server\3_1_0\src\hearthstone-world\Player.h(765) : see declaration of 'Player'1>ZoneSilithus.cpp2>..\src\InstanceScripts\Base.cpp(298) : error C2660: 'Creature::RegenerateHealth' : function does not take 1 arguments2>WinterVeil.cpp1>ZoneHellfirePeninsula.cpp2>Halloween.cpp1>..\src\WorldPvPScripts\ZoneHellfirePeninsula.cpp(146) : error C2039: 'InStealth' : is not a member of 'Player'1>        c:\documents and settings\administrator\desktop\archive\wow\server\3_1_0\src\hearthstone-world\Player.h(765) : see declaration of 'Player'1>Setup.cpp2>Event_DarkPortal.cpp2>Generating Code...1>Build log was saved at "file://c:\Documents and Settings\Administrator\Desktop\archive\WoW\Server\3_1_0\src\Sun  \projects\2008_int_release_WorldPvPScripts\BuildLog.htm"1>WorldPvPScripts - 3 error(s), 0 warning(s)2>Build log was saved at "file://c:\Documents and Settings\Administrator\Desktop\archive\WoW\Server\3_1_0\src\Sun  \projects\2003_int_release_SunEventScripts\BuildLog.htm"2>SunEventScripts - 1 error(s), 0 warning(s)3>------ Build started: Project: ExtraScripts, Configuration: Release Win32 ------3>Compiling...3>cl : Command line warning D9035 : option 'Wp64' has been deprecated and will be removed in a future release3>NeutralGuards.cpp4>------ Build started: Project: LUAScripting, Configuration: Release Win32 ------4>Compiling...4>cl : Command line warning D9035 : option 'Wp64' has been deprecated and will be removed in a future release4>LUAEngine.cpp3>Setup.cpp4>Compiling...4>cl : Command line warning D9035 : option 'Wp64' has been deprecated and will be removed in a future release4>print.c4>lzio.c4>lvm.c4>lundump.c4>ltm.c4>ltablib.c4>ltable.c4>lstrlib.c4>lstring.c4>lstate.c4>lparser.c4>loslib.c4>lopcodes.c4>lobject.c4>loadlib.c4>lmem.c4>lmathlib.c4>llex.c4>liolib.c4>linit.c4>Generating Code...4>Compiling...4>lgc.c4>lfunc.c4>ldump.c4>ldo.c4>ldebug.c4>ldblib.c4>lcode.c4>lbaselib.c4>lauxlib.c4>lapi.c4>Generating Code...3>Generating Code...4>Linking...3>Linking...3>   Creating library ..\..\..\bin\release\script_bin/ExtraScripts.lib and object ..\..\..\bin\release\script_bin/ExtraScripts.exp4>   Creating library ..\..\..\bin\release\script_bin/LUAScripting.lib and object ..\..\..\bin\release\script_bin/LUAScripting.exp3>Embedding manifest...3>Build log was saved at "file://c:\Documents and Settings\Administrator\Desktop\archive\WoW\Server\3_1_0\src\Sun  \projects\2003_int_release\BuildLog.htm"3>ExtraScripts - 0 error(s), 1 warning(s)5>------ Build started: Project: SunMiscScripts, Configuration: Release Win32 ------5>Compiling...5>RandomScripts.cpp4>Embedding manifest...4>Build log was saved at "file://c:\Documents and Settings\Administrator\Desktop\archive\WoW\Server\3_1_0\src\Sun  \projects\2008_int_release_LUAScripting\BuildLog.htm"4>LUAScripting - 0 error(s), 2 warning(s)6>------ Build started: Project: SunQuestScripts, Configuration: Release Win32 ------6>Compiling...6>Zangarmarsh.cpp5>QuelDanasPortal.cpp6>Westfall.cpp5>GameObjects.cpp6>UnGoro.cpp5>DarkmoonFaireObjects.cpp6>Undercity.cpp5>Creatures.cpp6>TirisfalGlades.cpp5>Setup.cpp6>ThousandNeedles.cpp5>Generating Code...5>Linking...5>   Creating library ..\..\..\bin\release\script_bin/SunMiscScripts.lib and object ..\..\..\bin\release\script_bin/SunMiscScripts.exp6>The_Barrens.cpp5>Embedding manifest...5>Build log was saved at "file://c:\Documents and Settings\Administrator\Desktop\archive\WoW\Server\3_1_0\src\Sun  \projects\2003_int_release_Sunmiscscripts\BuildLog.htm"5>SunMiscScripts - 0 error(s), 0 warning(s)7>------ Build started: Project: ServerStatusPlugin, Configuration: Release Win32 ------7>Compiling...7>ServerStatusPlugin.cpp6>Terrokar_Forest.cpp7>Linking...7>   Creating library ..\..\..\bin\release\script_bin/ServerStatusPlugin.lib and object ..\..\..\bin\release\script_bin/ServerStatusPlugin.exp7>Embedding manifest...7>Build log was saved at "file://c:\Documents and Settings\Administrator\Desktop\archive\WoW\Server\3_1_0\src\Sun  \projects\2003_int_release_statusplugin\BuildLog.htm"7>ServerStatusPlugin - 0 error(s), 0 warning(s)8>------ Build started: Project: SunGossipScripts, Configuration: Release Win32 ------8>Compiling...8>Gossip_BoreanTundra.cpp6>Teldrassil.cpp6>Tanaris.cpp8>Gossip_Trainer.cpp6>StranglethornVale.cpp8>Gossip_Theramore.cpp6>Stormwind.cpp8>Gossip_Teldrassil.cpp6>Silverpine_Forest.cpp8>Gossip_Tanaris.cpp6>SilvermoonCity.cpp6>ShadowMoon.cpp8>Gossip_Stormwind.cpp6>RedridgeMountains.cpp8>Gossip_Shattrath.cpp6>Old_Hillsbrad.cpp8>Gossip_Mulgore.cpp6>Netherstorm.cpp8>Gossip_Moonglade.cpp6>Nagrand.cpp8>Gossip_Innkeepers.cpp6>Mulgore.cpp8>Gossip_Guard.cpp6>Generating Code...6>Compiling...6>LochModan.cpp8>Gossip_DarkmoonFaire.cpp6>Isle_of_QuelDanas.cpp8>Gossip_Battlemaster.cpp6>Howling_Fjord.cpp8>Setup.cpp6>HillsbradFoothills.cpp8>Generating Code...8>Linking...8>   Creating library ..\..\..\bin\release\script_bin/SunGossipScripts.lib and object ..\..\..\bin\release\script_bin/SunGossipScripts.exp6>Hellfire_Peninsula.cpp8>Embedding manifest...8>Build log was saved at "file://c:\Documents and Settings\Administrator\Desktop\archive\WoW\Server\3_1_0\src\Sun  \projects\2003_int_release_Sungossipscripts\BuildLog.htm"8>SunGossipScripts - 0 error(s), 0 warning(s)9>------ Build started: Project: SunSpellHandlers, Configuration: Release Win32 ------9>Compiling...9>WarriorSpells.cpp6>Ghostlands.cpp9>WarlockSpells.cpp6>EversongWoods.cpp9>ShamanSpells.cpp6>Eastern_Plaguelands.cpp9>RogueSpells.cpp6>Dustwallow_Marsh.cpp9>Raid_BlackTemple.cpp6>Duskwood.cpp9>QIspells.cpp6>Dragonblight.cpp9>PriestSpells.cpp6>Desolace.cpp9>PaladinSpells.cpp6>Darkshore.cpp6>BloodmystIsle.cpp9>OldSpellCPPStuff.cpp6>BlastedLands.cpp9>MageSpells.cpp6>BladeEdge_Mountains.cpp9>ItemSpells_1.cpp6>Azuremyst_Isle.cpp9>HunterSpells.cpp6>Azshara.cpp9>DruidSpells.cpp6>ArathiHighlands.cpp9>Setup.cpp6>FirstAid.cpp9>Generating Code...9>Linking...9>   Creating library ..\..\..\bin\release\script_bin/SunSpellHandlers.lib and object ..\..\..\bin\release\script_bin/SunSpellHandlers.exp9>Embedding manifest...9>Build log was saved at "file://c:\Documents and Settings\Administrator\Desktop\archive\WoW\Server\3_1_0\src\Sun  \projects\2003_int_release_Sunspellhandlers\BuildLog.htm"9>SunSpellHandlers - 0 error(s), 0 warning(s)10>------ Build started: Project: SunInstanceScripts, Configuration: Release Win32 ------10>Compiling...10>Raid_ZulGurub.cpp10>Raid_ZulAman.cpp6>Generating Code...6>Compiling...6>Warrior.cpp10>Raid_WorldBosses.cpp10>Raid_TheObsidianSanctum.cpp6>Paladin.cpp6>Mage.cpp6>Druid.cpp10>Raid_TheEye.cpp10>Raid_SunwellPlateau.cpp6>DeathKnight.cpp6>Unsorted.cpp10>Raid_SerpentshrineCavern.cpp10>Raid_OnyxiasLair.cpp6>QuestHooks.cpp6>QuestGossip.cpp10>Raid_Naxxramas.cpp10>Raid_MoltenCore.cpp6>Setup.cpp6>Base.cpp6>..\src\InstanceScripts\Base.cpp(298) : error C2660: 'Creature::RegenerateHealth' : function does not take 1 arguments6>Generating Code...6>Build log was saved at "file://c:\Documents and Settings\Administrator\Desktop\archive\WoW\Server\3_1_0\src\Sun  \projects\2003_int_release_Sunquestscripts\BuildLog.htm"6>SunQuestScripts - 1 error(s), 0 warning(s)10>Raid_Magtheridons_Lair.cpp10>Raid_Karazhan.cpp10>Raid_GruulsLair.cpp10>Raid_CoT_BattleOfMountHyjal.cpp10>Raid_BlackwingLair.cpp10>Raid_BlackTemple.cpp10>Instance_ZulFarrak.cpp10>Instance_WailingCaverns.cpp10>Instance_Uldaman.cpp10>Instance_TheUnderbog.cpp10>Instance_TheStockade.cpp10>Instance_TheSteamvault.cpp10>Instance_TheSlavePens.cpp10>Instance_TheShatteredHalls.cpp10>Instance_TheMechanar.cpp10>Instance_ShadowLabyrinth.cpp10>Instance_ShadowfangKeep.cpp10>Instance_SethekkHalls.cpp10>Instance_Scholomance.cpp10>Instance_ScarletMonastery.cpp10>Instance_RazorfenDowns.cpp10>Instance_RagefireChasm.cpp10>Instance_OldHillsbradFoothills.cpp10>Instance_Mauradon.cpp10>Instance_ManaTombs.cpp10>Instance_MagistersTerrace.cpp10>Instance_HellfireRamparts.cpp10>Instance_HallsOfStone.cpp10>Instance_DireMaul.cpp10>Instance_Deadmines.cpp10>Instance_Botanica.cpp10>Instance_BloodFurnace.cpp10>Instance_BlackrockSpire.cpp10>Instance_BlackrockDepths.cpp10>Instance_BlackMorass.cpp10>Instance_BlackfathomDeeps.cpp10>Instance_AzjolNerub.cpp10>Instance_AuchenaiCrypts.cpp10>Instance_Arcatraz.cpp10>GenericAI.cpp10>Setup.cpp10>Base.cpp10>..\src\InstanceScripts\Base.cpp(298) : error C2660: 'Creature::RegenerateHealth' : function does not take 1 arguments10>Build log was saved at "file://c:\Documents and Settings\Administrator\Desktop\archive\WoW\Server\3_1_0\src\Sun  \projects\2003_int_release_Suninstancescripts\BuildLog.htm"10>SunInstanceScripts - 1 error(s), 0 warning(s)========== Build: 6 succeeded, 4 failed, 0 up-to-date, 0 skipped ==========