gmake[4]: Entering directory `/root/worksrc/mozilla/security/nss/lib/util'
gcc -o Linux2.6_x86_glibc_PTH_OPT.OBJ/quickder.o -c -O2 -fPIC -DLINUX1_2 -Di386 -D_XOPEN_SOURCE -DLINUX2_1 -ansi -Wall -pipe -DLINUX -Dlinux -D_POSIX_SOURCE -D_BSD_SOURCE -DHAVE_STRERROR -DXP_UNIX -UDEBUG -DNDEBUG -D_REENTRANT -I/root/worksrc/mozilla/dist/include -I../../../../dist/public/nss -I../../../../dist/private/nss -I../../../../dist/include -I/root/worksrc/mozilla/dist/include/nspr -I/root/worksrc/mozilla/dist/include/dbm -I../../../../dist/public/dbm quickder.c
In file included from quickder.c:43:
secasn1.h:48:21: plarena.h: No such file or directory
In file included from secasn1.h:50,
from quickder.c:43:
seccomon.h:50:21: prtypes.h: No such file or directory
In file included from seccomon.h:61,
from secasn1.h:50,
from quickder.c:43:
secport.h:106:39: prlog.h: No such file or directory
secport.h:108:19: plstr.h: No such file or directory
In file included from seccomon.h:61,
from secasn1.h:50,
from quickder.c:43:
secport.h:132: error: syntax error before '*' token
secport.h:132: warning: type defaults to `int' in declaration of `PORT_NewArena'
secport.h:132: warning: data definition has no type or storage class
secport.h:133: error: syntax error before '*' token
secport.h:134: error: syntax error before '*' token
secport.h:135: error: syntax error before '*' token
secport.h:136: error: syntax error before '*' token
secport.h:138: error: syntax error before '*' token
secport.h:139: error: syntax error before '*' token
secport.h:140: error: syntax error before '*' token
secport.h:141: error: syntax error before '*' token
secport.h:193: error: syntax error before '*' token
secport.h:193: error: syntax error before "toUnicode"
secport.h:196: warning: type defaults to `int' in declaration of `PRBool'
secport.h:196: error: `PRBool' declared as function returning a function
secport.h:198: error: syntax error before '*' token
secport.h:207: error: syntax error before "convFunc"
secport.h:208: error: syntax error before "convFunc"
secport.h:211: error: `PORT_UCS4_UTF8Conversion' declared as function returning a function
secport.h:215: error: `PORT_UCS2_ASCIIConversion' declared as function returning a function
secport.h:216: error: syntax error before "convFunc"
secport.h:219: error: `PORT_UCS2_UTF8Conversion' declared as function returning a function
secport.h:224: error: `PORT_ISO88591_UTF8Conversion' declared as function returning a function
secport.h:227: error: syntax error before "sec_port_ucs4_utf8_conversion_function"
secport.h:235: warning: type defaults to `int' in declaration of `sec_port_ucs4_utf8_conversion_function'
secport.h:235: warning: data definition has no type or storage class
secport.h:238: error: syntax error before "sec_port_ucs2_utf8_conversion_function"
secport.h:246: warning: type defaults to `int' in declaration of `sec_port_ucs2_utf8_conversion_function'
secport.h:246: warning: data definition has no type or storage class
secport.h:257: error: `sec_port_iso88591_utf8_conversion_function' declared as function returning a function
In file included from quickder.c:43:
secasn1.h:65: error: syntax error before '*' token
secasn1.h:91: error: syntax error before '*' token
secasn1.h:95: error: syntax error before '*' token
secasn1.h:99: error: syntax error before '*' token
secasn1.h:144: error: syntax error before '*' token
secasn1.h:147: error: syntax error before '*' token
secasn1.h:150: error: syntax error before '*' token
secasn1.h:189: error: `SEC_ASN1IsTemplateSimple' declared as function returning a function
In file included from quickder.c:44:
secitem.h:47:20: plhash.h: No such file or directory
In file included from quickder.c:44:
secitem.h:63: error: syntax error before '*' token
secitem.h:74: error: syntax error before '*' token
secitem.h:85: error: `SECITEM_ItemsAreEqual' declared as function returning a function
secitem.h:90: error: syntax error before '*' token
secitem.h:103: error: syntax error before '*' token
secitem.h:115: error: syntax error before "PR_CALLBACK"
secitem.h:115: warning: type defaults to `int' in declaration of `SECITEM_Hash'
secitem.h:115: warning: data definition has no type or storage class
secitem.h:117: error: syntax error before "PR_CALLBACK"
secitem.h:117: warning: type defaults to `int' in declaration of `SECITEM_HashCompare'
secitem.h:117: warning: data definition has no type or storage class
quickder.c: In function `MatchComponentType':
quickder.c:150: error: `PR_FALSE' undeclared (first use in this function)
quickder.c:150: error: (Each undeclared identifier is reported only once
quickder.c:150: error: for each function it appears in.)
quickder.c:170: error: `PR_TRUE' undeclared (first use in this function)
quickder.c: At top level:
quickder.c:371: error: syntax error before "PRArenaPool"
quickder.c:375: error: syntax error before "PRArenaPool"
quickder.c: In function `DecodeSequence':
quickder.c:380: error: `templateEntry' undeclared (first use in this function)
quickder.c:389: error: `src' undeclared (first use in this function)
quickder.c:394: error: `PR_FALSE' undeclared (first use in this function)
quickder.c:405: error: `dest' undeclared (first use in this function)
quickder.c:405: error: `arena' undeclared (first use in this function)
quickder.c:405: error: `PR_TRUE' undeclared (first use in this function)
quickder.c: At top level:
quickder.c:427: error: syntax error before "PRArenaPool"
quickder.c: In function `DecodeInline':
quickder.c:430: error: `templateEntry' undeclared (first use in this function)
quickder.c:430: error: `dest' undeclared (first use in this function)
quickder.c:430: error: `PR_FALSE' undeclared (first use in this function)
quickder.c:432: error: `src' undeclared (first use in this function)
quickder.c:432: error: `arena' undeclared (first use in this function)
quickder.c:432: error: `checkTag' undeclared (first use in this function)
quickder.c: At top level:
quickder.c:437: error: syntax error before "PRArenaPool"
quickder.c: In function `DecodePointer':
quickder.c:440: error: `templateEntry' undeclared (first use in this function)
quickder.c:440: error: `dest' undeclared (first use in this function)
quickder.c:440: error: `PR_FALSE' undeclared (first use in this function)
quickder.c:441: error: `arena' undeclared (first use in this function)
quickder.c:445: error: `src' undeclared (first use in this function)
quickder.c:445: error: `checkTag' undeclared (first use in this function)
quickder.c: At top level:
quickder.c:456: error: syntax error before "PRArenaPool"
quickder.c: In function `DecodeImplicit':
quickder.c:458: error: `templateEntry' undeclared (first use in this function)
quickder.c:460: error: `dest' undeclared (first use in this function)
quickder.c:461: error: `src' undeclared (first use in this function)
quickder.c:461: error: `arena' undeclared (first use in this function)
quickder.c:461: error: `PR_FALSE' undeclared (first use in this function)
quickder.c: At top level:
quickder.c:472: error: syntax error before "PRArenaPool"
quickder.c: In function `DecodeChoice':
quickder.c:476: error: `templateEntry' undeclared (first use in this function)
quickder.c:488: error: `src' undeclared (first use in this function)
quickder.c:492: error: `dest' undeclared (first use in this function)
quickder.c:492: error: `arena' undeclared (first use in this function)
quickder.c:492: error: `PR_TRUE' undeclared (first use in this function)
quickder.c: At top level:
quickder.c:521: error: syntax error before "PRArenaPool"
quickder.c: In function `DecodeGroup':
quickder.c:526: error: `PRUint32' undeclared (first use in this function)
quickder.c:526: error: syntax error before "totalEntries"
quickder.c:531: error: `templateEntry' undeclared (first use in this function)
quickder.c:531: error: `dest' undeclared (first use in this function)
quickder.c:531: error: `PR_FALSE' undeclared (first use in this function)
quickder.c:533: error: `src' undeclared (first use in this function)
quickder.c:552: error: `PR_TRUE' undeclared (first use in this function)
quickder.c:555: error: `totalEntries' undeclared (first use in this function)
quickder.c:563: error: `arena' undeclared (first use in this function)
quickder.c:580: error: syntax error before "entriesIndex"
quickder.c:581: error: `entriesIndex' undeclared (first use in this function)
quickder.c:593: error: `entryIndex' undeclared (first use in this function)
quickder.c: At top level:
quickder.c:609: error: syntax error before "PRArenaPool"
quickder.c: In function `DecodeExplicit':
quickder.c:613: error: `src' undeclared (first use in this function)
quickder.c:615: error: `PR_FALSE' undeclared (first use in this function)
quickder.c:619: error: `templateEntry' undeclared (first use in this function)
quickder.c:621: error: `dest' undeclared (first use in this function)
quickder.c:621: error: `arena' undeclared (first use in this function)
quickder.c:621: error: `PR_TRUE' undeclared (first use in this function)
quickder.c: At top level:
quickder.c:636: error: syntax error before "PRArenaPool"
quickder.c: In function `DecodeItem':
quickder.c:641: error: function `pop' is initialized like a variable
quickder.c:641: error: `PR_FALSE' undeclared (first use in this function)
quickder.c:642: error: function `decode' is initialized like a variable
quickder.c:642: error: `PR_TRUE' undeclared (first use in this function)
quickder.c:643: error: function `save' is initialized like a variable
quickder.c:645: error: function `match' is initialized like a variable
quickder.c:646: error: function `optional' is initialized like a variable
quickder.c:648: warning: implicit declaration of function `PR_ASSERT'
quickder.c:648: error: `src' undeclared (first use in this function)
quickder.c:648: error: `dest' undeclared (first use in this function)
quickder.c:648: error: `templateEntry' undeclared (first use in this function)
quickder.c:648: error: `arena' undeclared (first use in this function)
quickder.c:661: error: invalid lvalue in assignment
quickder.c:720: error: `checkTag' undeclared (first use in this function)
quickder.c: At top level:
quickder.c:884: error: syntax error before '*' token
quickder.c: In function `SEC_QuickDERDecodeItem':
quickder.c:891: error: `arena' undeclared (first use in this function)
quickder.c:891: error: `templateEntry' undeclared (first use in this function)
quickder.c:891: error: `src' undeclared (first use in this function)
quickder.c:900: error: `dest' undeclared (first use in this function)
quickder.c:900: error: `PR_TRUE' undeclared (first use in this function)
gmake[4]: *** [Linux2.6_x86_glibc_PTH_OPT.OBJ/quickder.o] Error 1
gmake[4]: Leaving directory `/root/worksrc/mozilla/security/nss/lib/util'
gmake[3]: *** [libs] Error 2
gmake[3]: Leaving directory `/root/worksrc/mozilla/security/nss/lib'
gmake[2]: *** [libs] Error 2
gmake[2]: Leaving directory `/root/worksrc/mozilla/security/manager'
gmake[1]: *** [tier_50] Error 2
gmake[1]: Leaving directory `/root/worksrc/mozilla'
make: *** [default] Error 2