All pastes #137857 Raw Edit

yanis

public text v1 · immutable
#137857 ·published 2006-08-18 18:53 UTC
rendered paste body
- entrance ................... ERROR!
-----------------------------------------------------------------------------

LAST LOGLINES FROM /tmp/easy_e17/install_logs/entrance.log:
-----------------------------------------------------------------------------
Making all in lib
make[3]: Entering directory `/home/yanis/e17_cvs/e17/apps/entrance/src/lib'
make[3]: Nothing to be done for `all'.
make[3]: Leaving directory `/home/yanis/e17_cvs/e17/apps/entrance/src/lib'
Making all in client
make[3]: Entering directory `/home/yanis/e17_cvs/e17/apps/entrance/src/client'
make[3]: Nothing to be done for `all'.
make[3]: Leaving directory `/home/yanis/e17_cvs/e17/apps/entrance/src/client'
Making all in daemon
make[3]: Entering directory `/home/yanis/e17_cvs/e17/apps/entrance/src/daemon'
make[3]: Nothing to be done for `all'.
make[3]: Leaving directory `/home/yanis/e17_cvs/e17/apps/entrance/src/daemon'
Making all in config
make[3]: Entering directory `/home/yanis/e17_cvs/e17/apps/entrance/src/config'
/bin/sh ../../libtool --mode=link gcc  -g -O2 -Wall  -L/opt/e17/lib -o entrance_edit -L../lib entrance_edit-entrance_edit_main.
o -L/opt/e17/lib -lecore -lecore_job -lecore_x -L/usr/X11R6/lib -lX11 -lXext -lecore_evas -lecore_con -lecore_ipc -lecore_txt -
lecore_config -lecore_file -L/usr/lib -lcurl -L/usr/lib -lgssapi_krb5 -lkrb5 -lk5crypto -lkrb5support -lcom_err -lresolv -lidn
-lssl -lcrypto -ldl -lssl -lcrypto -lz -lecore_desktop -lecore_dbus -lssl -lcrypto -L/usr/lib -lcurl -L/usr/lib -lgssapi_krb5 -
lkrb5 -lk5crypto -lkrb5support -lcom_err -lresolv -lidn -lssl -lcrypto -ldl -lssl -lcrypto -lz -L/opt/e17/lib -leet -lz -ljpeg
-L/opt/e17/lib -levas -ldl -L/opt/e17/lib -leet -lz -ljpeg -lfreetype -lz -lfontconfig -L/usr/X11R6/lib -lX11 -lXext -lXcursor
-lXrender -lXinerama -lXrandr -lXfixes -lm -lentrance_edit -lcrypt
gcc -g -O2 -Wall -o entrance_edit entrance_edit-entrance_edit_main.o  -L/opt/e17/lib -L/home/yanis/e17_cvs/e17/apps/entrance/sr
c/lib /opt/e17/lib/libecore.so /opt/e17/lib/libecore_job.so /opt/e17/lib/libecore_x.so -L/usr/X11R6/lib /opt/e17/lib/libecore_e
vas.so /opt/e17/lib/libecore_con.so /opt/e17/lib/libecore_ipc.so /opt/e17/lib/libecore_txt.so /opt/e17/lib/libecore_config.so /
opt/e17/lib/libecore_file.so -L/usr/lib /opt/e17/lib/libecore_desktop.so /opt/e17/lib/libecore_dbus.so /usr/lib/libcurl.so -lgs
sapi_krb5 -lkrb5 -lk5crypto -lkrb5support -lcom_err -lresolv /usr/lib/libidn.so -lssl -lcrypto /opt/e17/lib/libevas.so -ldl /op
t/e17/lib/libeet.so /usr/lib/libjpeg.so /usr/lib/libfreetype.so -lz -lfontconfig -lX11 -lXext -lXcursor -lXrender -lXinerama -l
Xrandr -lXfixes -lm /opt/e17/lib/libentrance_edit.so -lcrypt
entrance_edit-entrance_edit_main.o: In function `main':/home/yanis/e17_cvs/e17/apps/entrance/src/config/entrance_edit_main.c:32
6: undefined reference to `entrance_edit_save'
collect2: ld returned 1 exit status
make[3]: *** [entrance_edit] Error 1
make[3]: Leaving directory `/home/yanis/e17_cvs/e17/apps/entrance/src/config'
make[2]: *** [all-recursive] Error 1
make[2]: Leaving directory `/home/yanis/e17_cvs/e17/apps/entrance/src'
make[1]: *** [all] Error 2
make[1]: Leaving directory `/home/yanis/e17_cvs/e17/apps/entrance/src'            
                         make: *** [all-recursive] Error 1
-----------------------------------------------------------------------------