All pastes #13741 Raw Edit

Someone

public text v1 · immutable
#13741 ·published 2005-06-08 19:13 UTC
rendered paste body
| /stuff/build/tmp/work/gcc-cross-4.0.0-r0/gcc-4.0.0/build.i686-linux.i386-linux-uclibc/gcc/xgcc -shared-libgcc -B/stuff/build/tmp/work/gcc-cross-4.0.0-r0/gcc-4.0.0/build.i686-linux.i386-linux-uclibc/gcc/ -nostdinc++ -L/stuff/build/tmp/work/gcc-cross-4.0.0-r0/gcc-4.0.0/build.i686-linux.i386-linux-uclibc/i386-linux-uclibc/libstdc++-v3/src -L/stuff/build/tmp/work/gcc-cross-4.0.0-r0/gcc-4.0.0/build.i686-linux.i386-linux-uclibc/i386-linux-uclibc/libstdc++-v3/src/.libs -B/stuff/build/tmp/cross/i386-linux-uclibc/bin/ -B/stuff/build/tmp/cross/i386-linux-uclibc/lib/ -isystem /stuff/build/tmp/cross/i386-linux-uclibc/include -isystem /stuff/build/tmp/cross/i386-linux-uclibc/sys-include -I/stuff/build/tmp/work/gcc-cross-4.0.0-r0/gcc-4.0.0/build.i686-linux.i386-linux-uclibc/i386-linux-uclibc/libstdc++-v3/include/i386-linux-uclibc -I/stuff/build/tmp/work/gcc-cross-4.0.0-r0/gcc-4.0.0/build.i686-linux.i386-linux-uclibc/i386-linux-uclibc/libstdc++-v3/include -I/stuff/build/tmp/work/gcc-cross-4.0.0-r0/gcc-4.0.0/libstdc++-v3/libsupc++ -g -Os -fno-implicit-templates -Wall -Wextra -Wwrite-strings -Wcast-qual -fdiagnostics-show-location=once -ffunction-sections -fdata-sections -c /stuff/build/tmp/work/gcc-cross-4.0.0-r0/gcc-4.0.0/libstdc++-v3/src/ctype.cc -o ctype.o
| /stuff/build/tmp/work/gcc-cross-4.0.0-r0/gcc-4.0.0/build.i686-linux.i386-linux-uclibc/i386-linux-uclibc/libstdc++-v3/include/i386-linux-uclibc/bits/ctype_noninline.h: In constructor 'std::ctype<char>::ctype(int*, const short unsigned int*, bool, size_t)':
| /stuff/build/tmp/work/gcc-cross-4.0.0-r0/gcc-4.0.0/build.i686-linux.i386-linux-uclibc/i386-linux-uclibc/libstdc++-v3/include/i386-linux-uclibc/bits/ctype_noninline.h:85: error: cannot convert 'const __ctype_touplow_t*' to 'const int*' in assignment
| /stuff/build/tmp/work/gcc-cross-4.0.0-r0/gcc-4.0.0/build.i686-linux.i386-linux-uclibc/i386-linux-uclibc/libstdc++-v3/include/i386-linux-uclibc/bits/ctype_noninline.h:86: error: cannot convert 'const __ctype_touplow_t*' to 'const int*' in assignment
| /stuff/build/tmp/work/gcc-cross-4.0.0-r0/gcc-4.0.0/build.i686-linux.i386-linux-uclibc/i386-linux-uclibc/libstdc++-v3/include/i386-linux-uclibc/bits/ctype_noninline.h: In constructor 'std::ctype<char>::ctype(const short unsigned int*, bool, size_t)':
| /stuff/build/tmp/work/gcc-cross-4.0.0-r0/gcc-4.0.0/build.i686-linux.i386-linux-uclibc/i386-linux-uclibc/libstdc++-v3/include/i386-linux-uclibc/bits/ctype_noninline.h:120: error: cannot convert 'const __ctype_touplow_t*' to 'const int*' in assignment
| /stuff/build/tmp/work/gcc-cross-4.0.0-r0/gcc-4.0.0/build.i686-linux.i386-linux-uclibc/i386-linux-uclibc/libstdc++-v3/include/i386-linux-uclibc/bits/ctype_noninline.h:121: error: cannot convert 'const __ctype_touplow_t*' to 'const int*' in assignment
| make[3]: *** [ctype.lo] Error 1
| make[3]: Leaving directory `/stuff/build/tmp/work/gcc-cross-4.0.0-r0/gcc-4.0.0/build.i686-linux.i386-linux-uclibc/i386-linux-uclibc/libstdc++-v3/src'
| make[2]: *** [all-recursive] Error 1
| make[2]: Leaving directory `/stuff/build/tmp/work/gcc-cross-4.0.0-r0/gcc-4.0.0/build.i686-linux.i386-linux-uclibc/i386-linux-uclibc/libstdc++-v3'
| make[1]: *** [all] Error 2
| make[1]: Leaving directory `/stuff/build/tmp/work/gcc-cross-4.0.0-r0/gcc-4.0.0/build.i686-linux.i386-linux-uclibc/i386-linux-uclibc/libstdc++-v3'
| make: *** [all-target-libstdc++-v3] Error 2
| FATAL: oe_runmake failed
NOTE: Task failed: 
NOTE: package gcc-cross-4.0.0-r0: task do_compile: failed
ERROR: TaskFailed event exception, aborting
NOTE: package gcc-cross-4.0.0: failed
ERROR: Build of bootstrap-image failed