Untitled
public text v1 · immutablecollect2: ld returned 1 exit status
make[2]: *** [nano] Error 1
make[2]: Leaving directory `/home/yo/nano-1.2.5'
make[1]: *** [all-recursive] Error 1
make[1]: Leaving directory `/home/yo/nano-1.2.5'
make: *** [all] Error 2