config.status: creating po/POTFILES
config.status: creating po/Makefile
make: Entering directory `/var/tmp/portage/ss-1.39/work/e2fsprogs-1.39/lib/ss'
cd ../../util ; make subst
make[1]: Entering directory `/var/tmp/portage/ss-1.39/work/e2fsprogs-1.39/util'
CC subst.c
LD subst
make[1]: Leaving directory `/var/tmp/portage/ss-1.39/work/e2fsprogs-1.39/util'
SUBST mk_cmds
make[1]: Entering directory `/var/tmp/portage/ss-1.39/work/e2fsprogs-1.39/lib/ss'
MKDIR elfshared
make[1]: Leaving directory `/var/tmp/portage/ss-1.39/work/e2fsprogs-1.39/lib/ss'
COMPILE_ET ss_err.et
CC ss_err.c
MK_CMDS std_rqs.c
CC std_rqs.c
CC invocation.c
CC help.c
help.c: In function `ss_help':
help.c:76: error: `SS_ET_NO_INFO_DIR' undeclared (first use in this function)
help.c:76: error: (Each undeclared identifier is reported only once
help.c:76: error: for each function it appears in.)
help.c: In function `ss_add_info_dir':
help.c:142: error: `SS_ET_NO_INFO_DIR' undeclared (first use in this function)
help.c: In function `ss_delete_info_dir':
help.c:186: error: `SS_ET_NO_INFO_DIR' undeclared (first use in this function)
make: *** [help.o] Error 1
make: Leaving directory `/var/tmp/portage/ss-1.39/work/e2fsprogs-1.39/lib/ss'
!!! ERROR: sys-libs/ss-1.39 failed.
Call stack:
ebuild.sh, line 1539: Called dyn_compile
ebuild.sh, line 939: Called src_compile
ss-1.39.ebuild, line 47: Called die
!!! make ss failed
!!! If you need support, post the topmost build error, and the call stack if relevant.
Done.