All pastes #135913 Raw Edit

Something

public text v1 · immutable
#135913 ·published 2006-08-17 08:43 UTC
rendered paste body
In file included from i386/dsputil_mmx.c:145:
i386/dsputil_mmx_rnd.h: In function 'put_no_rnd_pixels8_x2_mmx':
i386/dsputil_mmx_rnd.h:31: error: expected ':' or ')' before 'ASMALIGN'
i386/dsputil_mmx_rnd.h: In function 'put_no_rnd_pixels8_l2_mmx':
i386/dsputil_mmx_rnd.h:72: error: expected ':' or ')' before 'ASMALIGN'
i386/dsputil_mmx_rnd.h: In function 'put_no_rnd_pixels16_x2_mmx':
i386/dsputil_mmx_rnd.h:113: error: expected ':' or ')' before 'ASMALIGN'
i386/dsputil_mmx_rnd.h: In function 'put_no_rnd_pixels16_l2_mmx':
i386/dsputil_mmx_rnd.h:171: error: expected ':' or ')' before 'ASMALIGN'
i386/dsputil_mmx_rnd.h: In function 'put_no_rnd_pixels8_y2_mmx':
i386/dsputil_mmx_rnd.h:209: error: expected ':' or ')' before 'ASMALIGN'
i386/dsputil_mmx_rnd.h: In function 'put_no_rnd_pixels8_xy2_mmx':
i386/dsputil_mmx_rnd.h:249: error: expected ':' or ')' before 'ASMALIGN'
i386/dsputil_mmx_rnd.h: In function 'avg_no_rnd_pixels4_mmx':
i386/dsputil_mmx_rnd.h:302: error: expected string literal before 'ASMALIGN'
i386/dsputil_mmx_rnd.h: In function 'avg_no_rnd_pixels8_mmx':
i386/dsputil_mmx_rnd.h:322: error: expected string literal before 'ASMALIGN'
i386/dsputil_mmx_rnd.h: In function 'avg_no_rnd_pixels16_mmx':
i386/dsputil_mmx_rnd.h:341: error: expected string literal before 'ASMALIGN'
i386/dsputil_mmx_rnd.h: In function 'avg_no_rnd_pixels8_x2_mmx':
i386/dsputil_mmx_rnd.h:364: error: expected string literal before 'ASMALIGN'
i386/dsputil_mmx_rnd.h: In function 'avg_no_rnd_pixels8_l2_mmx':
i386/dsputil_mmx_rnd.h:384: error: expected string literal before 'ASMALIGN'
i386/dsputil_mmx_rnd.h: In function 'avg_no_rnd_pixels16_x2_mmx':
i386/dsputil_mmx_rnd.h:405: error: expected string literal before 'ASMALIGN'
i386/dsputil_mmx_rnd.h: In function 'avg_no_rnd_pixels16_l2_mmx':
i386/dsputil_mmx_rnd.h:431: error: expected string literal before 'ASMALIGN'
i386/dsputil_mmx_rnd.h: In function 'avg_no_rnd_pixels8_y2_mmx':
i386/dsputil_mmx_rnd.h:461: error: expected ':' or ')' before 'ASMALIGN'
i386/dsputil_mmx_rnd.h: In function 'avg_no_rnd_pixels8_xy2_mmx':
i386/dsputil_mmx_rnd.h:512: error: expected ':' or ')' before 'ASMALIGN'
In file included from i386/dsputil_mmx.c:159:
i386/dsputil_mmx_rnd.h: In function 'put_pixels8_x2_mmx':
i386/dsputil_mmx_rnd.h:31: error: expected ':' or ')' before 'ASMALIGN'
i386/dsputil_mmx_rnd.h: In function 'put_pixels8_l2_mmx':
i386/dsputil_mmx_rnd.h:72: error: expected ':' or ')' before 'ASMALIGN'
i386/dsputil_mmx_rnd.h: In function 'put_pixels16_x2_mmx':
i386/dsputil_mmx_rnd.h:113: error: expected ':' or ')' before 'ASMALIGN'
i386/dsputil_mmx_rnd.h: In function 'put_pixels16_l2_mmx':
i386/dsputil_mmx_rnd.h:171: error: expected ':' or ')' before 'ASMALIGN'
i386/dsputil_mmx_rnd.h: In function 'put_pixels8_y2_mmx':
i386/dsputil_mmx_rnd.h:209: error: expected ':' or ')' before 'ASMALIGN'
i386/dsputil_mmx_rnd.h: In function 'put_pixels8_xy2_mmx':
i386/dsputil_mmx_rnd.h:249: error: expected ':' or ')' before 'ASMALIGN'
i386/dsputil_mmx_rnd.h: In function 'avg_pixels4_mmx':
i386/dsputil_mmx_rnd.h:302: error: expected string literal before 'ASMALIGN'
i386/dsputil_mmx_rnd.h: In function 'avg_pixels8_mmx':
i386/dsputil_mmx_rnd.h:322: error: expected string literal before 'ASMALIGN'
i386/dsputil_mmx_rnd.h: In function 'avg_pixels16_mmx':
i386/dsputil_mmx_rnd.h:341: error: expected string literal before 'ASMALIGN'
i386/dsputil_mmx_rnd.h: In function 'avg_pixels8_x2_mmx':
i386/dsputil_mmx_rnd.h:364: error: expected string literal before 'ASMALIGN'
i386/dsputil_mmx_rnd.h: In function 'avg_pixels8_l2_mmx':
i386/dsputil_mmx_rnd.h:384: error: expected string literal before 'ASMALIGN'
i386/dsputil_mmx_rnd.h: In function 'avg_pixels16_x2_mmx':
i386/dsputil_mmx_rnd.h:405: error: expected string literal before 'ASMALIGN'
i386/dsputil_mmx_rnd.h: In function 'avg_pixels16_l2_mmx':
i386/dsputil_mmx_rnd.h:431: error: expected string literal before 'ASMALIGN'
i386/dsputil_mmx_rnd.h: In function 'avg_pixels8_y2_mmx':
i386/dsputil_mmx_rnd.h:461: error: expected ':' or ')' before 'ASMALIGN'
i386/dsputil_mmx_rnd.h: In function 'avg_pixels8_xy2_mmx':
i386/dsputil_mmx_rnd.h:512: error: expected ':' or ')' before 'ASMALIGN'
In file included from i386/dsputil_mmx.c:173:
i386/dsputil_mmx_avg.h: In function 'avg_pixels8_xy2_3dnow':
i386/dsputil_mmx_avg.h:757: error: expected ':' or ')' before 'ASMALIGN'
In file included from i386/dsputil_mmx.c:186:
i386/dsputil_mmx_avg.h: In function 'avg_pixels8_xy2_mmx2':
i386/dsputil_mmx_avg.h:757: error: expected ':' or ')' before 'ASMALIGN'
i386/dsputil_mmx.c: In function 'get_pixels_mmx':
i386/dsputil_mmx.c:204: error: expected ':' or ')' before 'ASMALIGN'
i386/dsputil_mmx.c: In function 'diff_pixels_mmx':
i386/dsputil_mmx.c:232: error: expected ':' or ')' before 'ASMALIGN'
i386/dsputil_mmx.c: In function 'put_pixels4_mmx':
i386/dsputil_mmx.c:375: error: expected ':' or ')' before 'ASMALIGN'
i386/dsputil_mmx.c: In function 'put_pixels8_mmx':
i386/dsputil_mmx.c:401: error: expected ':' or ')' before 'ASMALIGN'
i386/dsputil_mmx.c: In function 'put_pixels16_mmx':
i386/dsputil_mmx.c:427: error: expected ':' or ')' before 'ASMALIGN'
make[2]: *** [dsputil_mmx.o] Error 1