All pastes #1354654 Raw Edit

Miscellany

public text v1 · immutable
#1354654 ·published 2009-03-06 19:22 UTC
rendered paste body
>>> Unpacking source...
>>> Unpacking kdepimlibs-4.2.65.tar.lzma to /var/tmp/portage/kde-base/kdepimlibs-4.2.65/work
>>> Source unpacked in /var/tmp/portage/kde-base/kdepimlibs-4.2.65/work
>>> Configuring source in /var/tmp/portage/kde-base/kdepimlibs-4.2.65/work/kdepimlibs-4.2.65 ...
loading initial cache file /var/tmp/portage/kde-base/kdepimlibs-4.2.65/temp/gentoo_common_config.cmake
-- The C compiler identification is GNU
-- The CXX compiler identification is GNU
-- Check for working C compiler: /usr/bin/x86_64-pc-linux-gnu-gcc
-- Check for working C compiler: /usr/bin/x86_64-pc-linux-gnu-gcc -- works
-- Detecting C compiler ABI info
-- Detecting C compiler ABI info - done
-- Check for working CXX compiler: /usr/bin/x86_64-pc-linux-gnu-g++
-- Check for working CXX compiler: /usr/bin/x86_64-pc-linux-gnu-g++ -- works
-- Detecting CXX compiler ABI info
-- Detecting CXX compiler ABI info - done
-- Looking for Q_WS_X11
-- Looking for Q_WS_X11 - found
-- Looking for Q_WS_WIN
-- Looking for Q_WS_WIN - not found.
-- Looking for Q_WS_QWS
-- Looking for Q_WS_QWS - not found.
-- Looking for Q_WS_MAC
-- Looking for Q_WS_MAC - not found.
-- Found Qt-Version 4.5.0 (using /usr/bin/qmake)
-- Looking for XOpenDisplay in /usr/lib64/libX11.so;/usr/lib64/libXext.so;/usr/lib64/libXft.so;/usr/lib64/libXau.so;/usr/lib64/libXdmcp.so;/usr/lib64/libXpm.so
-- Looking for XOpenDisplay in /usr/lib64/libX11.so;/usr/lib64/libXext.so;/usr/lib64/libXft.so;/usr/lib64/libXau.so;/usr/lib64/libXdmcp.so;/usr/lib64/libXpm.so - found
-- Looking for gethostbyname
-- Looking for gethostbyname - found
-- Looking for connect
-- Looking for connect - found
-- Looking for remove
-- Looking for remove - found
-- Looking for shmat
-- Looking for shmat - found
-- Looking for IceConnectionNumber in ICE
-- Looking for IceConnectionNumber in ICE - found
-- Found X11: /usr/lib64/libX11.so
-- Looking for include files CMAKE_HAVE_PTHREAD_H
-- Looking for include files CMAKE_HAVE_PTHREAD_H - found
-- Looking for pthread_create in pthreads
-- Looking for pthread_create in pthreads - not found
-- Looking for pthread_create in pthread
-- Looking for pthread_create in pthread - found
-- Found Threads: TRUE
-- Found Automoc4: /usr/bin/automoc4
-- Found Perl: /usr/bin/perl
-- Performing Test _OFFT_IS_64BIT
-- Performing Test _OFFT_IS_64BIT - Success
-- Performing Test HAVE_FPIE_SUPPORT
-- Performing Test HAVE_FPIE_SUPPORT - Success
-- Performing Test __KDE_HAVE_W_OVERLOADED_VIRTUAL
-- Performing Test __KDE_HAVE_W_OVERLOADED_VIRTUAL - Success
-- Performing Test __KDE_HAVE_GCC_VISIBILITY
-- Performing Test __KDE_HAVE_GCC_VISIBILITY - Success
-- Phonon Version: 4.3.0
-- Found Phonon: /usr/lib64/libphonon.so
-- Found Phonon Includes: /usr/include/KDE;/usr/include
-- Found KDE 4.3 include dir: /usr/include
-- Found KDE 4.3 library dir: /usr/lib64
-- Found the KDE4 kconfig_compiler preprocessor: /usr/bin/kconfig_compiler
-- Found automoc4: /usr/bin/automoc4
-- Boost version: 1.35.0
-- Found the following Boost libraries:
-- Found Sasl2: /usr/include
-- Found gpgme-config at /usr/bin/gpgme-config
-- Found gpgme v1.1.8, checking for flavours...
--  Found flavour 'vanilla', checking whether it's usable...yes
--  Found flavour 'pthread', checking whether it's usable...yes
-- Usable gpgme flavours found:  vanilla pthread
-- Performing Test HAVE_GPGME_DATA_SET_FILE_NAME
-- Performing Test HAVE_GPGME_DATA_SET_FILE_NAME - Success
-- Performing Test HAVE_GPGME_INCLUDE_CERTS_DEFAULT
-- Performing Test HAVE_GPGME_INCLUDE_CERTS_DEFAULT - Success
-- Performing Test HAVE_GPGME_KEYLIST_MODE_SIG_NOTATIONS
-- Performing Test HAVE_GPGME_KEYLIST_MODE_SIG_NOTATIONS - Success
-- Performing Test HAVE_GPGME_KEY_SIG_NOTATIONS
-- Performing Test HAVE_GPGME_KEY_SIG_NOTATIONS - Success
-- Performing Test HAVE_GPGME_KEY_T_IS_QUALIFIED
-- Performing Test HAVE_GPGME_KEY_T_IS_QUALIFIED - Success
-- Performing Test HAVE_GPGME_SIG_NOTATION_CRITICAL
-- Performing Test HAVE_GPGME_SIG_NOTATION_CRITICAL - Success
-- Performing Test HAVE_GPGME_SIG_NOTATION_FLAGS_T
-- Performing Test HAVE_GPGME_SIG_NOTATION_FLAGS_T - Success
-- Performing Test HAVE_GPGME_SIG_NOTATION_HUMAN_READABLE
-- Performing Test HAVE_GPGME_SIG_NOTATION_HUMAN_READABLE - Success
-- Performing Test HAVE_GPGME_SUBKEY_T_IS_QUALIFIED
-- Performing Test HAVE_GPGME_SUBKEY_T_IS_QUALIFIED - Success
-- Performing Test HAVE_GPGME_ENGINE_INFO_T_HOME_DIR
-- Performing Test HAVE_GPGME_ENGINE_INFO_T_HOME_DIR - Success
-- Performing Test HAVE_GPGME_CTX_GETSET_ENGINE_INFO
-- Performing Test HAVE_GPGME_CTX_GETSET_ENGINE_INFO - Success
-- Performing Test HAVE_GPGME_SIG_NOTATION_CLEARADDGET
-- Performing Test HAVE_GPGME_SIG_NOTATION_CLEARADDGET - Success
-- Performing Test HAVE_GPGME_DECRYPT_RESULT_T_FILE_NAME
-- Performing Test HAVE_GPGME_DECRYPT_RESULT_T_FILE_NAME - Success
-- Performing Test HAVE_GPGME_DECRYPT_RESULT_T_RECIPIENTS
-- Performing Test HAVE_GPGME_DECRYPT_RESULT_T_RECIPIENTS - Success
-- Performing Test HAVE_GPGME_VERIFY_RESULT_T_FILE_NAME
-- Performing Test HAVE_GPGME_VERIFY_RESULT_T_FILE_NAME - Success
-- Performing Test HAVE_GPGME_SIGNATURE_T_PKA_FIELDS
-- Performing Test HAVE_GPGME_SIGNATURE_T_PKA_FIELDS - Success
-- Performing Test HAVE_GPGME_SIGNATURE_T_ALGORITHM_FIELDS
-- Performing Test HAVE_GPGME_SIGNATURE_T_ALGORITHM_FIELDS - Success
-- Performing Test HAVE_GPGME_SIGNATURE_T_CHAIN_MODEL
-- Performing Test HAVE_GPGME_SIGNATURE_T_CHAIN_MODEL - Success
-- Looking for gpgme_get_fdptr
-- Looking for gpgme_get_fdptr - not found
-- Looking for gpgme_op_getauditlog
-- Looking for gpgme_op_getauditlog - found
-- Performing Test HAVE_GPGME_PROTOCOL_GPGCONF
-- Performing Test HAVE_GPGME_PROTOCOL_GPGCONF - Success
-- Looking for gpgme_cancel_async
-- Looking for gpgme_cancel_async - found
-- Performing Test HAVE_GPG_ERR_NO_PASSPHRASE
-- Performing Test HAVE_GPG_ERR_NO_PASSPHRASE - Failed
-- Performing Test HAVE_GPG_ERR_ALREADY_SIGNED
-- Performing Test HAVE_GPG_ERR_ALREADY_SIGNED - Failed
-- Looking for include files HAVE_SYS_SELECT_H
-- Looking for include files HAVE_SYS_SELECT_H - found
-- Looking for include files HAVE_SYS_SOCKET_H
-- Looking for include files HAVE_SYS_SOCKET_H - found
-- Looking for include files HAVE_SYS_TYPES_H
-- Looking for include files HAVE_SYS_TYPES_H - found
-- Performing Test HAVE_TIMEZONE
-- Performing Test HAVE_TIMEZONE - Success
-- Performing Test HAVE_TM_GMTOFF
-- Performing Test HAVE_TM_GMTOFF - Success
-- Found Akonadi: /usr/lib64/libakonadiprotocolinternals.so
-- Found Akonadi includes: /usr/include
-- Found Akonadi common libraries: /usr/lib64/libakonadiprotocolinternals.so
-- Found Akonadi dbus-interfaces: /usr/share/dbus-1/interfaces
-- Found Libical version 0.43
-- Found LIBICAL: /usr/lib64/libical.so;/usr/lib64/libicalss.so
-- Looking for include files HAVE_STDINT_H
-- Looking for include files HAVE_STDINT_H - found
-- Looking for include files HAVE_STDLIB_H
-- Looking for include files HAVE_STDLIB_H - found
-- Looking for include files HAVE_WCTYPE_H
-- Looking for include files HAVE_WCTYPE_H - found
-- Looking for include files HAVE_GETOPT_H
-- Looking for include files HAVE_GETOPT_H - found
-- Looking for iswspace
-- Looking for iswspace - found
-- Looking for include files HAVE_ERR_H
-- Looking for include files HAVE_ERR_H - found
-- Looking for include files HAVE_SYS_CDEFS_H
-- Looking for include files HAVE_SYS_CDEFS_H - found
-- Looking for include files HAVE_SYS_TIME_H
-- Looking for include files HAVE_SYS_TIME_H - found

-----------------------------------------------------------------------------
-- The following external packages were located on your system.
-- This installation will have the extra features provided by these packages.
-----------------------------------------------------------------------------
   * boost - Boost C++ Libraries
   * cyrus-sasl - Cyrus SASL API
   * gpgme - GnuPG Made Easy Development Libraries
   * libical - Reference implementation of the iCalendar data type and serialization format

-----------------------------------------------------------------------------
-- The following OPTIONAL packages could NOT be located on your system.
-- Consider installing them to enable more features from this software.
-----------------------------------------------------------------------------
   * OpenLDAP  <http://www.openldap.org>
     LDAP (Lightweight Directory Access Protocol) libraries
     STRONGLY RECOMMENDED: Needed to provide LDAP functionality in KDE

-----------------------------------------------------------------------------

-- <<< Gentoo configuration >>>
Build type: Gentoo
Install path: /usr

-- Configuring done
-- Generating done
-- Build files have been written to: /var/tmp/portage/kde-base/kdepimlibs-4.2.65/work/kdepimlibs_build
>>> Source configured.
>>> Compiling source in /var/tmp/portage/kde-base/kdepimlibs-4.2.65/work/kdepimlibs-4.2.65 ...
make -j3 
[35m[1mScanning dependencies of target ldap-handbook
[0m[  0%] [34m[1mGenerating index.cache.bz2
[0m[35m[1mScanning dependencies of target imap-handbook
[0m[  0%] [34m[1mGenerating index.cache.bz2
[0m[35m[1mScanning dependencies of target kresources-handbook
[0m[  0%] [34m[1mGenerating index.cache.bz2
[0m[  0%] Built target ldap-handbook
[35m[1mScanning dependencies of target nntp-handbook
[0m[  0%] [34m[1mGenerating index.cache.bz2
[0m[  0%] Built target imap-handbook
[  0%] [35m[1mScanning dependencies of target pop3-handbook
[0mBuilt target kresources-handbook
[35m[1mScanning dependencies of target smtp-handbook
[0m[  0%] [  0%] [34m[1mGenerating index.cache.bz2
[0m[34m[1mGenerating index.cache.bz2
[0m[  0%] Built target nntp-handbook
[35m[1mScanning dependencies of target gpgmepp_automoc
[0m[  0%] Built target gpgmepp_automoc
[35m[1mScanning dependencies of target gpgmepp-pthread_automoc
[  0%] [0mBuilt target pop3-handbook
[35m[1mScanning dependencies of target qgpgme_automoc
[0m[  0%] Built target smtp-handbook
[34m[1mGenerating eventloopinteractor.moc
[0m[35m[1mScanning dependencies of target kmime_automoc
[0m[  0%] [  0%] Built target gpgmepp-pthread_automoc
Built target kmime_automoc
[35m[1mScanning dependencies of target akonadi-kde_automoc
[0m[35m[1mScanning dependencies of target akonadi-kabc_automoc
[0m[  0%] Built target qgpgme_automoc
[  0%] Built target akonadi-kabc_automoc
[35m[1mScanning dependencies of target kresources_automoc
[0m[34m[1mGenerating configwidget.moc
[0m[35m[1mScanning dependencies of target akonadi-kmime_automoc
[0m[34m[1mGenerating agentbase_p.moc
[0m[34m[1mGenerating configpage.moc
[0m[34m[1mGenerating messagemodel.moc
[0m[34m[1mGenerating messagethreaderproxymodel.moc
[0m[34m[1mGenerating collectioncreatejob.moc
[0m[  0%] Built target akonadi-kmime_automoc
[34m[1mGenerating managerimpl.moc
[0m[34m[1mGenerating job.moc
[0m[35m[1mScanning dependencies of target kabc_automoc
[0m[34m[1mGenerating collectionmodifyjob.moc
[0m[34m[1mGenerating configdialog.moc
[0m[34m[1mGenerating erroroverlay_p.moc
[0m[34m[1mGenerating emailselectdialog.moc
[0m[34m[1mGenerating resource.moc
[0m[34m[1mGenerating itemmovejob.moc
[0m[34m[1mGenerating collectionrequester.moc
[0m[  0%] Built target kresources_automoc
[34m[1mGenerating addresseedialog.moc
[0m[35m[1mScanning dependencies of target kldap_automoc
[0m[34m[1mGenerating transactionjobs.moc
[0m[34m[1mGenerating collectionstatisticsdelegate.moc
[0m[34m[1mGenerating ldapconfigwidget.moc
[0m[34m[1mGenerating monitor_p.moc
[0m[34m[1mGenerating ldapstructureproxymodel.moc
[0m[34m[1mGenerating resourcecached.moc
[0m[34m[1mGenerating agentbase.moc
[0m[34m[1mGenerating ldapattributeproxymodel.moc
[0m[34m[1mGenerating ldapsearch.moc
[0m[34m[1mGenerating ldapmodel.moc
[0m[34m[1mGenerating firstrun.moc
[0m[34m[1mGenerating selftestdialog_p.moc
[0m[  0%] [34m[1mGenerating subscriptiondialog.moc
[0m[34m[1mGenerating resource.moc
[0mBuilt target kldap_automoc
[35m[1mScanning dependencies of target kabcformat_binary_automoc
[0m[  0%] [34m[1mGenerating subscriptionchangeproxymodel.moc
[0mBuilt target kabcformat_binary_automoc
[34m[1mGenerating addresslineedit.moc
[0m[34m[1mGenerating changerecorder.moc
[0m[34m[1mGenerating agentinstancemodel.moc
[0m[34m[1mGenerating lock.moc
[0m[35m[1mScanning dependencies of target kabc_file_core_automoc
[0m[34m[1mGenerating itemdeletejob.moc
[0m[34m[1mGenerating resourcefileconfig.moc
[0m[34m[1mGenerating resourceabc.moc
[0m[34m[1mGenerating itemfetchjob.moc
[0m[34m[1mGenerating agentinstancewidget.moc
[0m[34m[1mGenerating itemmodifyjob.moc
[0m[34m[1mGenerating resourcefile.moc
[0m[34m[1mGenerating addresseehelper.moc
[0m[34m[1mGenerating collectiongeneralpropertiespage.moc
[0m[34m[1mGenerating addressbook.moc
[0m[  0%] Built target kabc_file_core_automoc
[35m[1mScanning dependencies of target kcal_automoc
[0m[34m[1mGenerating collectionfetchjob.moc
[0m[34m[1mGenerating distributionlistdialog.moc
[0m[34m[1mGenerating calendar.moc
[0m[  0%] Built target kabc_automoc
[35m[1mScanning dependencies of target kpimutils_automoc
[0m[34m[1mGenerating monitor.moc
[0m[34m[1mGenerating collectionpathresolver_p.moc
[0m[34m[1mGenerating resourcecalendar.moc
[0m[  0%] [34m[1mGenerating control.moc
[0m[34m[1mGenerating agentfilterproxymodel.moc
[0mBuilt target kpimutils_automoc
[34m[1mGenerating itemview.moc
[0m[35m[1mScanning dependencies of target kabc_file_automoc
[0m[  0%] Built target kabc_file_automoc
[35m[1mScanning dependencies of target kabc_directory_automoc
[0m[34m[1mGenerating resourcedirconfig.moc
[0m[34m[1mGenerating resourcescheduler.moc
[0m[34m[1mGenerating unlinkjob.moc
[0m[34m[1mGenerating resourcelocal.moc
[0m[34m[1mGenerating agentinstancecreatejob.moc
[0m[34m[1mGenerating collectioncopyjob.moc
[0m[34m[1mGenerating subscriptionjob.moc
[0m[34m[1mGenerating resourcedir.moc
[0m[34m[1mGenerating flatcollectionproxymodel.moc
[0m[34m[1mGenerating calendarresources.moc
[0m[34m[1mGenerating searchcreatejob.moc
[0m[34m[1mGenerating agenttypemodel.moc
[0m[34m[1mGenerating agenttypewidget.moc
[0m[  0%] Built target kabc_directory_automoc
[35m[1mScanning dependencies of target kabc_net_automoc
[0m[34m[1mGenerating resourcenetconfig.moc
[0m[34m[1mGenerating resourcelocaldirconfig.moc
[0m[34m[1mGenerating collectionfilterproxymodel.moc
[0m[34m[1mGenerating collectionstatisticsmodel.moc
[0m[34m[1mGenerating standardactionmanager.moc
[0m[34m[1mGenerating resourcenet.moc
[0m[34m[1mGenerating resourcelocalconfig.moc
[0m[34m[1mGenerating collectiondialog.moc
[0m[34m[1mGenerating collectiondeletejob.moc
[0m[34m[1mGenerating resourcelocaldir.moc
[0m[34m[1mGenerating itemsync.moc
[0m[  0%] Built target kabc_net_automoc
[34m[1mGenerating expungejob.moc
[0m[35m[1mScanning dependencies of target kabc_ldapkio_automoc
[0m[34m[1mGenerating collectionmodel.moc
[0m[34m[1mGenerating resourceldapkio.moc
[0m[34m[1mGenerating resourcecached.moc
[0m[34m[1mGenerating itemmodel.moc
[0m[34m[1mGenerating servermanager.moc
[0m[34m[1mGenerating subscriptionmodel.moc
[0m[34m[1mGenerating resourceldapkioconfig.moc
[0m[34m[1mGenerating transactionsequence.moc
[0m[34m[1mGenerating resourcecachedconfig.moc
[0m[34m[1mGenerating collectionview.moc
[0m[  0%] Built target kcal_automoc
[  0%] Built target kabc_ldapkio_automoc
[34m[1mGenerating collectionpropertiespage.moc
[0m[35m[1mScanning dependencies of target syndication_automoc
[0m[34m[1mGenerating collectionsync.moc
[0m[35m[1mScanning dependencies of target kblog_automoc
[0m[34m[1mGenerating agenttypedialog.moc
[0m[34m[1mGenerating metaweblog.moc
[0m[34m[1mGenerating movabletype.moc
[0m[34m[1mGenerating dataretriever.moc
[0m[34m[1mGenerating session.moc
[0m[34m[1mGenerating wordpressbuggy.moc
[0m[34m[1mGenerating itemmonitor_p.moc
[0m[34m[1mGenerating loader.moc
[0m[34m[1mGenerating gdata.moc
[0m[34m[1mGenerating linkjob.moc
[0m[  0%] [34m[1mGenerating blog.moc
[0m[34m[1mGenerating blogger1.moc
[0mBuilt target syndication_automoc
[  0%] Built target kblog_automoc
[34m[1mGenerating agentmanager.moc
[0m[35m[1mScanning dependencies of target kcal_local_automoc
[0m[  0%] Built target kcal_local_automoc
[35m[1mScanning dependencies of target kxmlrpcclient_automoc
[0m[34m[1mGenerating client.moc
[0m[34m[1mGenerating collectionselectjob.moc
[0m[35m[1mScanning dependencies of target kcal_localdir_automoc
[0m[34m[1mGenerating query.moc
[0m[  0%] [34m[1mGenerating collectionstatisticsjob.moc
[0mBuilt target kcal_localdir_automoc
[35m[1mScanning dependencies of target kholidays_automoc
[0m[  0%] Built target kxmlrpcclient_automoc
[34m[1mGenerating resourcebase.moc
[0m[35m[1mScanning dependencies of target kimap_automoc
[0m[34m[1mGenerating cachepolicypage.moc
[0m[  0%] Built target kholidays_automoc
[34m[1mGenerating itemcopyjob.moc
[0m[  0%] [35m[1mScanning dependencies of target kpimidentities_automoc
[0mBuilt target kimap_automoc
[34m[1mGenerating identitycombo.moc
[35m[1mScanning dependencies of target kcm_kresources_automoc
[0m[34m[1mGenerating collectionpropertiesdialog.moc
[0m[0m[34m[1mGenerating kcmkresources.moc
[0m[34m[1mGenerating identitymanager.moc
[0m[34m[1mGenerating itemcreatejob.moc
[0m[34m[1mGenerating signatureconfigurator.moc
[0m[  0%] [  0%] Built target kcm_kresources_automoc
Built target akonadi-kde_automoc
[35m[1mScanning dependencies of target kcm_mailtransport_automoc
[0m[  0%] [35m[1mScanning dependencies of target ktnef_automoc
[0m[  0%] Built target kcm_mailtransport_automoc
Built target kpimidentities_automoc
[35m[1mScanning dependencies of target mailtransport_automoc
[0m[34m[1mGenerating socket.moc
[0m[  0%] [35m[1mScanning dependencies of target kio_sieve_automoc
Built target ktnef_automoc
[0m[34m[1mGenerating sendmailjob.moc
[0m[35m[1mScanning dependencies of target kio_imap4_automoc
[0m[  0%] Built target kio_sieve_automoc
[35m[1mScanning dependencies of target kio_ldap_automoc
[0m[34m[1mGenerating transportmanager.moc
[0m[  0%] Built target kio_ldap_automoc
[35m[1mScanning dependencies of target kio_mbox_automoc
[0m[  0%] Built target kio_mbox_automoc
[  0%] Built target kio_imap4_automoc
[34m[1mGenerating transportconfigdialog.moc
[0m[35m[1mScanning dependencies of target kio_nntp_automoc
[0m[35m[1mScanning dependencies of target kio_pop3_automoc
[0m[34m[1mGenerating transportmanagementwidget.moc
[0m[  0%] [  0%] Built target kio_nntp_automoc
Built target kio_pop3_automoc
[34m[1mGenerating smtpjob.moc
[0m[35m[1mScanning dependencies of target kio_smtp_automoc
[0m[34m[1mGenerating precommandjob.moc
[0m[  0%] Built target kio_smtp_automoc
[34m[1mGenerating transportcombobox.moc
[0m[35m[1mScanning dependencies of target gpgmepp-pthread
[35m[1mScanning dependencies of target gpgmepp
[34m[1mGenerating servertest.moc
[0m[  0%] Built target mailtransport_automoc
[35m[1mScanning dependencies of target kmime
[0m[0m[  1%] [32mBuilding CXX object gpgme++/CMakeFiles/gpgmepp.dir/gpgmepp_automoc.o
[0m[  1%] [32mBuilding CXX object gpgme++/CMakeFiles/gpgmepp.dir/exception.o
[0m[  1%] [32mBuilding CXX object gpgme++/CMakeFiles/gpgmepp-pthread.dir/gpgmepp-pthread_automoc.o
[0m[0m[  1%] [32mBuilding CXX object kmime/CMakeFiles/kmime.dir/kmime_automoc.o
[0m[  1%] [32mBuilding CXX object gpgme++/CMakeFiles/gpgmepp-pthread.dir/exception.o
[0m[  1%] [32mBuilding CXX object kmime/CMakeFiles/kmime.dir/kmime_charfreq.o
[0m[  1%] [32mBuilding CXX object gpgme++/CMakeFiles/gpgmepp.dir/context.o
[0m[  1%] [32mBuilding CXX object kmime/CMakeFiles/kmime.dir/kmime_util.o
[0m[  1%] [32mBuilding CXX object gpgme++/CMakeFiles/gpgmepp-pthread.dir/context.o
[0m[  1%] [32mBuilding CXX object kmime/CMakeFiles/kmime.dir/kmime_mdn.o
[0m[  1%] [32mBuilding CXX object gpgme++/CMakeFiles/gpgmepp.dir/key.o
[0m[  2%] [32mBuilding CXX object kmime/CMakeFiles/kmime.dir/kmime_codecs.o
[0mIn file included from /var/tmp/portage/kde-base/kdepimlibs-4.2.65/work/kdepimlibs-4.2.65/kmime/kmime_codecs.cpp:38:
/var/tmp/portage/kde-base/kdepimlibs-4.2.65/work/kdepimlibs-4.2.65/kmime/kmime_codecs.h:184: warning: 'virtual bool KMime::Codec::encode(const char*&, const char*, char*&, const char*, bool) const' was hidden
/var/tmp/portage/kde-base/kdepimlibs-4.2.65/work/kdepimlibs-4.2.65/kmime/kmime_codec_identity.h:67: warning:   by 'virtual QByteArray KMime::IdentityCodec::encode(const QByteArray&, bool) const'
/var/tmp/portage/kde-base/kdepimlibs-4.2.65/work/kdepimlibs-4.2.65/kmime/kmime_codecs.h:222: warning: 'virtual bool KMime::Codec::decode(const char*&, const char*, char*&, const char*, bool) const' was hidden
/var/tmp/portage/kde-base/kdepimlibs-4.2.65/work/kdepimlibs-4.2.65/kmime/kmime_codec_identity.h:73: warning:   by 'virtual QByteArray KMime::IdentityCodec::decode(const QByteArray&, bool) const'
[  2%] [32mBuilding CXX object gpgme++/CMakeFiles/gpgmepp-pthread.dir/key.o
[0m[  2%] [32mBuilding CXX object kmime/CMakeFiles/kmime.dir/kmime_codec_base64.o
[0m[  2%] [32mBuilding CXX object gpgme++/CMakeFiles/gpgmepp.dir/trustitem.o
[0m[  2%] [32mBuilding CXX object gpgme++/CMakeFiles/gpgmepp.dir/data.o
[0m[  2%] [32mBuilding CXX object kmime/CMakeFiles/kmime.dir/kmime_codec_uuencode.o
[0m[  2%] [32mBuilding CXX object gpgme++/CMakeFiles/gpgmepp-pthread.dir/trustitem.o
[0m[  2%] [32mBuilding CXX object kmime/CMakeFiles/kmime.dir/kmime_codec_qp.o
[0m[  2%] [32mBuilding CXX object gpgme++/CMakeFiles/gpgmepp.dir/callbacks.o
[0m/var/tmp/portage/kde-base/kdepimlibs-4.2.65/work/kdepimlibs-4.2.65/gpgme++/callbacks.cpp: In function 'gpgme_error_t passphrase_callback(void*, const char*, const char*, int, int)':
/var/tmp/portage/kde-base/kdepimlibs-4.2.65/work/kdepimlibs-4.2.65/gpgme++/callbacks.cpp:86: warning: ignoring return value of 'ssize_t write(int, const void*, size_t)', declared with attribute warn_unused_result
[  4%] [32mBuilding CXX object gpgme++/CMakeFiles/gpgmepp.dir/eventloopinteractor.o
[0m[  4%] /var/tmp/portage/kde-base/kdepimlibs-4.2.65/work/kdepimlibs-4.2.65/kmime/kmime_codec_qp.cpp: In member function 'virtual bool KMime::Rfc2047QEncodingEncoder::encode(const char*&, const char*, char*&, const char*)':
/var/tmp/portage/kde-base/kdepimlibs-4.2.65/work/kdepimlibs-4.2.65/kmime/kmime_codec_qp.cpp:672: warning: 'value' may be used uninitialized in this function
[32mBuilding CXX object gpgme++/CMakeFiles/gpgmepp-pthread.dir/data.o
[0m/var/tmp/portage/kde-base/kdepimlibs-4.2.65/work/kdepimlibs-4.2.65/kmime/kmime_codec_qp.cpp: In member function 'virtual bool KMime::Rfc2047QEncodingEncoder::finish(char*&, const char*)':
/var/tmp/portage/kde-base/kdepimlibs-4.2.65/work/kdepimlibs-4.2.65/kmime/kmime_codec_qp.cpp:717: warning: 'value' may be used uninitialized in this function
[  4%] [32mBuilding CXX object kmime/CMakeFiles/kmime.dir/kmime_codec_identity.o
[0m[  4%] [32mBuilding CXX object gpgme++/CMakeFiles/gpgmepp.dir/editinteractor.o
[0m[  5%] [32mBuilding CXX object gpgme++/CMakeFiles/gpgmepp-pthread.dir/callbacks.o
[0mIn file included from /var/tmp/portage/kde-base/kdepimlibs-4.2.65/work/kdepimlibs-4.2.65/kmime/kmime_codec_identity.cpp:35:
/var/tmp/portage/kde-base/kdepimlibs-4.2.65/work/kdepimlibs-4.2.65/kmime/kmime_codecs.h:184: warning: 'virtual bool KMime::Codec::encode(const char*&, const char*, char*&, const char*, bool) const' was hidden
/var/tmp/portage/kde-base/kdepimlibs-4.2.65/work/kdepimlibs-4.2.65/kmime/kmime_codec_identity.h:67: warning:   by 'virtual QByteArray KMime::IdentityCodec::encode(const QByteArray&, bool) const'
/var/tmp/portage/kde-base/kdepimlibs-4.2.65/work/kdepimlibs-4.2.65/kmime/kmime_codecs.h:222: warning: 'virtual bool KMime::Codec::decode(const char*&, const char*, char*&, const char*, bool) const' was hidden
/var/tmp/portage/kde-base/kdepimlibs-4.2.65/work/kdepimlibs-4.2.65/kmime/kmime_codec_identity.h:73: warning:   by 'virtual QByteArray KMime::IdentityCodec::decode(const QByteArray&, bool) const'
/var/tmp/portage/kde-base/kdepimlibs-4.2.65/work/kdepimlibs-4.2.65/gpgme++/editinteractor.cpp: In static member function 'static int GpgME::CallbackHelper::edit_interactor_callback_impl(void*, gpgme_status_code_t, const char*, int)':
/var/tmp/portage/kde-base/kdepimlibs-4.2.65/work/kdepimlibs-4.2.65/gpgme++/editinteractor.cpp:111: warning: comparison between signed and unsigned integer expressions
[  5%] [32mBuilding CXX object kmime/CMakeFiles/kmime.dir/kmime_parsers.o
[0m/var/tmp/portage/kde-base/kdepimlibs-4.2.65/work/kdepimlibs-4.2.65/gpgme++/callbacks.cpp: In function 'gpgme_error_t passphrase_callback(void*, const char*, const char*, int, int)':
/var/tmp/portage/kde-base/kdepimlibs-4.2.65/work/kdepimlibs-4.2.65/gpgme++/callbacks.cpp:86: warning: ignoring return value of 'ssize_t write(int, const void*, size_t)', declared with attribute warn_unused_result
[  5%] [  5%] [32mBuilding CXX object gpgme++/CMakeFiles/gpgmepp.dir/keylistresult.o
[0m[32mBuilding CXX object gpgme++/CMakeFiles/gpgmepp-pthread.dir/eventloopinteractor.o
[0m[  5%] [32mBuilding CXX object gpgme++/CMakeFiles/gpgmepp-pthread.dir/editinteractor.o
[0m[  5%] [32mBuilding CXX object gpgme++/CMakeFiles/gpgmepp.dir/keygenerationresult.o
[0m/var/tmp/portage/kde-base/kdepimlibs-4.2.65/work/kdepimlibs-4.2.65/gpgme++/editinteractor.cpp: In static member function 'static int GpgME::CallbackHelper::edit_interactor_callback_impl(void*, gpgme_status_code_t, const char*, int)':
/var/tmp/portage/kde-base/kdepimlibs-4.2.65/work/kdepimlibs-4.2.65/gpgme++/editinteractor.cpp:111: warning: comparison between signed and unsigned integer expressions
[  5%] [32mBuilding CXX object gpgme++/CMakeFiles/gpgmepp-pthread.dir/keylistresult.o
[0m[  6%] [32mBuilding CXX object kmime/CMakeFiles/kmime.dir/kmime_header_parsing.o
[0m[  6%] [32mBuilding CXX object gpgme++/CMakeFiles/gpgmepp.dir/importresult.o
[0m[  6%] [32mBuilding CXX object gpgme++/CMakeFiles/gpgmepp-pthread.dir/keygenerationresult.o
[0m[  6%] [32mBuilding CXX object gpgme++/CMakeFiles/gpgmepp-pthread.dir/importresult.o
[0m[  6%] [32mBuilding CXX object gpgme++/CMakeFiles/gpgmepp.dir/decryptionresult.o
[0m[  6%] [  6%] [32mBuilding CXX object gpgme++/CMakeFiles/gpgmepp.dir/verificationresult.o
[0m[32mBuilding CXX object gpgme++/CMakeFiles/gpgmepp-pthread.dir/decryptionresult.o
[0m[  8%] [32mBuilding CXX object gpgme++/CMakeFiles/gpgmepp-pthread.dir/verificationresult.o
[0m[  8%] [32mBuilding CXX object kmime/CMakeFiles/kmime.dir/kmime_content.o
[0m[  9%] [32mBuilding CXX object gpgme++/CMakeFiles/gpgmepp.dir/signingresult.o
[0m[  9%] [32mBuilding CXX object gpgme++/CMakeFiles/gpgmepp-pthread.dir/signingresult.o
[0m[  9%] [32mBuilding CXX object gpgme++/CMakeFiles/gpgmepp.dir/encryptionresult.o
[0m[  9%] [  9%] [32mBuilding CXX object gpgme++/CMakeFiles/gpgmepp-pthread.dir/encryptionresult.o
[0m[32mBuilding CXX object kmime/CMakeFiles/kmime.dir/kmime_contentindex.o
[0m[  9%] [32mBuilding CXX object gpgme++/CMakeFiles/gpgmepp.dir/engineinfo.o
[0m[  9%] [32mBuilding CXX object gpgme++/CMakeFiles/gpgmepp.dir/gpgsetexpirytimeeditinteractor.o
[0m[  9%] [32mBuilding CXX object kmime/CMakeFiles/kmime.dir/kmime_headers.o
[0m[  9%] [32mBuilding CXX object gpgme++/CMakeFiles/gpgmepp-pthread.dir/engineinfo.o
[0m[  9%] [32mBuilding CXX object gpgme++/CMakeFiles/gpgmepp.dir/gpgsetownertrusteditinteractor.o
[0m[  9%] [32mBuilding CXX object gpgme++/CMakeFiles/gpgmepp-pthread.dir/gpgsetexpirytimeeditinteractor.o
[0m[  9%] [32mBuilding CXX object gpgme++/CMakeFiles/gpgmepp-pthread.dir/gpgsetownertrusteditinteractor.o
[0m[  9%] [32mBuilding CXX object gpgme++/CMakeFiles/gpgmepp.dir/gpgsignkeyeditinteractor.o
[0m[  9%] [32mBuilding CXX object gpgme++/CMakeFiles/gpgmepp-pthread.dir/gpgsignkeyeditinteractor.o
[0m[  9%] [ 10%] [32mBuilding CXX object gpgme++/CMakeFiles/gpgmepp-pthread.dir/gpgadduserideditinteractor.o
[0m[32mBuilding CXX object gpgme++/CMakeFiles/gpgmepp.dir/gpgadduserideditinteractor.o
[0m[ 10%] [ 12%] [32mBuilding CXX object gpgme++/CMakeFiles/gpgmepp.dir/context_vanilla.o
[0m[32mBuilding CXX object gpgme++/CMakeFiles/gpgmepp-pthread.dir/context_vanilla.o
[0m[31m[1mLinking CXX shared library ../lib/libgpgme++.so
[0m[31m[1mLinking CXX shared library ../lib/libgpgme++-pthread.so
[0m[ 12%] Built target gpgmepp-pthread
[ 12%] [ 12%] [32mBuilding CXX object kmime/CMakeFiles/kmime.dir/kmime_message.o
[0mBuilt target gpgmepp
[ 12%] [34m[1mGenerating ui_selftestdialog.h
[0m[ 12%] [34m[1mGenerating notificationmanagerinterface.cpp, notificationmanagerinterface.h
[0m[ 12%] [34m[1mGenerating agentmanagerinterface.cpp, agentmanagerinterface.h
[0m[ 13%] [34m[1mGenerating tracerinterface.cpp, tracerinterface.h
[0m[ 13%] [34m[1mGenerating resourceadaptor.cpp, resourceadaptor.h
[0m[ 13%] [34m[1mGenerating statusadaptor.cpp, statusadaptor.h
[0m[ 13%] [34m[1mGenerating controladaptor.cpp, controladaptor.h
[0m[ 13%] [34m[1mGenerating ui_cachepolicypage.h
[0m[ 13%] [34m[1mGenerating ui_collectiongeneralpropertiespage.h
[0m[ 13%] [34m[1mGenerating ui_subscriptiondialog.h
[0m[ 13%] [34m[1mGenerating ui_controlprogressindicator.h
[0m[ 13%] [34m[1mGenerating notificationmanagerinterface.moc
[0m[ 13%] [34m[1mGenerating agentmanagerinterface.moc
[0m[ 13%] [32mBuilding CXX object kmime/CMakeFiles/kmime.dir/kmime_newsarticle.o
[0m[ 13%] [34m[1mGenerating tracerinterface.moc
[0m[ 13%] [34m[1mGenerating resourceadaptor.moc
[0m[ 13%] [ 13%] [34m[1mGenerating statusadaptor.moc
[0m[32mBuilding CXX object kmime/CMakeFiles/kmime.dir/kmime_dateformatter.o
[0m[ 14%] [34m[1mGenerating controladaptor.moc
[0m[35m[1mScanning dependencies of target akonadi-kde
[ 16%] [32mBuilding CXX object kmime/CMakeFiles/kmime.dir/boolflags.o
[0m[ 16%] [32mBuilding CXX object kmime/CMakeFiles/kmime.dir/kautodeletehash.o
[0m[ 17%] [34m[1mGenerating kresourcesmanageradaptor.cpp, kresourcesmanageradaptor.h
[0m[ 17%] [34m[1mGenerating kresourcesmanageradaptor.moc
[0m[31m[1mLinking CXX shared library ../lib/libkmime.so
[0m[35m[1mScanning dependencies of target kresources
[ 17%] Built target kmime
[35m[1mScanning dependencies of target kldap
[0m[ 17%] [32mBuilding CXX object kresources/CMakeFiles/kresources.dir/kresources_automoc.o
[0m[ 17%] [32mBuilding CXX object kresources/CMakeFiles/kresources.dir/resource.o
[0m[0m[ 17%] [32mBuilding CXX object kldap/CMakeFiles/kldap.dir/kldap_automoc.o
[0m[ 18%] [32mBuilding CXX object kldap/CMakeFiles/kldap.dir/ber.o
[0m[0m[ 18%] [ 18%] [32mBuilding CXX object akonadi/CMakeFiles/akonadi-kde.dir/akonadi-kde_automoc.o
[0m[32mBuilding CXX object kldap/CMakeFiles/kldap.dir/ldif.o
[0m[ 18%] [32mBuilding CXX object akonadi/CMakeFiles/akonadi-kde.dir/entity.o
[0m[ 18%] [32mBuilding CXX object kresources/CMakeFiles/kresources.dir/factory.o
[0m[ 18%] [32mBuilding CXX object kldap/CMakeFiles/kldap.dir/ldapurl.o
[0m[ 18%] [32mBuilding CXX object akonadi/CMakeFiles/akonadi-kde.dir/agentbase.o
[0m[ 20%] [32mBuilding CXX object kresources/CMakeFiles/kresources.dir/managerimpl.o
[0m[ 20%] [32mBuilding CXX object kldap/CMakeFiles/kldap.dir/ldapserver.o
[0m[ 21%] [32mBuilding CXX object akonadi/CMakeFiles/akonadi-kde.dir/agentfilterproxymodel.o
[0m[ 21%] [32mBuilding CXX object kldap/CMakeFiles/kldap.dir/ldapobject.o
[0m[ 21%] [32mBuilding CXX object akonadi/CMakeFiles/akonadi-kde.dir/agentinstance.o
[0m[ 21%] [32mBuilding CXX object kldap/CMakeFiles/kldap.dir/ldapconnection.o
[0m[ 21%] [32mBuilding CXX object kresources/CMakeFiles/kresources.dir/configwidget.o
[0m/var/tmp/portage/kde-base/kdepimlibs-4.2.65/work/kdepimlibs-4.2.65/kldap/ldapconnection.cpp:139: warning: unused parameter 'code'
/var/tmp/portage/kde-base/kdepimlibs-4.2.65/work/kdepimlibs-4.2.65/kldap/ldapconnection.cpp:365: warning: unused parameter 'option'
/var/tmp/portage/kde-base/kdepimlibs-4.2.65/work/kdepimlibs-4.2.65/kldap/ldapconnection.cpp:365: warning: unused parameter 'value'
/var/tmp/portage/kde-base/kdepimlibs-4.2.65/work/kdepimlibs-4.2.65/kldap/ldapconnection.cpp:371: warning: unused parameter 'option'
/var/tmp/portage/kde-base/kdepimlibs-4.2.65/work/kdepimlibs-4.2.65/kldap/ldapconnection.cpp:371: warning: unused parameter 'value'
/var/tmp/portage/kde-base/kdepimlibs-4.2.65/work/kdepimlibs-4.2.65/kldap/ldapconnection.cpp:389: warning: unused parameter 'sizelimit'
/var/tmp/portage/kde-base/kdepimlibs-4.2.65/work/kdepimlibs-4.2.65/kldap/ldapconnection.cpp:401: warning: unused parameter 'timelimit'
/var/tmp/portage/kde-base/kdepimlibs-4.2.65/work/kdepimlibs-4.2.65/kldap/ldapconnection.cpp:31: warning: 'callbacks' defined but not used
[ 22%] [32mBuilding CXX object kldap/CMakeFiles/kldap.dir/ldapoperation.o
[0m[ 22%] [32mBuilding CXX object kresources/CMakeFiles/kresources.dir/configdialog.o
[0m[ 22%] [32mBuilding CXX object akonadi/CMakeFiles/akonadi-kde.dir/agentinstancecreatejob.o
[0m/var/tmp/portage/kde-base/kdepimlibs-4.2.65/work/kdepimlibs-4.2.65/kldap/ldapoperation.cpp:1181: warning: unused parameter 'creds'
/var/tmp/portage/kde-base/kdepimlibs-4.2.65/work/kdepimlibs-4.2.65/kldap/ldapoperation.cpp:1181: warning: unused parameter 'saslproc'
/var/tmp/portage/kde-base/kdepimlibs-4.2.65/work/kdepimlibs-4.2.65/kldap/ldapoperation.cpp:1181: warning: unused parameter 'data'
/var/tmp/portage/kde-base/kdepimlibs-4.2.65/work/kdepimlibs-4.2.65/kldap/ldapoperation.cpp:1187: warning: unused parameter 'saslproc'
/var/tmp/portage/kde-base/kdepimlibs-4.2.65/work/kdepimlibs-4.2.65/kldap/ldapoperation.cpp:1187: warning: unused parameter 'data'
/var/tmp/portage/kde-base/kdepimlibs-4.2.65/work/kdepimlibs-4.2.65/kldap/ldapoperation.cpp:1194: warning: unused parameter 'base'
/var/tmp/portage/kde-base/kdepimlibs-4.2.65/work/kdepimlibs-4.2.65/kldap/ldapoperation.cpp:1194: warning: unused parameter 'scope'
/var/tmp/portage/kde-base/kdepimlibs-4.2.65/work/kdepimlibs-4.2.65/kldap/ldapoperation.cpp:1194: warning: unused parameter 'filter'
/var/tmp/portage/kde-base/kdepimlibs-4.2.65/work/kdepimlibs-4.2.65/kldap/ldapoperation.cpp:1194: warning: unused parameter 'attributes'
/var/tmp/portage/kde-base/kdepimlibs-4.2.65/work/kdepimlibs-4.2.65/kldap/ldapoperation.cpp:1200: warning: unused parameter 'object'
/var/tmp/portage/kde-base/kdepimlibs-4.2.65/work/kdepimlibs-4.2.65/kldap/ldapoperation.cpp:1206: warning: unused parameter 'object'
/var/tmp/portage/kde-base/kdepimlibs-4.2.65/work/kdepimlibs-4.2.65/kldap/ldapoperation.cpp:1212: warning: unused parameter 'dn'
/var/tmp/portage/kde-base/kdepimlibs-4.2.65/work/kdepimlibs-4.2.65/kldap/ldapoperation.cpp:1212: warning: unused parameter 'ops'
/var/tmp/portage/kde-base/kdepimlibs-4.2.65/work/kdepimlibs-4.2.65/kldap/ldapoperation.cpp:1218: warning: unused parameter 'dn'
/var/tmp/portage/kde-base/kdepimlibs-4.2.65/work/kdepimlibs-4.2.65/kldap/ldapoperation.cpp:1218: warning: unused parameter 'ops'
/var/tmp/portage/kde-base/kdepimlibs-4.2.65/work/kdepimlibs-4.2.65/kldap/ldapoperation.cpp:1225: warning: unused parameter 'dn'
/var/tmp/portage/kde-base/kdepimlibs-4.2.65/work/kdepimlibs-4.2.65/kldap/ldapoperation.cpp:1225: warning: unused parameter 'newRdn'
/var/tmp/portage/kde-base/kdepimlibs-4.2.65/work/kdepimlibs-4.2.65/kldap/ldapoperation.cpp:1225: warning: unused parameter 'newSuperior'
/var/tmp/portage/kde-base/kdepimlibs-4.2.65/work/kdepimlibs-4.2.65/kldap/ldapoperation.cpp:1225: warning: unused parameter 'deleteold'
/var/tmp/portage/kde-base/kdepimlibs-4.2.65/work/kdepimlibs-4.2.65/kldap/ldapoperation.cpp:1232: warning: unused parameter 'dn'
/var/tmp/portage/kde-base/kdepimlibs-4.2.65/work/kdepimlibs-4.2.65/kldap/ldapoperation.cpp:1232: warning: unused parameter 'newRdn'
/var/tmp/portage/kde-base/kdepimlibs-4.2.65/work/kdepimlibs-4.2.65/kldap/ldapoperation.cpp:1232: warning: unused parameter 'newSuperior'
/var/tmp/portage/kde-base/kdepimlibs-4.2.65/work/kdepimlibs-4.2.65/kldap/ldapoperation.cpp:1232: warning: unused parameter 'deleteold'
/var/tmp/portage/kde-base/kdepimlibs-4.2.65/work/kdepimlibs-4.2.65/kldap/ldapoperation.cpp:1238: warning: unused parameter 'dn'
/var/tmp/portage/kde-base/kdepimlibs-4.2.65/work/kdepimlibs-4.2.65/kldap/ldapoperation.cpp:1244: warning: unused parameter 'dn'
/var/tmp/portage/kde-base/kdepimlibs-4.2.65/work/kdepimlibs-4.2.65/kldap/ldapoperation.cpp:1250: warning: unused parameter 'dn'
/var/tmp/portage/kde-base/kdepimlibs-4.2.65/work/kdepimlibs-4.2.65/kldap/ldapoperation.cpp:1250: warning: unused parameter 'ops'
/var/tmp/portage/kde-base/kdepimlibs-4.2.65/work/kdepimlibs-4.2.65/kldap/ldapoperation.cpp:1256: warning: unused parameter 'dn'
/var/tmp/portage/kde-base/kdepimlibs-4.2.65/work/kdepimlibs-4.2.65/kldap/ldapoperation.cpp:1256: warning: unused parameter 'ops'
/var/tmp/portage/kde-base/kdepimlibs-4.2.65/work/kdepimlibs-4.2.65/kldap/ldapoperation.cpp:1262: warning: unused parameter 'dn'
/var/tmp/portage/kde-base/kdepimlibs-4.2.65/work/kdepimlibs-4.2.65/kldap/ldapoperation.cpp:1262: warning: unused parameter 'attr'
/var/tmp/portage/kde-base/kdepimlibs-4.2.65/work/kdepimlibs-4.2.65/kldap/ldapoperation.cpp:1262: warning: unused parameter 'value'
/var/tmp/portage/kde-base/kdepimlibs-4.2.65/work/kdepimlibs-4.2.65/kldap/ldapoperation.cpp:1268: warning: unused parameter 'oid'
/var/tmp/portage/kde-base/kdepimlibs-4.2.65/work/kdepimlibs-4.2.65/kldap/ldapoperation.cpp:1268: warning: unused parameter 'data'
/var/tmp/portage/kde-base/kdepimlibs-4.2.65/work/kdepimlibs-4.2.65/kldap/ldapoperation.cpp:1274: warning: unused parameter 'dn'
/var/tmp/portage/kde-base/kdepimlibs-4.2.65/work/kdepimlibs-4.2.65/kldap/ldapoperation.cpp:1274: warning: unused parameter 'attr'
/var/tmp/portage/kde-base/kdepimlibs-4.2.65/work/kdepimlibs-4.2.65/kldap/ldapoperation.cpp:1274: warning: unused parameter 'value'
/var/tmp/portage/kde-base/kdepimlibs-4.2.65/work/kdepimlibs-4.2.65/kldap/ldapoperation.cpp:1280: warning: unused parameter 'oid'
/var/tmp/portage/kde-base/kdepimlibs-4.2.65/work/kdepimlibs-4.2.65/kldap/ldapoperation.cpp:1280: warning: unused parameter 'data'
/var/tmp/portage/kde-base/kdepimlibs-4.2.65/work/kdepimlibs-4.2.65/kldap/ldapoperation.cpp:1286: warning: unused parameter 'id'
/var/tmp/portage/kde-base/kdepimlibs-4.2.65/work/kdepimlibs-4.2.65/kldap/ldapoperation.cpp:1286: warning: unused parameter 'msecs'
/var/tmp/portage/kde-base/kdepimlibs-4.2.65/work/kdepimlibs-4.2.65/kldap/ldapoperation.cpp:1292: warning: unused parameter 'id'
[ 22%] [32mBuilding CXX object kresources/CMakeFiles/kresources.dir/selectdialog.o
[0m/var/tmp/portage/kde-base/kdepimlibs-4.2.65/work/kdepimlibs-4.2.65/kldap/ldapoperation.cpp:54: warning: 'int kldap_timeout_value(int, int)' defined but not used
[ 22%] [32mBuilding CXX object kldap/CMakeFiles/kldap.dir/ldapcontrol.o
[0m[ 22%] [ 22%] [32mBuilding CXX object akonadi/CMakeFiles/akonadi-kde.dir/agentinstancemodel.o
[0m[32mBuilding CXX object kldap/CMakeFiles/kldap.dir/ldapsearch.o
[0m[ 22%] [32mBuilding CXX object kresources/CMakeFiles/kresources.dir/configpage.o
[0m[ 22%] [32mBuilding CXX object akonadi/CMakeFiles/akonadi-kde.dir/agentinstancewidget.o
[0m[ 22%] [32mBuilding CXX object kldap/CMakeFiles/kldap.dir/ldapconfigwidget.o
[0m[ 22%] [32mBuilding CXX object akonadi/CMakeFiles/akonadi-kde.dir/agentmanager.o
[0m[ 22%] [32mBuilding CXX object kresources/CMakeFiles/kresources.dir/idmapper.o
[0m[ 22%] [32mBuilding CXX object kldap/CMakeFiles/kldap.dir/ldapdn.o
[0m[ 22%] [32mBuilding CXX object kldap/CMakeFiles/kldap.dir/ldapmodelnode_p.o
[0m[ 22%] [32mBuilding CXX object kldap/CMakeFiles/kldap.dir/ldapmodel.o
[0m[ 22%] [32mBuilding CXX object kresources/CMakeFiles/kresources.dir/kresourcesmanageradaptor.o
[0m[ 24%] [32mBuilding CXX object kldap/CMakeFiles/kldap.dir/ldapmodel_p.o
[0m[ 24%] [32mBuilding CXX object akonadi/CMakeFiles/akonadi-kde.dir/agenttype.o
[0m[ 24%] [ 25%] [32mBuilding CXX object akonadi/CMakeFiles/akonadi-kde.dir/agenttypemodel.o
[0m[32mBuilding CXX object kldap/CMakeFiles/kldap.dir/ldapstructureproxymodel.o
[0m[31m[1mLinking CXX shared library ../lib/libkresources.so
[0m[ 25%] Built target kresources
[ 25%] [32mBuilding CXX object akonadi/CMakeFiles/akonadi-kde.dir/agenttypewidget.o
[0m[ 25%] [32mBuilding CXX object akonadi/CMakeFiles/akonadi-kde.dir/agenttypedialog.o
[0m[ 25%] [32mBuilding CXX object kldap/CMakeFiles/kldap.dir/ldapattributeproxymodel.o
[0m[31m[1mLinking CXX shared library ../lib/libkldap.so
[0m[ 25%] [32mBuilding CXX object akonadi/CMakeFiles/akonadi-kde.dir/attribute.o
[0m[ 25%] [32mBuilding CXX object akonadi/CMakeFiles/akonadi-kde.dir/attributefactory.o
[0m[ 25%] [32mBuilding CXX object akonadi/CMakeFiles/akonadi-kde.dir/cachepolicy.o
[0m[ 25%] Built target kldap
[ 25%] [32mBuilding CXX object akonadi/CMakeFiles/akonadi-kde.dir/cachepolicypage.o
[0m[35m[1mScanning dependencies of target kpimutils
[35m[1mScanning dependencies of target syndication
[0m[ 27%] [32mBuilding CXX object kpimutils/CMakeFiles/kpimutils.dir/kpimutils_automoc.o
[0m[ 27%] [32mBuilding CXX object kpimutils/CMakeFiles/kpimutils.dir/email.o
[0m[ 28%] [32mBuilding CXX object akonadi/CMakeFiles/akonadi-kde.dir/changerecorder.o
[0m[ 28%] [32mBuilding CXX object kpimutils/CMakeFiles/kpimutils.dir/linklocator.o
[0m[0m[ 28%] [ 28%] [32mBuilding CXX object akonadi/CMakeFiles/akonadi-kde.dir/collection.o
[0m[32mBuilding CXX object syndication/CMakeFiles/syndication.dir/syndication_automoc.o
[0m[ 29%] [32mBuilding CXX object syndication/CMakeFiles/syndication.dir/rss2/category.o
[0m[ 29%] [32mBuilding CXX object syndication/CMakeFiles/syndication.dir/rss2/cloud.o
[0m[ 29%] [32mBuilding CXX object kpimutils/CMakeFiles/kpimutils.dir/spellingfilter.o
[0m[ 29%] [32mBuilding CXX object kpimutils/CMakeFiles/kpimutils.dir/kfileio.o
[0m[ 29%] [32mBuilding CXX object syndication/CMakeFiles/syndication.dir/rss2/document.o
[0m[ 29%] [32mBuilding CXX object akonadi/CMakeFiles/akonadi-kde.dir/collectioncopyjob.o
[0m[ 29%] [32mBuilding CXX object akonadi/CMakeFiles/akonadi-kde.dir/collectioncreatejob.o
[0m[ 29%] [32mBuilding CXX object akonadi/CMakeFiles/akonadi-kde.dir/collectiondeletejob.o
[31m[1mLinking CXX shared library ../lib/libkpimutils.so
[0m[0m[ 29%] [32mBuilding CXX object akonadi/CMakeFiles/akonadi-kde.dir/collectiondialog.o
[0m[ 29%] Built target kpimutils
[ 29%] [32mBuilding CXX object syndication/CMakeFiles/syndication.dir/rss2/enclosure.o
[0m[ 29%] [32mBuilding CXX object syndication/CMakeFiles/syndication.dir/rss2/image.o
[0m[ 29%] [32mBuilding CXX object syndication/CMakeFiles/syndication.dir/rss2/item.o
[0m[ 29%] [32mBuilding CXX object syndication/CMakeFiles/syndication.dir/rss2/parser.o
[0m[ 29%] [32mBuilding CXX object akonadi/CMakeFiles/akonadi-kde.dir/collectionfilterproxymodel.o
[0m[ 31%] [32mBuilding CXX object syndication/CMakeFiles/syndication.dir/rss2/source.o
[0m[ 32%] [32mBuilding CXX object akonadi/CMakeFiles/akonadi-kde.dir/collectiongeneralpropertiespage.o
[0m[ 32%] [32mBuilding CXX object syndication/CMakeFiles/syndication.dir/rss2/textinput.o
[0m[ 32%] [32mBuilding CXX object syndication/CMakeFiles/syndication.dir/rss2/tools_p.o
[0m[ 32%] [32mBuilding CXX object syndication/CMakeFiles/syndication.dir/rdf/parser.o
[0m[ 32%] [32mBuilding CXX object syndication/CMakeFiles/syndication.dir/rdf/dublincorevocab.o
[0m[ 32%] [32mBuilding CXX object akonadi/CMakeFiles/akonadi-kde.dir/collectionfetchjob.o
[0m[ 32%] [32mBuilding CXX object akonadi/CMakeFiles/akonadi-kde.dir/collectionmodel.o
[0m[ 32%] [32mBuilding CXX object syndication/CMakeFiles/syndication.dir/rdf/dublincore.o
[0m[ 32%] [32mBuilding CXX object akonadi/CMakeFiles/akonadi-kde.dir/collectionmodel_p.o
[0m[ 32%] [32mBuilding CXX object syndication/CMakeFiles/syndication.dir/rdf/syndicationvocab.o
[0m[ 32%] [32mBuilding CXX object akonadi/CMakeFiles/akonadi-kde.dir/collectionmodifyjob.o
[0m[ 33%] [32mBuilding CXX object syndication/CMakeFiles/syndication.dir/rdf/syndicationinfo.o
[0m[ 33%] [32mBuilding CXX object akonadi/CMakeFiles/akonadi-kde.dir/collectionpathresolver.o
[0m[ 33%] [32mBuilding CXX object syndication/CMakeFiles/syndication.dir/rdf/contentvocab.o
[0m[ 33%] [32mBuilding CXX object akonadi/CMakeFiles/akonadi-kde.dir/collectionpropertiesdialog.o
[0m[ 33%] [32mBuilding CXX object syndication/CMakeFiles/syndication.dir/rdf/item.o
[0m[35m[1mScanning dependencies of target kxmlrpcclient
[0m[ 33%] [32mBuilding CXX object kxmlrpcclient/CMakeFiles/kxmlrpcclient.dir/kxmlrpcclient_automoc.o
[0m[ 33%] [32mBuilding CXX object kxmlrpcclient/CMakeFiles/kxmlrpcclient.dir/client.o
[0m[ 33%] [32mBuilding CXX object syndication/CMakeFiles/syndication.dir/rdf/image.o
[0m[ 35%] [32mBuilding CXX object akonadi/CMakeFiles/akonadi-kde.dir/collectionpropertiespage.o
[0m[ 35%] [32mBuilding CXX object syndication/CMakeFiles/syndication.dir/rdf/textinput.o
[0m[ 35%] [32mBuilding CXX object akonadi/CMakeFiles/akonadi-kde.dir/collectionrequester.o
[0m[ 35%] [32mBuilding CXX object syndication/CMakeFiles/syndication.dir/rdf/document.o
[0m[ 35%] [32mBuilding CXX object kxmlrpcclient/CMakeFiles/kxmlrpcclient.dir/query.o
[0m[ 35%] [32mBuilding CXX object akonadi/CMakeFiles/akonadi-kde.dir/collectionrightsattribute.o
[0m[ 35%] [32mBuilding CXX object syndication/CMakeFiles/syndication.dir/rdf/rssvocab.o
[0m[ 35%] [32mBuilding CXX object akonadi/CMakeFiles/akonadi-kde.dir/collectionselectjob.o
[0m[31m[1mLinking CXX shared library ../lib/libkxmlrpcclient.so
[0m[ 35%] [32mBuilding CXX object akonadi/CMakeFiles/akonadi-kde.dir/collectionstatistics.o
[0m[ 35%] [ 35%] [32mBuilding CXX object akonadi/CMakeFiles/akonadi-kde.dir/collectionstatisticsdelegate.o
[0mBuilt target kxmlrpcclient
[ 36%] [32mBuilding CXX object syndication/CMakeFiles/syndication.dir/rdf/node.o
[0m[ 36%] [32mBuilding CXX object syndication/CMakeFiles/syndication.dir/rdf/property.o
[0m[ 36%] [32mBuilding CXX object syndication/CMakeFiles/syndication.dir/rdf/literal.o
[0m[ 36%] [32mBuilding CXX object akonadi/CMakeFiles/akonadi-kde.dir/collectionstatisticsjob.o
[0m[ 37%] [32mBuilding CXX object akonadi/CMakeFiles/akonadi-kde.dir/collectionstatisticsmodel.o
[0m[ 37%] [32mBuilding CXX object syndication/CMakeFiles/syndication.dir/rdf/resource.o
[0m[ 37%] [32mBuilding CXX object akonadi/CMakeFiles/akonadi-kde.dir/collectionsync.o
[0m[ 37%] [ 37%] [32mBuilding CXX object akonadi/CMakeFiles/akonadi-kde.dir/collectionview.o
[0m[32mBuilding CXX object syndication/CMakeFiles/syndication.dir/rdf/model.o
[0m[35m[1mScanning dependencies of target kholidays
[0m[ 37%] [32mBuilding CXX object kholidays/CMakeFiles/kholidays.dir/kholidays_automoc.o
[0m[ 37%] [32mBuilding CXX object kholidays/CMakeFiles/kholidays.dir/holidays.o
[0m[ 37%] [32mBuilding C object kholidays/CMakeFiles/kholidays.dir/scanholiday.o
[0m[ 37%] scanholiday.c: In function 'kcallex':
scanholiday.lex:96: warning: ignoring return value of 'fwrite', declared with attribute warn_unused_result
scanholiday.lex: At top level:[32mBuilding CXX object akonadi/CMakeFiles/akonadi-kde.dir/control.o
[0m
scanholiday.c:1541: warning: 'input' defined but not used
[ 37%] [32mBuilding C object kholidays/CMakeFiles/kholidays.dir/parseholiday.o
[0mparseholiday.c:331:6: warning: "YYENABLE_NLS" is not defined
parseholiday.c:878:6: warning: "YYLTYPE_IS_TRIVIAL" is not defined
[ 37%] [32mBuilding CXX object syndication/CMakeFiles/syndication.dir/rdf/modelmaker.o
[0m[ 39%] [32mBuilding CXX object kholidays/CMakeFiles/kholidays.dir/astroseasons.o
[0m[ 39%] [ 39%] [32mBuilding CXX object akonadi/CMakeFiles/akonadi-kde.dir/entitydisplayattribute.o
[0m[32mBuilding CXX object kholidays/CMakeFiles/kholidays.dir/lunarphase.o
[0m[ 39%] [32mBuilding CXX object syndication/CMakeFiles/syndication.dir/rdf/rdfvocab.o
[0m[ 39%] [32mBuilding CXX object kholidays/CMakeFiles/kholidays.dir/zodiac.o
[0m[ 39%] [32mBuilding CXX object akonadi/CMakeFiles/akonadi-kde.dir/erroroverlay.o
[0m[31m[1mLinking CXX shared library ../lib/libkholidays.so
[0m[ 40%] [32mBuilding CXX object syndication/CMakeFiles/syndication.dir/rdf/sequence.o
[0m[ 40%] Built target kholidays
[ 41%] [32mBuilding CXX object akonadi/CMakeFiles/akonadi-kde.dir/expungejob.o
[0m[ 41%] [ 41%] [32mBuilding CXX object syndication/CMakeFiles/syndication.dir/rdf/statement.o
[0m[32mBuilding CXX object akonadi/CMakeFiles/akonadi-kde.dir/firstrun.o
[0m[ 41%] [32mBuilding CXX object akonadi/CMakeFiles/akonadi-kde.dir/flatcollectionproxymodel.o
[0m[ 41%] [32mBuilding CXX object syndication/CMakeFiles/syndication.dir/rdf/resourcewrapper.o
[0m[ 41%] [32mBuilding CXX object akonadi/CMakeFiles/akonadi-kde.dir/item.o
[0m[ 41%] [32mBuilding CXX object syndication/CMakeFiles/syndication.dir/rdf/nodevisitor.o
[0m[ 41%] [32mBuilding CXX object syndication/CMakeFiles/syndication.dir/atom/category.o
[0m[ 41%] [32mBuilding CXX object akonadi/CMakeFiles/akonadi-kde.dir/itemcreatejob.o
[0m[ 41%] [32mBuilding CXX object syndication/CMakeFiles/syndication.dir/atom/constants.o
[0m[ 41%] [32mBuilding CXX object syndication/CMakeFiles/syndication.dir/atom/content.o
[0m[ 41%] [32mBuilding CXX object akonadi/CMakeFiles/akonadi-kde.dir/itemcopyjob.o
[0m[ 41%] [32mBuilding CXX object akonadi/CMakeFiles/akonadi-kde.dir/itemdeletejob.o
[0m[ 43%] [32mBuilding CXX object syndication/CMakeFiles/syndication.dir/atom/document.o
[0m[ 44%] [32mBuilding CXX object akonadi/CMakeFiles/akonadi-kde.dir/itemfetchjob.o
[0m[ 44%] [32mBuilding CXX object akonadi/CMakeFiles/akonadi-kde.dir/itemfetchscope.o
[0m/var/tmp/portage/kde-base/kdepimlibs-4.2.65/work/kdepimlibs-4.2.65/akonadi/itemfetchjob.cpp: In member function 'void Akonadi::ItemFetchJobPrivate::startFetchJob()':
/var/tmp/portage/kde-base/kdepimlibs-4.2.65/work/kdepimlibs-4.2.65/akonadi/itemfetchjob.cpp:90: error: expected `;' before 'AKONADI_PARAM_EXTERNALPAYLOAD'
make[2]: *** [akonadi/CMakeFiles/akonadi-kde.dir/itemfetchjob.o] Error 1
make[2]: *** Waiting for unfinished jobs....
[35m[1mScanning dependencies of target kimap
[0m[ 44%] [32mBuilding CXX object kimap/CMakeFiles/kimap.dir/kimap_automoc.o
[0m[ 44%] [32mBuilding CXX object kimap/CMakeFiles/kimap.dir/rfccodecs.o
[0mmake[1]: *** [akonadi/CMakeFiles/akonadi-kde.dir/all] Error 2
make[1]: *** Waiting for unfinished jobs....
[ 44%] [32mBuilding CXX object syndication/CMakeFiles/syndication.dir/atom/entry.o
[0m[ 44%] [32mBuilding CXX object syndication/CMakeFiles/syndication.dir/atom/generator.o
[0m[31m[1mLinking CXX shared library ../lib/libkimap.so
[0m[ 44%] [32mBuilding CXX object syndication/CMakeFiles/syndication.dir/atom/link.o
[0m[ 44%] Built target kimap
[ 44%] [32mBuilding CXX object syndication/CMakeFiles/syndication.dir/atom/parser.o
[0m[ 44%] [32mBuilding CXX object syndication/CMakeFiles/syndication.dir/atom/person.o
[0m[ 44%] [32mBuilding CXX object syndication/CMakeFiles/syndication.dir/atom/source.o
[0m[ 45%] [32mBuilding CXX object syndication/CMakeFiles/syndication.dir/atom/atomtools.o
[0m[ 45%] [32mBuilding CXX object syndication/CMakeFiles/syndication.dir/mapper/feedrss2impl.o
[0m[ 45%] [32mBuilding CXX object syndication/CMakeFiles/syndication.dir/mapper/itemrss2impl.o
[0m[ 45%] [32mBuilding CXX object syndication/CMakeFiles/syndication.dir/mapper/enclosurerss2impl.o
[0m[ 45%] [32mBuilding CXX object syndication/CMakeFiles/syndication.dir/mapper/categoryrss2impl.o
[0m[ 45%] [32mBuilding CXX object syndication/CMakeFiles/syndication.dir/mapper/imagerss2impl.o
[0m[ 47%] [32mBuilding CXX object syndication/CMakeFiles/syndication.dir/mapper/feedrdfimpl.o
[0m[ 47%] [32mBuilding CXX object syndication/CMakeFiles/syndication.dir/mapper/itemrdfimpl.o
[0m[ 47%] [32mBuilding CXX object syndication/CMakeFiles/syndication.dir/mapper/imagerdfimpl.o
[0m[ 47%] [32mBuilding CXX object syndication/CMakeFiles/syndication.dir/mapper/feedatomimpl.o
[0m[ 47%] [32mBuilding CXX object syndication/CMakeFiles/syndication.dir/mapper/itematomimpl.o
[0m[ 47%] [32mBuilding CXX object syndication/CMakeFiles/syndication.dir/mapper/enclosureatomimpl.o
[0m[ 47%] [32mBuilding CXX object syndication/CMakeFiles/syndication.dir/mapper/categoryatomimpl.o
[0m[ 48%] [32mBuilding CXX object syndication/CMakeFiles/syndication.dir/documentsource.o
[0m[ 48%] [32mBuilding CXX object syndication/CMakeFiles/syndication.dir/documentvisitor.o
[0m[ 48%] [32mBuilding CXX object syndication/CMakeFiles/syndication.dir/elementwrapper.o
[0m[ 48%] [32mBuilding CXX object syndication/CMakeFiles/syndication.dir/constants.o
[0m[ 48%] [ 48%] [32mBuilding CXX object syndication/CMakeFiles/syndication.dir/feed.o
[0m[32mBuilding CXX object syndication/CMakeFiles/syndication.dir/item.o
[0m[ 48%] [32mBuilding CXX object syndication/CMakeFiles/syndication.dir/enclosure.o
[0m[ 50%] [32mBuilding CXX object syndication/CMakeFiles/syndication.dir/category.o
[0m[ 50%] [32mBuilding CXX object syndication/CMakeFiles/syndication.dir/image.o
[0m[ 50%] [32mBuilding CXX object syndication/CMakeFiles/syndication.dir/tools.o
[0m[ 50%] [32mBuilding CXX object syndication/CMakeFiles/syndication.dir/person.o
[0m[ 50%] [32mBuilding CXX object syndication/CMakeFiles/syndication.dir/personimpl.o
[0m[ 50%] [ 50%] [32mBuilding CXX object syndication/CMakeFiles/syndication.dir/loader.o
[0m[32mBuilding CXX object syndication/CMakeFiles/syndication.dir/global.o
[0m[ 51%] [32mBuilding CXX object syndication/CMakeFiles/syndication.dir/dataretriever.o
[0m[ 51%] [32mBuilding CXX object syndication/CMakeFiles/syndication.dir/specificitemvisitor.o
[0m[ 51%] [32mBuilding CXX object syndication/CMakeFiles/syndication.dir/specificitem.o
[0m[ 51%] [32mBuilding CXX object syndication/CMakeFiles/syndication.dir/specificdocument.o
[0m[ 51%] [32mBuilding CXX object syndication/CMakeFiles/syndication.dir/abstractparser.o
[0m[31m[1mLinking CXX shared library ../lib/libsyndication.so
[0m[ 51%] Built target syndication
make: *** [all] Error 2
 [31;01m*[0m 
 [31;01m*[0m ERROR: kde-base/kdepimlibs-4.2.65 failed.
 [31;01m*[0m Call stack:
 [31;01m*[0m               ebuild.sh, line   49:  Called src_compile
 [31;01m*[0m             environment, line 3146:  Called kde4-base_src_compile
 [31;01m*[0m             environment, line 2343:  Called kde4-base_src_make
 [31;01m*[0m             environment, line 2393:  Called cmake-utils_src_make
 [31;01m*[0m             environment, line  823:  Called die
 [31;01m*[0m The specific snippet of code:
 [31;01m*[0m           emake "$@" || die "Make failed!";
 [31;01m*[0m  The die message:
 [31;01m*[0m   Make failed!
 [31;01m*[0m 
 [31;01m*[0m If you need support, post the topmost build error, and the call stack if relevant.
 [31;01m*[0m A complete build log is located at '/var/tmp/portage/kde-base/kdepimlibs-4.2.65/temp/build.log'.
 [31;01m*[0m The ebuild environment file is located at '/var/tmp/portage/kde-base/kdepimlibs-4.2.65/temp/environment'.
 [31;01m*[0m This ebuild is from an overlay named 'kde': '/usr/local/portage/layman/kde-testing/'
 [31;01m*[0m