mkdir /lfs/glibc-build/socket
mkdir /lfs/glibc-build/sysvipc
mkdir /lfs/glibc-build/gmon
mkdir /lfs/glibc-build/gnulib
mkdir /lfs/glibc-build/wctype
mkdir /lfs/glibc-build/manual
mkdir /lfs/glibc-build/shadow
mkdir /lfs/glibc-build/po
mkdir /lfs/glibc-build/argp
mkdir /lfs/glibc-build/crypt
../nptl/sysdeps/unix/sysv/linux/sem_post.c: In function '__new_sem_post':
../nptl/sysdeps/unix/sysv/linux/sem_post.c:34: warning: unused variable 'nr'
../nptl/sysdeps/unix/sysv/linux/sem_post.c: In function '__new_sem_post':
../nptl/sysdeps/unix/sysv/linux/sem_post.c:34: warning: unused variable 'nr'
../nptl/sysdeps/unix/sysv/linux/sem_post.c: In function '__old_sem_post':
../nptl/sysdeps/unix/sysv/linux/sem_post.c:58: warning: unused variable 'nr'
mkdir /lfs/glibc-build/resolv
mkdir /lfs/glibc-build/nss
mkdir /lfs/glibc-build/rt
mkdir /lfs/glibc-build/conform
mkdir /lfs/glibc-build/debug
mkdir /lfs/glibc-build/nptl_db
mkdir /lfs/glibc-build/inet
mkdir /lfs/glibc-build/hesiod
mkdir /lfs/glibc-build/sunrpc
mkdir /lfs/glibc-build/nis
mkdir /lfs/glibc-build/nscd
mkdir /lfs/glibc-build/streams
mkdir /lfs/glibc-build/login
mkdir /lfs/glibc-build/elf
dl-load.c: In function '_dl_map_object':
dl-load.c:168: warning: inlining failed in call to 'local_strdup': call is unlikely and code size would grow
dl-load.c:2156: warning: called from here
dl-load.c:168: warning: inlining failed in call to 'local_strdup': call is unlikely and code size would grow
dl-load.c:2182: warning: called from here
dl-load.c:168: warning: inlining failed in call to 'local_strdup': call is unlikely and code size would grow
dl-load.c:2218: warning: called from here
dl-load.c: In function '_dl_map_object':
dl-load.c:168: warning: inlining failed in call to 'local_strdup': call is unlikely and code size would grow
dl-load.c:2156: warning: called from here
dl-load.c:168: warning: inlining failed in call to 'local_strdup': call is unlikely and code size would grow
dl-load.c:2182: warning: called from here
dl-load.c:168: warning: inlining failed in call to 'local_strdup': call is unlikely and code size would grow
dl-load.c:2218: warning: called from here
dl-runtime.c: In function '_dl_call_pltexit':
dl-runtime.c:438: warning: passing argument 5 of 'afct-><U3f18>.arm_gnu_pltexit' discards qualifiers from pointer target type
/lfs/glibc-build/libc_pic.a(errno.os): In function `__libc_use_alloca':
../nptl/sysdeps/pthread/allocalim.h:28: multiple definition of `__libc_use_alloca'
/lfs/glibc-build/libc_pic.a(check_fds.os):../nptl/sysdeps/pthread/allocalim.h:28: first defined here
/lfs/glibc-build/libc_pic.a(divdi3.os): In function `__libc_use_alloca':
../nptl/sysdeps/pthread/allocalim.h:28: multiple definition of `__libc_use_alloca'
/lfs/glibc-build/libc_pic.a(check_fds.os):../nptl/sysdeps/pthread/allocalim.h:28: first defined here
collect2: ld returned 1 exit status
make[2]: *** [/lfs/glibc-build/elf/librtld.map] Error 1
make[1]: *** [elf/subdir_lib] Error 2
make: *** [all] Error 2