All pastes #1344607 Raw Edit

clueless

public text v1 · immutable
#1344607 ·published 2009-02-23 02:46 UTC
rendered paste body
orie:/home/jim/kernels/2.6.28/linux-2.6.28# orie:/home/jim/kernels/2.6.28/linux-2.6.28# orie:/home/jim/kernels/2.6.28/linux-2.6.28# make-kpkg modules_imageexec debian/rules  DEBIAN_REVISION=2.6.28-10.00.Custom  modules_image for module in /usr/src/modules/nvidia-kernel ; do                       \          if test -d  $module; then                                \	    (cd $module;                                          \              if ./debian/rules KVERS="2.6.28" KSRC="/home/jim/kernels/2.6.28/linux-2.6.28" \                             KMAINT="Unknown Kernel Package Maintainer" KEMAIL="unknown@unconfigured.in.etc.kernel-pkg.conf"      \                             KPKG_DEST_DIR="/home/jim/kernels/2.6.28/linux-2.6.28/.."       \                             KPKG_MAINTAINER="Unknown Kernel Package Maintainer"        \                             KPKG_EXTRAV_ARG=""        \                             ARCH="i386"                  \                             KDREV="2.6.28-10.00.Custom" kdist_image; then    \                  echo "Module $module processed fine";            \              else                                                  \                   echo "Module $module failed.";                  \                   if [ "X" != "X" ]; then      \                      echo "Perhaps $module does not understand --rootcmd?";  \                      echo "If you see messages that indicate that it is not"; \                      echo "in fact being built as root, please file a bug ";  \                      echo "against $module.";                     \                   fi;                                              \                   echo "Hit return to Continue";                   \		 read ans;                                        \              fi;                                                   \	     );                                                    \	  else                                                      \               echo "Module $module does not exist";               \               echo "Hit return to Continue?";                      \	  fi;                                                       \        donemake[1]: Entering directory `/usr/src/modules/nvidia-kernel'echo "ROOT_CMD = "ROOT_CMD = /usr/bin/make -w -f debian/rules binary_modulesmake[2]: Entering directory `/usr/src/modules/nvidia-kernel'# select which makefile to use.rm -f /usr/src/modules/nvidia-kernel/nv/Makefile || trueif [ 6 = 6  ]; then \	     cd /usr/src/modules/nvidia-kernel/nv ; \	     ln -s Makefile.kbuild Makefile ; \	     cd .. ; \	     if [ 0  = 1 ] ; then \	        dpatch apply 04_minion ; \	     fi ; \	     if [ 0 = 1 ]; then \	     	dpatch apply 01_sysfs ; \		dpatch status 01_sysfs >patch-stamp ; \		dpatch apply 02_pcialias ; \               	dpatch status 02_pcialias >>patch-stamp ; \	     fi ; \	fiif [  6 = 4  ]; then \	     cd /usr/src/modules/nvidia-kernel/nv ; \	     ln -s Makefile.nvidia Makefile ; \	     cd .. ; \	fiif ! gcc-4.1 -v 2> /dev/null  ; then \	   echo "Compiler gcc-4.1 does not exist on the system" ; \	   exit 1; \	fi   touch configure-stampif [ -f /usr/src/modules/nvidia-kernel/debian/control.template ]; then \		cp  /usr/src/modules/nvidia-kernel/debian/control.template /usr/src/modules/nvidia-kernel/debian/control; \	fidh_testdirdh_testrootif [ "i686" = "x86_64" ]; then \		cp /usr/src/modules/nvidia-kernel/nv-kernel.o.x86_64 /usr/src/modules/nvidia-kernel/nv/nv-kernel.o ; \	fi   PATCHLEVEL = 6 Kernel compiler version : 4.1.1Detected compiler version : 4.1.1Using compiler gcc-4.1 version 4.1.1touch /usr/src/modules/nvidia-kernel/nv/gcc-checktouch /usr/src/modules/nvidia-kernel/nv/cc-sanity-check## Main Make ##IGNORE_CC_MISMATCH=1 CC="gcc-4.1" /usr/bin/make -C /usr/src/modules/nvidia-kernel/nv -f Makefile SYSSRC=/home/jim/kernels/2.6.28/linux-2.6.28   KBUILD_PARAMS="-C /home/jim/kernels/2.6.28/linux-2.6.28 SUBDIRS=/usr/src/modules/nvidia-kernel/nv" module;make[3]: Entering directory `/usr/src/modules/nvidia-kernel/nv'NVIDIA: calling KBUILD...make CC=gcc-4.1 -C /home/jim/kernels/2.6.28/linux-2.6.28 SUBDIRS=/usr/src/modules/nvidia-kernel/nv modulesmake[4]: Entering directory `/home/jim/kernels/2.6.28/linux-2.6.28'  CC [M]  /usr/src/modules/nvidia-kernel/nv/nv.oIn file included from include/linux/bitops.h:17,                 from include/linux/kernel.h:15,                 from include/linux/sched.h:52,                 from include/linux/utsname.h:35,                 from /usr/src/modules/nvidia-kernel/nv/nv-linux.h:19,                 from /usr/src/modules/nvidia-kernel/nv/nv.c:14:/home/jim/kernels/2.6.28/linux-2.6.28/arch/x86/include/asm/bitops.h: In function ‘set_bit’:/home/jim/kernels/2.6.28/linux-2.6.28/arch/x86/include/asm/bitops.h:60: warning: pointer of type ‘void *’ used in arithmetic/home/jim/kernels/2.6.28/linux-2.6.28/arch/x86/include/asm/bitops.h: In function ‘clear_bit’:/home/jim/kernels/2.6.28/linux-2.6.28/arch/x86/include/asm/bitops.h:97: warning: pointer of type ‘void *’ used in arithmeticIn file included from include/linux/list.h:6,                 from include/linux/preempt.h:11,                 from include/linux/spinlock.h:50,                 from include/linux/seqlock.h:29,                 from include/linux/time.h:8,                 from include/linux/timex.h:57,                 from include/linux/sched.h:54,                 from include/linux/utsname.h:35,                 from /usr/src/modules/nvidia-kernel/nv/nv-linux.h:19,                 from /usr/src/modules/nvidia-kernel/nv/nv.c:14:include/linux/prefetch.h: In function ‘prefetch_range’:include/linux/prefetch.h:57: warning: pointer of type ‘void *’ used in arithmeticIn file included from include/linux/utsname.h:35,                 from /usr/src/modules/nvidia-kernel/nv/nv-linux.h:19,                 from /usr/src/modules/nvidia-kernel/nv/nv.c:14:include/linux/sched.h: In function ‘object_is_on_stack’:include/linux/sched.h:2026: warning: pointer of type ‘void *’ used in arithmeticIn file included from /usr/src/modules/nvidia-kernel/nv/nv-linux.h:34,                 from /usr/src/modules/nvidia-kernel/nv/nv.c:14:/usr/src/modules/nvidia-kernel/nv/conftest.h:1:2: error: #error remap_page_range() conftest failed!/usr/src/modules/nvidia-kernel/nv/conftest.h:3:2: error: #error vmap() conftest failed!/usr/src/modules/nvidia-kernel/nv/conftest.h:5:2: error: #error agp_backend_acquire() conftest failed!/usr/src/modules/nvidia-kernel/nv/conftest.h:16:2: error: #error kmem_cache_create() conftest failed!In file included from /home/jim/kernels/2.6.28/linux-2.6.28/arch/x86/include/asm/dma-mapping.h:9,                 from include/linux/dma-mapping.h:57,                 from include/asm-generic/pci-dma-compat.h:7,                 from /home/jim/kernels/2.6.28/linux-2.6.28/arch/x86/include/asm/pci.h:94,                 from include/linux/pci.h:1002,                 from /usr/src/modules/nvidia-kernel/nv/nv-linux.h:86,                 from /usr/src/modules/nvidia-kernel/nv/nv.c:14:include/linux/scatterlist.h: In function ‘sg_virt’:include/linux/scatterlist.h:199: warning: pointer of type ‘void *’ used in arithmeticIn file included from /home/jim/kernels/2.6.28/linux-2.6.28/arch/x86/include/asm/hardirq_32.h:5,                 from /home/jim/kernels/2.6.28/linux-2.6.28/arch/x86/include/asm/hardirq.h:2,                 from include/linux/hardirq.h:7,                 from include/linux/interrupt.h:12,                 from /usr/src/modules/nvidia-kernel/nv/nv-linux.h:87,                 from /usr/src/modules/nvidia-kernel/nv/nv.c:14:include/linux/irq.h: In function ‘irq_to_desc’:include/linux/irq.h:189: warning: comparison between signed and unsignedIn file included from /usr/src/modules/nvidia-kernel/nv/nv.c:14:/usr/src/modules/nvidia-kernel/nv/nv-linux.h:107:27: error: asm/semaphore.h: No such file or directoryIn file included from /usr/src/modules/nvidia-kernel/nv/nv-linux.h:109,                 from /usr/src/modules/nvidia-kernel/nv/nv.c:14:include/linux/highmem.h: In function ‘zero_user_segments’:include/linux/highmem.h:136: warning: pointer of type ‘void *’ used in arithmeticinclude/linux/highmem.h:136: warning: pointer of type ‘void *’ used in arithmeticinclude/linux/highmem.h:136: warning: pointer of type ‘void *’ used in arithmeticinclude/linux/highmem.h:136: warning: pointer of type ‘void *’ used in arithmeticinclude/linux/highmem.h:139: warning: pointer of type ‘void *’ used in arithmeticinclude/linux/highmem.h:139: warning: pointer of type ‘void *’ used in arithmeticinclude/linux/highmem.h:139: warning: pointer of type ‘void *’ used in arithmeticinclude/linux/highmem.h:139: warning: pointer of type ‘void *’ used in arithmetic/usr/src/modules/nvidia-kernel/nv/nv-linux.h:572:2: error: #error "NV_KMEM_CACHE_CREATE() undefined (kmem_cache_create() unavailable)!"In file included from /usr/src/modules/nvidia-kernel/nv/nv.c:14:/usr/src/modules/nvidia-kernel/nv/nv-linux.h: In function ‘nv_execute_on_all_cpus’:/usr/src/modules/nvidia-kernel/nv/nv-linux.h:667: error: too many arguments to function ‘on_each_cpu’/usr/src/modules/nvidia-kernel/nv/nv-linux.h: At top level:/usr/src/modules/nvidia-kernel/nv/nv-linux.h:817: error: conflicting types for ‘pm_message_t’include/linux/pm.h:41: error: previous declaration of ‘pm_message_t’ was here/usr/src/modules/nvidia-kernel/nv/nv.c:370: warning: initialization from incompatible pointer type/usr/src/modules/nvidia-kernel/nv/nv.c: In function ‘nvos_proc_create’:/usr/src/modules/nvidia-kernel/nv/nv.c:616: error: ‘proc_root_driver’ undeclared (first use in this function)/usr/src/modules/nvidia-kernel/nv/nv.c:616: error: (Each undeclared identifier is reported only once/usr/src/modules/nvidia-kernel/nv/nv.c:616: error: for each function it appears in.)/usr/src/modules/nvidia-kernel/nv/nv.c: In function ‘__nv_setup_pat_entries’:/usr/src/modules/nvidia-kernel/nv/nv.c:944: warning: comparison between signed and unsigned/usr/src/modules/nvidia-kernel/nv/nv.c: In function ‘__nv_restore_pat_entries’:/usr/src/modules/nvidia-kernel/nv/nv.c:970: warning: comparison between signed and unsigned/usr/src/modules/nvidia-kernel/nv/nv.c: In function ‘nv_kern_cpu_callback’:/usr/src/modules/nvidia-kernel/nv/nv.c:1283: warning: comparison between signed and unsigned/usr/src/modules/nvidia-kernel/nv/nv.c:1286: error: too many arguments to function ‘smp_call_function’/usr/src/modules/nvidia-kernel/nv/nv.c:1290: warning: comparison between signed and unsigned/usr/src/modules/nvidia-kernel/nv/nv.c:1293: error: too many arguments to function ‘smp_call_function’/usr/src/modules/nvidia-kernel/nv/nv.c: In function ‘nvidia_init_module’:/usr/src/modules/nvidia-kernel/nv/nv.c:1327: error: implicit declaration of function ‘NV_KMEM_CACHE_CREATE’/usr/src/modules/nvidia-kernel/nv/nv.c:1327: error: expected expression before ‘nv_stack_t’/usr/src/modules/nvidia-kernel/nv/nv.c:1337: error: implicit declaration of function ‘NV_KMEM_CACHE_DESTROY’/usr/src/modules/nvidia-kernel/nv/nv.c:1436: error: expected expression before ‘nv_pte_t’/usr/src/modules/nvidia-kernel/nv/nv.c: In function ‘nv_kern_vma_nopage’:/usr/src/modules/nvidia-kernel/nv/nv.c:1832: error: ‘NOPAGE_SIGBUS’ undeclared (first use in this function)/usr/src/modules/nvidia-kernel/nv/nv.c: At top level:/usr/src/modules/nvidia-kernel/nv/nv.c:1839: error: unknown field ‘nopage’ specified in initializer/usr/src/modules/nvidia-kernel/nv/nv.c:1839: warning: initialization from incompatible pointer type/usr/src/modules/nvidia-kernel/nv/nv.c: In function ‘nv_kern_open’:/usr/src/modules/nvidia-kernel/nv/nv.c:1993: warning: passing argument 2 of ‘request_irq’ from incompatible pointer type/usr/src/modules/nvidia-kernel/nv/nv.c:3976:6: warning: "NV_AGP_BACKEND_ACQUIRE_ARGUMENT_COUNT" is not defined/usr/src/modules/nvidia-kernel/nv/nv.c: In function ‘nv_agp_init’:/usr/src/modules/nvidia-kernel/nv/nv.c:3993: error: too few arguments to function ‘agp_backend_acquire’/usr/src/modules/nvidia-kernel/nv/nv.c:3995: error: too few arguments to function ‘agp_backend_release’make[5]: *** [/usr/src/modules/nvidia-kernel/nv/nv.o] Error 1make[4]: *** [_module_/usr/src/modules/nvidia-kernel/nv] Error 2make[4]: Leaving directory `/home/jim/kernels/2.6.28/linux-2.6.28'NVIDIA: left KBUILD.nvidia.ko failed to build!make[3]: *** [module] Error 1make[3]: Leaving directory `/usr/src/modules/nvidia-kernel/nv'make[2]: *** [build-stamp] Error 2make[2]: Leaving directory `/usr/src/modules/nvidia-kernel'make[1]: *** [kdist_image] Error 2make[1]: Leaving directory `/usr/src/modules/nvidia-kernel'Module /usr/src/modules/nvidia-kernel failed.Hit return to Continueorie:/home/jim/kernels/2.6.28/linux-2.6.28# exitProcess shell finished