rendered paste body/usr/bin/make -f debian/rules clean #
│ make[1]: Entering directory `/usr/src/modules/nvidia-kernel' ▒
│ # select which makefile to use. ▒
│ rm -f /usr/src/modules/nvidia-kernel/nv/Makefile || true ▒
│ if [ 6 = 6 ]; then \ ▒
│ cd /usr/src/modules/nvidia-kernel/nv ; \ ▒
│ ln -s Makefile.kbuild Makefile ; \ ▒
│ cd .. ; \ ▒
│ if [ 0 = 1 ] ; then \ ▒
│ dpatch apply 04_minion ; \ ▒
│ fi ; \ ▒
│ if [ 0 = 1 ]; then \ ▒
│ dpatch apply 01_sysfs ; \ ▒
│ dpatch status 01_sysfs >patch-stamp ; \ ▒
│ dpatch apply 02_pcialias ; \
dpatch status 02_pcialias >>patch-stamp ; \ ▒
│ fi ; \ #
│ fi ▒
│ if [ 6 = 4 ]; then \ ▒
│ cd /usr/src/modules/nvidia-kernel/nv ; \ ▒
│ ln -s Makefile.nvidia Makefile ; \ ▒
│ cd .. ; \ ▒
│ fi ▒
│ if [ -e patch-stamp ]; then \ ▒
│ dpatch deapply-all ; \ ▒
│ rm -rf patch-stamp debian/patched ; \ ▒
│ fi ▒
│ if [ -f /usr/src/modules/nvidia-kernel/debian/control.template ]; then \ ▒
│ cp /usr/src/modules/nvidia-kernel/debian/control.template ▒
│ /usr/src/modules/nvidia-kernel/debian/control; \
fi ▒
│ dh_testroot ▒
│ rm -f build-stamp configure-stamp #
│ /usr/bin/make clean SYSSRC=/lib/modules/2.6.16-2-k7/build -C ▒
│ /usr/src/modules/nvidia-kernel/nv -f Makefile ▒
│ make[2]: Entering directory `/usr/src/modules/nvidia-kernel/nv' ▒
│ rm -f -f nv.o nv-vm.o os-agp.o os-interface.o os-registry.o nv.o nv-vm.o ▒
│ os-agp.o os-interface.o os-registry.o nvidia.mod.o ▒
│ rm -f -f build-in.o nv-linux.o *.d .*.{cmd,flags} ▒
│ rm -f -f nvidia.{o,ko,mod.{o,c}} nv_compiler.h *~ ▒
│ rm -f -f stprof stprof.o symtab.h ▒
│ rm -f -rf .tmp_versions ▒
│ make[2]: Leaving directory `/usr/src/modules/nvidia-kernel/nv' ▒
│ rm -f /usr/src/modules/nvidia-kernel/nv/Makefile || true; ▒
│ rm /usr/src/modules/nvidia-kernel/nv/gcc-check
rm /usr/src/modules/nvidia-kernel/nv/cc-sanity-check ▒
│ dh_clean ▒
│ rm /usr/src/modules/nvidia-kernel/debian/control ▒
│ rm /usr/src/modules/nvidia-kernel/debian/dirs #
│ rm /usr/src/modules/nvidia-kernel/debian/override ▒
│ make[1]: Leaving directory `/usr/src/modules/nvidia-kernel' ▒
│ echo "ROOT_CMD = " ▒
│ ROOT_CMD = ▒
│ /usr/bin/make -f debian/rules binary_modules ▒
│ make[1]: Entering directory `/usr/src/modules/nvidia-kernel' ▒
│ # select which makefile to use. ▒
│ rm -f /usr/src/modules/nvidia-kernel/nv/Makefile || true ▒
│ if [ 6 = 6 ]; then \ ▒
│ cd /usr/src/modules/nvidia-kernel/nv ; \ ▒
│ ln -s Makefile.kbuild Makefile ; \
cd .. ; \ ▒
│ if [ 0 = 1 ] ; then \ ▒
│ dpatch apply 04_minion ; \ ▒
│ fi ; \ ▒
│ if [ 0 = 1 ]; then \ #
│ dpatch apply 01_sysfs ; \ ▒
│ dpatch status 01_sysfs >patch-stamp ; \ ▒
│ dpatch apply 02_pcialias ; \ ▒
│ dpatch status 02_pcialias >>patch-stamp ; \ ▒
│ fi ; \ ▒
│ fi ▒
│ if [ 6 = 4 ]; then \ ▒
│ cd /usr/src/modules/nvidia-kernel/nv ; \ ▒
│ ln -s Makefile.nvidia Makefile ; \ ▒
│ cd .. ; \
fi ▒
│ #nothing here anymore ▒
│ touch configure-stamp ▒
│ if [ -f /usr/src/modules/nvidia-kernel/debian/control.template ]; then \ ▒
│ cp /usr/src/modules/nvidia-kernel/debian/control.template ▒
│ /usr/src/modules/nvidia-kernel/debian/control; \ #
│ fi ▒
│ dh_testdir ▒
│ dh_testroot ▒
│ PATCHLEVEL = 6 ▒
│ Kernel compiler version : 3.3.5 ▒
│ Detected compiler version : 3.3.5 ▒
│ Using compiler gcc-3.3 version 3.3.5 ▒
│ touch /usr/src/modules/nvidia-kernel/nv/gcc-check ▒
│ touch /usr/src/modules/nvidia-kernel/nv/cc-sanity-check
## Main Make ## ▒
│ IGNORE_CC_MISMATCH=1 CC="gcc-3.3" /usr/bin/make -C ▒
│ /usr/src/modules/nvidia-kernel/nv -f Makefile ▒
│ SYSSRC=/lib/modules/2.6.16-2-k7/build KBUILD_PARAMS="-C ▒
│ /lib/modules/2.6.16-2-k7/build ▒
│ SUBDIRS=/usr/src/modules/nvidia-kernel/nv" module; ▒
│ make[2]: Entering directory `/usr/src/modules/nvidia-kernel/nv' #
│ ▒
│ NVIDIA: calling KBUILD... ▒
│ make CC=gcc-3.3 -C /lib/modules/2.6.16-2-k7/build ▒
│ SUBDIRS=/usr/src/modules/nvidia-kernel/nv modules ▒
│ make[3]: Entering directory `/usr/src/linux-headers-2.6.16-2-k7' ▒
│ echo \#define NV_COMPILER \"`gcc-3.3 -v 2>&1 | tail -n 1`\" > ▒
│ /usr/src/modules/nvidia-kernel/nv/nv_compiler.h ▒
│ CC [M] /usr/src/modules/nvidia-kernel/nv/nv.o
fi ▒
│ #nothing here anymore ▒
│ touch configure-stamp ▒
│ if [ -f /usr/src/modules/nvidia-kernel/debian/control.template ]; then \ ▒
│ cp /usr/src/modules/nvidia-kernel/debian/control.template ▒
│ /usr/src/modules/nvidia-kernel/debian/control; \ #
│ fi ▒
│ dh_testdir ▒
│ dh_testroot ▒
│ PATCHLEVEL = 6 ▒
│ Kernel compiler version : 3.3.5 ▒
│ Detected compiler version : 3.3.5 ▒
│ Using compiler gcc-3.3 version 3.3.5 ▒
│ touch /usr/src/modules/nvidia-kernel/nv/gcc-check ▒
│ touch /usr/src/modules/nvidia-kernel/nv/cc-sanity-check
## Main Make ## ▒
│ IGNORE_CC_MISMATCH=1 CC="gcc-3.3" /usr/bin/make -C ▒
│ /usr/src/modules/nvidia-kernel/nv -f Makefile ▒
│ SYSSRC=/lib/modules/2.6.16-2-k7/build KBUILD_PARAMS="-C ▒
│ /lib/modules/2.6.16-2-k7/build ▒
│ SUBDIRS=/usr/src/modules/nvidia-kernel/nv" module; ▒
│ make[2]: Entering directory `/usr/src/modules/nvidia-kernel/nv' #
│ ▒
│ NVIDIA: calling KBUILD... ▒
│ make CC=gcc-3.3 -C /lib/modules/2.6.16-2-k7/build ▒
│ SUBDIRS=/usr/src/modules/nvidia-kernel/nv modules ▒
│ make[3]: Entering directory `/usr/src/linux-headers-2.6.16-2-k7' ▒
│ echo \#define NV_COMPILER \"`gcc-3.3 -v 2>&1 | tail -n 1`\" > ▒
│ /usr/src/modules/nvidia-kernel/nv/nv_compiler.h ▒
│ CC [M] /usr/src/modules/nvidia-kernel/nv/nv.o
In file included from include/linux/list.h:7, ▒
│ from include/linux/wait.h:23, ▒
│ from include/asm/semaphore.h:41, ▒
│ from include/linux/sched.h:20, ▒
│ from include/linux/module.h:10, ▒
│ from /usr/src/modules/nvidia-kernel/nv/nv-linux.h:47, ▒
│ from /usr/src/modules/nvidia-kernel/nv/nv.c:14: ▒
│ include/linux/prefetch.h: I funktion `prefetch_range': #
│ include/linux/prefetch.h:62: varning: pekare av typen "void *" använd ▒
│ med aritmetik ▒
│ In file included from include/linux/dmapool.h:14, ▒
│ from include/linux/pci.h:522, ▒
│ from /usr/src/modules/nvidia-kernel/nv/nv-linux.h:71, ▒
│ from /usr/src/modules/nvidia-kernel/nv/nv.c:14: ▒
│ include/asm/io.h: I funktion `check_signature':
include/asm/io.h:258: varning: wrong type argument to increment ▒
│ I fil inkluderad från /usr/src/modules/nvidia-kernel/nv/nv.c:14: ▒
│ /usr/src/modules/nvidia-kernel/nv/nv-linux.h:715:2: varning: #warning ▒
│ "conftest.sh failed, assuming remap_page_range(4)!" ▒
│ /usr/src/modules/nvidia-kernel/nv/nv.c: I funktion ▒
│ `nvos_get_agp_device_by_class': ▒
│ /usr/src/modules/nvidia-kernel/nv/nv.c:503: varning: implicit ▒
│ declaration of function `pci_find_class' ▒
│ /usr/src/modules/nvidia-kernel/nv/nv.c:503: varning: tilldelning skapar #
│ pekare från heltal utan typkonvertering ▒
│ /usr/src/modules/nvidia-kernel/nv/nv.c:517: varning: tilldelning skapar ▒
│ pekare från heltal utan typkonvertering ▒
│ /usr/src/modules/nvidia-kernel/nv/nv.c: I funktion `nv_kern_mmap': ▒
│ /usr/src/modules/nvidia-kernel/nv/nv.c:1983: varning: implicit ▒
│ declaration of function `remap_page_range'
/usr/src/modules/nvidia-kernel/nv/nv.c: I funktion `nvos_count_devices': ▒
│ /usr/src/modules/nvidia-kernel/nv/nv.c:3646: varning: tilldelning skapar ▒
│ pekare från heltal utan typkonvertering ▒
│ /usr/src/modules/nvidia-kernel/nv/nv.c:3652: varning: tilldelning skapar ▒
│ pekare från heltal utan typkonvertering ▒
│ CC [M] /usr/src/modules/nvidia-kernel/nv/nv-vm.o ▒
│ In file included from include/linux/list.h:7, ▒
│ from include/linux/wait.h:23, ▒
│ from include/asm/semaphore.h:41, ▒
│ from include/linux/sched.h:20, #
│ from include/linux/module.h:10, ▒
│ from /usr/src/modules/nvidia-kernel/nv/nv-linux.h:47, ▒
│ from /usr/src/modules/nvidia-kernel/nv/nv-vm.c:14: ▒
│ include/linux/prefetch.h: I funktion `prefetch_range': ▒
│ include/linux/prefetch.h:62: varning: pekare av typen "void *" använd
med aritmetik ▒
│ In file included from include/linux/dmapool.h:14, ▒
│ from include/linux/pci.h:522, ▒
│ from /usr/src/modules/nvidia-kernel/nv/nv-linux.h:71, ▒
│ from /usr/src/modules/nvidia-kernel/nv/nv-vm.c:14: ▒
│ include/asm/io.h: I funktion `check_signature': ▒
│ include/asm/io.h:258: varning: wrong type argument to increment ▒
│ I fil inkluderad från /usr/src/modules/nvidia-kernel/nv/nv-vm.c:14: ▒
│ /usr/src/modules/nvidia-kernel/nv/nv-linux.h:715:2: varning: #warning ▒
│ "conftest.sh failed, assuming remap_page_range(4)!" ▒
│ CC [M] /usr/src/modules/nvidia-kernel/nv/os-agp.o #
│ In file included from include/linux/list.h:7, ▒
│ from include/linux/wait.h:23, ▒
│ from include/asm/semaphore.h:41, ▒
│ from include/linux/sched.h:20,
from include/linux/module.h:10, ▒
│ from /usr/src/modules/nvidia-kernel/nv/nv-linux.h:47, ▒
│ from /usr/src/modules/nvidia-kernel/nv/os-agp.c:24: ▒
│ include/linux/prefetch.h: I funktion `prefetch_range': ▒
│ include/linux/prefetch.h:62: varning: pekare av typen "void *" använd ▒
│ med aritmetik ▒
│ In file included from include/linux/dmapool.h:14, ▒
│ from include/linux/pci.h:522, ▒
│ from /usr/src/modules/nvidia-kernel/nv/nv-linux.h:71, ▒
│ from /usr/src/modules/nvidia-kernel/nv/os-agp.c:24: ▒
│ include/asm/io.h: I funktion `check_signature': ▒
│ include/asm/io.h:258: varning: wrong type argument to increment #
│ I fil inkluderad från /usr/src/modules/nvidia-kernel/nv/os-agp.c:24: ▒
│ /usr/src/modules/nvidia-kernel/nv/nv-linux.h:715:2: varning: #warning ▒
│ "conftest.sh failed, assuming remap_page_range(4)!"
CC [M] /usr/src/modules/nvidia-kernel/nv/os-interface.o ▒
│ In file included from include/linux/list.h:7, ▒
│ from include/linux/wait.h:23, ▒
│ from include/asm/semaphore.h:41, ▒
│ from include/linux/sched.h:20, ▒
│ from include/linux/module.h:10, ▒
│ from /usr/src/modules/nvidia-kernel/nv/nv-linux.h:47, ▒
│ from ▒
│ /usr/src/modules/nvidia-kernel/nv/os-interface.c:26: ▒
│ include/linux/prefetch.h: I funktion `prefetch_range': ▒
│ include/linux/prefetch.h:62: varning: pekare av typen "void *" använd ▒
│ med aritmetik ▒
│ In file included from include/linux/dmapool.h:14, #
│ from include/linux/pci.h:522, ▒
│ from /usr/src/modules/nvidia-kernel/nv/nv-linux.h:71,
/usr/src/modules/nvidia-kernel/nv/os-interface.c:26: ▒
│ include/asm/io.h: I funktion `check_signature': ▒
│ include/asm/io.h:258: varning: wrong type argument to increment ▒
│ I fil inkluderad från ▒
│ /usr/src/modules/nvidia-kernel/nv/os-interface.c:26: ▒
│ /usr/src/modules/nvidia-kernel/nv/nv-linux.h:715:2: varning: #warning ▒
│ "conftest.sh failed, assuming remap_page_range(4)!" ▒
│ /usr/src/modules/nvidia-kernel/nv/os-interface.c: I funktion ▒
│ `os_set_mlock_capability': ▒
│ /usr/src/modules/nvidia-kernel/nv/os-interface.c:1375: error: structure ▒
│ has no member named `rlim' ▒
│ make[4]: *** [/usr/src/modules/nvidia-kernel/nv/os-interface.o] Fel 1 ▒
│ make[3]: *** [_module_/usr/src/modules/nvidia-kernel/nv] Fel 2 #
│ make[3]: Leaving directory `/usr/src/linux-headers-2.6.16-2-k7'
"conftest.sh failed, assuming remap_page_range(4)!" ▒
│ /usr/src/modules/nvidia-kernel/nv/os-interface.c: I funktion ▒
│ `os_set_mlock_capability': ▒
│ /usr/src/modules/nvidia-kernel/nv/os-interface.c:1375: error: structure ▒
│ has no member named `rlim' ▒
│ make[4]: *** [/usr/src/modules/nvidia-kernel/nv/os-interface.o] Fel 1 ▒
│ make[3]: *** [_module_/usr/src/modules/nvidia-kernel/nv] Fel 2 ▒
│ make[3]: Leaving directory `/usr/src/linux-headers-2.6.16-2-k7' ▒
│ NVIDIA: left KBUILD. ▒
│ nvidia.ko failed to build! ▒
│ make[2]: *** [mdl] Fel 1 ▒
│ make[2]: Leaving directory `/usr/src/modules/nvidia-kernel/nv' ▒
│ make[1]: *** [build-stamp] Fel 2 ▒
│ make[1]: Leaving directory `/usr/src/modules/nvidia-kernel' ▒
│ make: *** [kdist_image] Fel 2