All pastes #133167 Raw Edit

Mine

public text v1 · immutable
#133167 ·published 2006-08-15 18:23 UTC
rendered paste body
dc# gmake
gmake P_SHAREDLIB=1 opt
gmake[1]: Entering directory `/usr/ports/net/openh323/work/openh323_v1_18_0'
gmake -C src opt
gmake[2]: Entering directory `/usr/ports/net/openh323/work/openh323_v1_18_0/src'
g++  -DP_USE_PRAGMA -D_REENTRANT -I/usr/local/include -Wall  -DPTRACING -I/usr/ports/net/openh323/work/openh323_v1_18_0/include -I/usr/src/pwlib_v1_11_1/include -Os   -felide-constructors -Wreorder -c h261codec.cxx -o /usr/ports/net/openh323/work/openh323_v1_18_0/lib/obj_FreeBSD_x86_r/h261codec.o
h261codec.cxx: In member function `virtual BOOL H323_H261Codec::Read(BYTE*, unsigned int&, RTP_DataFrame&)':
h261codec.cxx:520: error: `PVideoChannel' undeclared (first use this function)
h261codec.cxx:520: error: (Each undeclared identifier is reported only once for each function it appears in.)
h261codec.cxx:520: error: expected primary-expression before ')' token
h261codec.cxx:520: error: expected `)' before "rawDataChannel"
h261codec.cxx:521: error: expected primary-expression before ')' token
h261codec.cxx:521: error: expected `)' before "rawDataChannel"
h261codec.cxx:632: error: expected primary-expression before ')' token
h261codec.cxx:632: error: expected `)' before "rawDataChannel"
h261codec.cxx:636: error: expected `)' before "videoEncoder"
h261codec.cxx: In member function `BOOL H323_H261Codec::Resize(int, int)':
h261codec.cxx:800: error: `PVideoChannel' undeclared (first use this function)
h261codec.cxx:800: error: expected primary-expression before ')' token
h261codec.cxx:800: error: expected `)' before "rawDataChannel"
h261codec.cxx: In member function `BOOL H323_H261Codec::RenderFrame()':
h261codec.cxx:836: error: `PVideoChannel' undeclared (first use this function)
h261codec.cxx:836: error: expected primary-expression before ')' token
h261codec.cxx:836: error: expected `)' before "rawDataChannel"
gmake[2]: *** [/usr/ports/net/openh323/work/openh323_v1_18_0/lib/obj_FreeBSD_x86_r/h261codec.o] Ошибка 1
gmake[2]: Leaving directory `/usr/ports/net/openh323/work/openh323_v1_18_0/src'
gmake[1]: *** [opt] Ошибка 2
gmake[1]: Leaving directory `/usr/ports/net/openh323/work/openh323_v1_18_0'
gmake: *** [optshared] Ошибка 2