rendered paste bodyb-june:root:/usr/build/conf>rm -rf /usr/tmp/bb;bitbake task-bootstrap
NOTE: Using cache in '/usr/tmp/bb/cache'
NOTE: Parsing finished. 0 cached, 2327 parsed, 48 skipped, 0 masked.
NOTE: build 200506030519: started
OE Build Configuration:
TARGET_ARCH = "arm"
TARGET_OS = "linux"
MACHINE = "spitz"
DISTRO = "openzaurus"
TARGET_FPU = "soft"
NOTE: package quilt-native-0.39: started
NOTE: package quilt-native-0.39-r0: task do_fetch: started
NOTE: package quilt-native-0.39-r0: task do_fetch: completed
NOTE: package quilt-native-0.39-r0: task do_unpack: started
NOTE: Unpacking /root/sources/quilt_savannah.nongnu.org_VER_0_39_.tar.gz to /var/tmp/bb/work/quilt-native-0.39-r0/
NOTE: package quilt-native-0.39-r0: task do_unpack: completed
NOTE: package quilt-native-0.39-r0: task do_patch: started
NOTE: Applying patch 'install.patch'
NOTE: Applying patch 'nostrip.patch'
NOTE: Applying patch 'autoreconf.patch'
NOTE: package quilt-native-0.39-r0: task do_patch: completed
NOTE: package quilt-native-0.39-r0: task do_configure: started
NOTE: package quilt-native-0.39-r0: task do_configure: completed
NOTE: package quilt-native-0.39-r0: task do_compile: started
NOTE: package quilt-native-0.39-r0: task do_compile: completed
NOTE: package quilt-native-0.39-r0: task do_populate_staging: started
NOTE: package quilt-native-0.39-r0: task do_populate_staging: completed
NOTE: package quilt-native-0.39-r0: task do_package: started
NOTE: package quilt-native-0.39-r0: task do_package: completed
NOTE: package quilt-native-0.39-r0: task do_build: started
NOTE: package quilt-native-0.39-r0: task do_build: completed
NOTE: package quilt-native-0.39: completed
NOTE: package ipkg-utils-native-1.6cvs20050603: started
NOTE: package ipkg-utils-native-1.6cvs20050603-r4: task do_fetch: started
NOTE: package ipkg-utils-native-1.6cvs20050603-r4: task do_fetch: completed
NOTE: package ipkg-utils-native-1.6cvs20050603-r4: task do_unpack: started
NOTE: Unpacking /root/sources/ipkg-utils_cvs.handhelds.org__20050603.tar.gz to /var/tmp/bb/work/ipkg-utils-native-1.6cvs20050603-r4/
NOTE: package ipkg-utils-native-1.6cvs20050603-r4: task do_unpack: completed
NOTE: package ipkg-utils-native-1.6cvs20050603-r4: task do_patch: started
NOTE: package ipkg-utils-native-1.6cvs20050603-r4: task do_patch: completed
NOTE: package ipkg-utils-native-1.6cvs20050603-r4: task do_configure: started
NOTE: package ipkg-utils-native-1.6cvs20050603-r4: task do_configure: completed
NOTE: package ipkg-utils-native-1.6cvs20050603-r4: task do_compile: started
NOTE: package ipkg-utils-native-1.6cvs20050603-r4: task do_compile: completed
NOTE: package ipkg-utils-native-1.6cvs20050603-r4: task do_populate_staging: started
NOTE: package ipkg-utils-native-1.6cvs20050603-r4: task do_populate_staging: completed
NOTE: package ipkg-utils-native-1.6cvs20050603-r4: task do_package: started
NOTE: package ipkg-utils-native-1.6cvs20050603-r4: task do_package: completed
NOTE: package ipkg-utils-native-1.6cvs20050603-r4: task do_build: started
NOTE: package ipkg-utils-native-1.6cvs20050603-r4: task do_build: completed
NOTE: package ipkg-utils-native-1.6cvs20050603: completed
NOTE: package gnu-config-native-0.1cvs20050603: started
NOTE: package gnu-config-native-0.1cvs20050603-r3: task do_fetch: started
NOTE: package gnu-config-native-0.1cvs20050603-r3: task do_fetch: completed
NOTE: package gnu-config-native-0.1cvs20050603-r3: task do_unpack: started
NOTE: Unpacking /root/sources/config_savannah.gnu.org__20050603.tar.gz to /var/tmp/bb/work/gnu-config-native-0.1cvs20050603-r3/
NOTE: Unpacking /usr/openembedded/packages/gnu-config/gnu-config/gnu-configize.in to /var/tmp/bb/work/gnu-config-native-0.1cvs20050603-r3/
NOTE: package gnu-config-native-0.1cvs20050603-r3: task do_unpack: completed
NOTE: package gnu-config-native-0.1cvs20050603-r3: task do_patch: started
NOTE: Applying patch 'config-guess-uclibc.patch'
NOTE: package gnu-config-native-0.1cvs20050603-r3: task do_patch: completed
NOTE: package gnu-config-native-0.1cvs20050603-r3: task do_configure: started
NOTE: package gnu-config-native-0.1cvs20050603-r3: task do_configure: completed
NOTE: package gnu-config-native-0.1cvs20050603-r3: task do_compile: started
NOTE: package gnu-config-native-0.1cvs20050603-r3: task do_compile: completed
NOTE: package gnu-config-native-0.1cvs20050603-r3: task do_populate_staging: started
NOTE: package gnu-config-native-0.1cvs20050603-r3: task do_populate_staging: completed
NOTE: package gnu-config-native-0.1cvs20050603-r3: task do_package: started
NOTE: package gnu-config-native-0.1cvs20050603-r3: task do_package: completed
NOTE: package gnu-config-native-0.1cvs20050603-r3: task do_build: started
NOTE: package gnu-config-native-0.1cvs20050603-r3: task do_build: completed
NOTE: package gnu-config-native-0.1cvs20050603: completed
NOTE: package m4-native-1.4.2: started
NOTE: package m4-native-1.4.2-r0: task do_fetch: started
NOTE: package m4-native-1.4.2-r0: task do_fetch: completed
NOTE: package m4-native-1.4.2-r0: task do_unpack: started
NOTE: Unpacking /root/sources/m4-1.4.2.tar.gz to /var/tmp/bb/work/m4-native-1.4.2-r0/
NOTE: package m4-native-1.4.2-r0: task do_unpack: completed
NOTE: package m4-native-1.4.2-r0: task do_patch: started
NOTE: Applying patch 'make.patch'
NOTE: package m4-native-1.4.2-r0: task do_patch: completed
NOTE: package m4-native-1.4.2-r0: task do_configure: started
NOTE: package m4-native-1.4.2-r0: task do_configure: completed
NOTE: package m4-native-1.4.2-r0: task do_compile: started
NOTE: package m4-native-1.4.2-r0: task do_compile: completed
NOTE: package m4-native-1.4.2-r0: task do_populate_staging: started
NOTE: package m4-native-1.4.2-r0: task do_populate_staging: completed
NOTE: package m4-native-1.4.2-r0: task do_package: started
NOTE: package m4-native-1.4.2-r0: task do_package: completed
NOTE: package m4-native-1.4.2-r0: task do_build: started
NOTE: package m4-native-1.4.2-r0: task do_build: completed
NOTE: package m4-native-1.4.2: completed
NOTE: package autoconf-native-2.59: started
NOTE: package autoconf-native-2.59-r3: task do_fetch: started
NOTE: package autoconf-native-2.59-r3: task do_fetch: completed
NOTE: package autoconf-native-2.59-r3: task do_unpack: started
NOTE: Unpacking /root/sources/autoconf-2.59.tar.bz2 to /var/tmp/bb/work/autoconf-native-2.59-r3/
NOTE: package autoconf-native-2.59-r3: task do_unpack: completed
NOTE: package autoconf-native-2.59-r3: task do_patch: started
NOTE: Applying patch 'program_prefix.patch'
NOTE: Applying patch 'autoreconf-include.patch'
NOTE: Applying patch 'autoreconf-exclude.patch'
NOTE: Applying patch 'autoreconf-foreign.patch'
NOTE: Applying patch 'autoreconf-gnuconfigize.patch'
NOTE: Applying patch 'autoconf259-update-configscripts.patch'
NOTE: Applying patch 'autoheader-nonfatal-warnings.patch'
NOTE: Applying patch 'sizeof_types.patch'
NOTE: package autoconf-native-2.59-r3: task do_patch: completed
NOTE: package autoconf-native-2.59-r3: task do_configure: started
NOTE: package autoconf-native-2.59-r3: task do_configure: completed
NOTE: package autoconf-native-2.59-r3: task do_compile: started
NOTE: package autoconf-native-2.59-r3: task do_compile: completed
NOTE: package autoconf-native-2.59-r3: task do_populate_staging: started
NOTE: package autoconf-native-2.59-r3: task do_populate_staging: completed
NOTE: package autoconf-native-2.59-r3: task do_package: started
NOTE: package autoconf-native-2.59-r3: task do_package: completed
NOTE: package autoconf-native-2.59-r3: task do_build: started
NOTE: package autoconf-native-2.59-r3: task do_build: completed
NOTE: package autoconf-native-2.59: completed
NOTE: package automake-native-1.9.3: started
NOTE: package automake-native-1.9.3-r5: task do_fetch: started
NOTE: package automake-native-1.9.3-r5: task do_fetch: completed
NOTE: package automake-native-1.9.3-r5: task do_unpack: started
NOTE: Unpacking /root/sources/automake-1.9.3.tar.bz2 to /var/tmp/bb/work/automake-native-1.9.3-r5/
NOTE: package automake-native-1.9.3-r5: task do_unpack: completed
NOTE: package automake-native-1.9.3-r5: task do_patch: started
NOTE: package automake-native-1.9.3-r5: task do_patch: completed
NOTE: package automake-native-1.9.3-r5: task do_configure: started
NOTE: package automake-native-1.9.3-r5: task do_configure: completed
NOTE: package automake-native-1.9.3-r5: task do_compile: started
NOTE: package automake-native-1.9.3-r5: task do_compile: completed
NOTE: package automake-native-1.9.3-r5: task do_populate_staging: started
NOTE: package automake-native-1.9.3-r5: task do_populate_staging: completed
NOTE: package automake-native-1.9.3-r5: task do_package: started
NOTE: package automake-native-1.9.3-r5: task do_package: completed
NOTE: package automake-native-1.9.3-r5: task do_build: started
NOTE: package automake-native-1.9.3-r5: task do_build: completed
NOTE: package automake-native-1.9.3: completed
NOTE: package libtool-native-1.5.10: started
NOTE: package libtool-native-1.5.10-r1: task do_fetch: started
NOTE: package libtool-native-1.5.10-r1: task do_fetch: completed
NOTE: package libtool-native-1.5.10-r1: task do_unpack: started
NOTE: Unpacking /root/sources/libtool-1.5.10.tar.gz to /var/tmp/bb/work/libtool-native-1.5.10-r1/
NOTE: package libtool-native-1.5.10-r1: task do_unpack: completed
NOTE: package libtool-native-1.5.10-r1: task do_patch: started
NOTE: Applying patch 'autotools.patch'
NOTE: Applying patch 'uclibc.patch'
NOTE: Applying patch 'libdir-la.patch'
NOTE: Applying patch 'prefix.patch'
NOTE: Applying patch 'tag.patch'
NOTE: Applying patch 'install-path-check.patch'
NOTE: package libtool-native-1.5.10-r1: task do_patch: completed
NOTE: package libtool-native-1.5.10-r1: task do_configure: started
NOTE: package libtool-native-1.5.10-r1: task do_configure: completed
NOTE: package libtool-native-1.5.10-r1: task do_compile: started
ERROR: function do_compile failed
ERROR: log data follows (/usr/tmp/bb/work/libtool-native-1.5.10-r1/temp/log.do_compile.1315)
| NOTE: make
| Making all in .
| make[1]: Entering directory `/var/tmp/bb/work/libtool-native-1.5.10-r1/libtool-1.5.10'
| rm -f ltmain.shT
| date=`/bin/sh /usr/tmp/bb/work/libtool-native-1.5.10-r1/libtool-1.5.10/mkstamp < /usr/tmp/bb/work/libtool-native-1.5.10-r1/libtool-1.5.10/ChangeLog` && \
| sed -e 's/@''PACKAGE@/libtool/' -e 's/@''VERSION@/1.5.10/' \
| -e "s%@""TIMESTAMP@%$date%" /usr/tmp/bb/work/libtool-native-1.5.10-r1/libtool-1.5.10/ltmain.in > ltmain.shT
| mv -f ltmain.shT /usr/tmp/bb/work/libtool-native-1.5.10-r1/libtool-1.5.10/ltmain.sh || \
| (rm -f /usr/tmp/bb/work/libtool-native-1.5.10-r1/libtool-1.5.10/ltmain.sh && cp ltmain.shT /usr/tmp/bb/work/libtool-native-1.5.10-r1/libtool-1.5.10/ltmain.sh && rm -f ltmain.shT)
| cp /usr/tmp/bb/work/libtool-native-1.5.10-r1/libtool-1.5.10/ltmain.sh /usr/tmp/bb/work/libtool-native-1.5.10-r1/libtool-1.5.10/libltdl/
| /bin/sh ./config.status --recheck
| running /bin/sh /usr/tmp/bb/work/libtool-native-1.5.10-r1/libtool-1.5.10/configure --build=i686-linux --host=i686-linux --target=i686-linux --prefix=/usr/tmp/bb/staging --exec_prefix=/usr/tmp/bb/staging/i686-linux --bindir=/usr/tmp/bb/staging/i686-linux/bin --sbindir=/usr/tmp/bb/staging/i686-linux/bin --libexecdir=/usr/tmp/bb/staging/i686-linux/libexec --datadir=/usr/tmp/bb/staging/i686-linux/share --sysconfdir=/usr/tmp/bb/staging/etc --sharedstatedir=/usr/tmp/bb/staging/com --localstatedir=/usr/tmp/bb/staging/var --libdir=/usr/tmp/bb/staging/i686-linux/lib --includedir=/usr/tmp/bb/staging/i686-linux/include --oldincludedir=/usr/tmp/bb/staging/i686-linux/include --infodir=/usr/tmp/bb/staging/i686-linux/share/info --mandir=/usr/tmp/bb/staging/i686-linux/share/man CC=ccache gcc CFLAGS=-I/usr/tmp/bb/staging/i686-linux/include -O2 CPPFLAGS=-I/usr/tmp/bb/staging/i686-linux/include CPP=gcc -E CXXFLAGS=-I/usr/tmp/bb/staging/i686-linux/include -O2 CXX=ccache g++ F77=ccache g77 LDFLAGS=-L/usr/tmp/bb/staging/i686-linux/lib -Wl,-rpath-link,/usr/tmp/bb/staging/i686-linux/lib -Wl,-rpath,/usr/tmp/bb/staging/i686-linux/lib -Wl,-O1 build_alias=i686-linux host_alias=i686-linux target_alias=i686-linux --enable-ltdl-install --no-create --no-recursion
| configure: loading site script /usr/openembedded/site/i686-linux
| checking for a BSD-compatible install... /bin/install -c
| checking whether build environment is sane... yes
| checking for gawk... gawk
| checking whether make sets $(MAKE)... yes
| configure: error: source directory already configured; run "make distclean" there first
| make[1]: *** [i686-linux-libtool] Error 1
| make[1]: Leaving directory `/var/tmp/bb/work/libtool-native-1.5.10-r1/libtool-1.5.10'
| make: *** [all-recursive] Error 1
| FATAL: oe_runmake failed
NOTE: Task failed:
NOTE: package libtool-native-1.5.10-r1: task do_compile: failed
ERROR: TaskFailed event exception, aborting
NOTE: package libtool-native-1.5.10: failed
ERROR: Build of task-bootstrap failed
b-june:root:/usr/build/conf>