All pastes #1321054 Raw Edit

Zeug

public text v1 · immutable
#1321054 ·published 2009-01-28 21:17 UTC
rendered paste body
>>> Unpacking source...
 [32;01m*[0m git update start -->
 [32;01m*[0m    repository: git://anongit.compiz-fusion.org/users/warlock/freewins
 [32;01m*[0m    local clone: /usr/portage/distfiles/git-src/compiz-plugins-freewins
 [32;01m*[0m    committish: master
>>> Unpacked to /var/tmp/portage/x11-plugins/compiz-plugins-freewins-9999/work/freewins
>>> Source unpacked in /var/tmp/portage/x11-plugins/compiz-plugins-freewins-9999/work
>>> Compiling source in /var/tmp/portage/x11-plugins/compiz-plugins-freewins-9999/work/freewins ...
make -s -j3 
[0;1;5mconvert   [0m: [0;32mfreewins.xml.in [0m-> [0;31mbuild/freewins.xml[0m
[0mconvert   : [34mfreewins.xml.in -> build/freewins.xml[0m
[0;1;5mbcop'ing  [0m: [0;32mbuild/freewins.xml [0m-> [0;31mbuild/freewins_options.c[0m[0;1;5mbcop'ing  [0m: [0;32mbuild/freewins.xml [0m-> [0;31mbuild/freewins_options.h[0m
[0mbcop'ing  : [34mbuild/freewins.xml -> build/freewins_options.h[0m
[0;1;5mcompiling [0m: [0;32mevents.c [0m-> [0;31mbuild/events.lo[0m[0;1;5mcompiling [0m: [0;32maction.c [0m-> [0;31mbuild/action.lo[0m
[0mbcop'ing  : [34mbuild/freewins.xml -> build/freewins_options.c[0m
[0;1;5mcompiling [0m: [0;32mfreewins.c [0m-> [0;31mbuild/freewins.lo[0mlibtool: compile: unable to infer tagged configuration
libtool: compile: specify a tag with `--tag'
make: *** [build/events.lo] Fehler 1
make: *** Warte auf noch nicht beendete Prozesse...
libtool: compile: unable to infer tagged configuration
libtool: compile: specify a tag with `--tag'
make: *** [build/action.lo] Fehler 1
libtool: compile: unable to infer tagged configuration
libtool: compile: specify a tag with `--tag'
make: *** [build/freewins.lo] Fehler 1
 [31;01m*[0m 
 [31;01m*[0m ERROR: x11-plugins/compiz-plugins-freewins-9999 failed.
 [31;01m*[0m Call stack:
 [31;01m*[0m               ebuild.sh, line   49:  Called src_compile
 [31;01m*[0m             environment, line 2555:  Called die
 [31;01m*[0m The specific snippet of code:
 [31;01m*[0m       emake || die "emake failed"
 [31;01m*[0m  The die message:
 [31;01m*[0m   emake failed
 [31;01m*[0m 
 [31;01m*[0m If you need support, post the topmost build error, and the call stack if relevant.
 [31;01m*[0m A complete build log is located at '/var/lib/entropy/logs/x11-plugins:compiz-plugins-freewins-9999:20090128-204924.log'.
 [31;01m*[0m The ebuild environment file is located at '/var/tmp/portage/x11-plugins/compiz-plugins-freewins-9999/temp/environment'.
 [31;01m*[0m This ebuild is from an overlay named 'desktop-effects': '/usr/local/portage/layman/desktop-effects/'
 [31;01m*[0m