trem
public text v1 · immutable CHK include/linux/version.h CHK include/linux/utsrelease.h SYMLINK include/asm -> include/asm-x86 CALL scripts/checksyscalls.sh CHK include/linux/compile.h CC [M] drivers/ide/ide-iops.odrivers/ide/ide-iops.c: In function ‘__ide_wait_stat’:drivers/ide/ide-iops.c:506: erreur: implicit declaration of function ‘local_save_flags_nort’make[2]: *** [drivers/ide/ide-iops.o] Erreur 1make[1]: *** [drivers/ide] Erreur 2make: *** [drivers] Erreur 2