All pastes #1295595 Raw Edit

sskaje

public text v1 · immutable
#1295595 ·published 2008-12-29 02:42 UTC
rendered paste body
/bin/sh /data0/build/subversion-1.5.5/libtool --tag=CC --silent --mode=compile gcc -DLINUX=2 -D_REENTRANT -D_GNU_SOURCE -D_LARGEFILE64_SOURCE  -g -O2  -g -O2 -pthread  -I./subversion/include -I./subversion -I/data0/srv/httpd//include   -I/data0/srv/httpd//include/apr-1 -I/data0/srv/bdb//include -I/usr/local/include  -o subversion/libsvn_fs_base/bdb/bdb-err.lo -c subversion/libsvn_fs_base/bdb/bdb-err.c
In file included from subversion/libsvn_fs_base/bdb/../fs.h:29,
                 from subversion/libsvn_fs_base/bdb/bdb-err.c:30:
subversion/libsvn_fs_base/bdb/../bdb/env.h:77: error: syntax error before "DB_ENV"
subversion/libsvn_fs_base/bdb/../bdb/env.h:77: warning: no semicolon at end of struct or union
subversion/libsvn_fs_base/bdb/../bdb/env.h:84: error: syntax error before '}' token
subversion/libsvn_fs_base/bdb/../bdb/env.h:84: warning: data definition has no type or storage class
subversion/libsvn_fs_base/bdb/../bdb/env.h:124: error: syntax error before '*' token
subversion/libsvn_fs_base/bdb/../bdb/env.h:134: error: syntax error before '*' token
subversion/libsvn_fs_base/bdb/../bdb/env.h:138: error: syntax error before '*' token
subversion/libsvn_fs_base/bdb/../bdb/env.h:141: error: syntax error before '*' token
In file included from subversion/libsvn_fs_base/bdb/bdb-err.c:30:
subversion/libsvn_fs_base/bdb/../fs.h:69: error: syntax error before "bdb_env_baton_t"
subversion/libsvn_fs_base/bdb/../fs.h:69: warning: no semicolon at end of struct or union
subversion/libsvn_fs_base/bdb/../fs.h:72: warning: data definition has no type or storage class
subversion/libsvn_fs_base/bdb/../fs.h:73: error: syntax error before '*' token
subversion/libsvn_fs_base/bdb/../fs.h:73: warning: data definition has no type or storage class
subversion/libsvn_fs_base/bdb/../fs.h:74: error: syntax error before '*' token
subversion/libsvn_fs_base/bdb/../fs.h:74: warning: data definition has no type or storage class
subversion/libsvn_fs_base/bdb/../fs.h:75: error: syntax error before '*' token
subversion/libsvn_fs_base/bdb/../fs.h:75: warning: data definition has no type or storage class
subversion/libsvn_fs_base/bdb/../fs.h:76: error: syntax error before '*' token
subversion/libsvn_fs_base/bdb/../fs.h:76: warning: data definition has no type or storage class
subversion/libsvn_fs_base/bdb/../fs.h:77: error: syntax error before '*' token
subversion/libsvn_fs_base/bdb/../fs.h:77: warning: data definition has no type or storage class
subversion/libsvn_fs_base/bdb/../fs.h:78: error: syntax error before '*' token
subversion/libsvn_fs_base/bdb/../fs.h:78: warning: data definition has no type or storage class
subversion/libsvn_fs_base/bdb/../fs.h:79: error: syntax error before '*' token
subversion/libsvn_fs_base/bdb/../fs.h:79: warning: data definition has no type or storage class
subversion/libsvn_fs_base/bdb/../fs.h:80: error: syntax error before '*' token
subversion/libsvn_fs_base/bdb/../fs.h:80: warning: data definition has no type or storage class
subversion/libsvn_fs_base/bdb/../fs.h:81: error: syntax error before '*' token
subversion/libsvn_fs_base/bdb/../fs.h:81: warning: data definition has no type or storage class
subversion/libsvn_fs_base/bdb/../fs.h:82: error: syntax error before '*' token
subversion/libsvn_fs_base/bdb/../fs.h:82: warning: data definition has no type or storage class
subversion/libsvn_fs_base/bdb/../fs.h:94: error: syntax error before '}' token
subversion/libsvn_fs_base/bdb/../fs.h:94: warning: data definition has no type or storage class
In file included from subversion/libsvn_fs_base/bdb/bdb-err.c:33:
subversion/libsvn_fs_base/bdb/bdb-err.h:39: error: syntax error before '*' token
subversion/libsvn_fs_base/bdb/bdb-err.h:55: error: syntax error before '*' token
subversion/libsvn_fs_base/bdb/bdb-err.c: In function `bdb_err_to_apr_err':
subversion/libsvn_fs_base/bdb/bdb-err.c:44: error: `DB_LOCK_DEADLOCK' undeclared (first use in this function)
subversion/libsvn_fs_base/bdb/bdb-err.c:44: error: (Each undeclared identifier is reported only once
subversion/libsvn_fs_base/bdb/bdb-err.c:44: error: for each function it appears in.)
subversion/libsvn_fs_base/bdb/bdb-err.c: At top level:
subversion/libsvn_fs_base/bdb/bdb-err.c:52: error: syntax error before '*' token
subversion/libsvn_fs_base/bdb/bdb-err.c: In function `svn_fs_bdb__dberr':
subversion/libsvn_fs_base/bdb/bdb-err.c:56: error: `bdb_baton' undeclared (first use in this function)
subversion/libsvn_fs_base/bdb/bdb-err.c:59: error: `db_err' undeclared (first use in this function)
subversion/libsvn_fs_base/bdb/bdb-err.c:60: warning: passing arg 3 of pointer to function makes pointer from integer without a cast
subversion/libsvn_fs_base/bdb/bdb-err.c: At top level:
subversion/libsvn_fs_base/bdb/bdb-err.c:65: error: syntax error before '*' token
subversion/libsvn_fs_base/bdb/bdb-err.c: In function `svn_fs_bdb__dberrf':
subversion/libsvn_fs_base/bdb/bdb-err.c:73: error: `bdb_baton' undeclared (first use in this function)
subversion/libsvn_fs_base/bdb/bdb-err.c:76: error: `db_err' undeclared (first use in this function)
subversion/libsvn_fs_base/bdb/bdb-err.c:78: error: `fmt' undeclared (first use in this function)
subversion/libsvn_fs_base/bdb/bdb-err.c: In function `svn_fs_bdb__wrap_db':
subversion/libsvn_fs_base/bdb/bdb-err.c:89: error: `bfd' undeclared (first use in this function)
subversion/libsvn_fs_base/bdb/bdb-err.c: In function `svn_fs_bdb__dberrf':
subversion/libsvn_fs_base/bdb/bdb-err.c:78: error: `va_start' used in function with fixed args
make: *** [subversion/libsvn_fs_base/bdb/bdb-err.lo] Error 1
[root@localhost subversion-1.5.5]#