All pastes #129294 Raw Edit

Untitled

public text v1 · immutable
#129294 ·published 2006-08-13 13:52 UTC
rendered paste body
Making all in bin
make[3]: Entering directory `/home/paul/e17_cvs/e17/proto/etk_server/src/bin'
if gcc -DHAVE_CONFIG_H -I. -I. -I../.. -Wall -export-dynamic -I/usr/local/include -I../../lib -I/opt/e17/include -I/opt/e17/include -I/opt/e17/include -I/opt/e17/include -I/opt/e17/include -I/opt/e17/include -I/opt/e17/include/etk -I/opt/e17/include -I/opt/e17/include -I/opt/e17/include  -I/opt/e17/include  -g -O2 -MT etk_server.o -MD -MP -MF ".deps/etk_server.Tpo" -c -o etk_server.o etk_server.c; \
        then mv -f ".deps/etk_server.Tpo" ".deps/etk_server.Po"; else rm -f ".deps/etk_server.Tpo"; exit 1; fi
etk_server.c: In function ‘process_cmd’:
etk_server.c:258: warning: unused variable ‘name’
etk_server.c: In function ‘main’:
etk_server.c:345: error: too few arguments to function ‘etk_init’
etk_server.c: In function ‘etk_server_function_exists’:
etk_server.c:450: warning: implicit declaration of function ‘strcasestr’
make[3]: *** [etk_server.o] Error 1
make[3]: Leaving directory `/home/paul/e17_cvs/e17/proto/etk_server/src/bin'
make[2]: *** [all-recursive] Error 1
make[2]: Leaving directory `/home/paul/e17_cvs/e17/proto/etk_server/src'
make[1]: *** [all-recursive] Error 1
make[1]: Leaving directory `/home/paul/e17_cvs/e17/proto/etk_server'