Script started on Mon 22 Dec 2008 10:15:10 AM CET
Terminal does not support AddHistory.
cpan shell -- CPAN exploration and modules installation (v1.7602)
ReadLine support available (try 'install Bundle::CPAN')
cpan> install XML::Liberal
CPAN: Storable loaded ok
Going to read /root/.cpan/Metadata
Database was generated on Sun, 21 Dec 2008 21:27:16 GMT
Running install for module XML::Liberal
Running make for M/MI/MIYAGAWA/XML-Liberal-0.20.tar.gz
CPAN: Digest::MD5 loaded ok
CPAN: Compress::Zlib loaded ok
Checksum for /root/.cpan/sources/authors/id/M/MI/MIYAGAWA/XML-Liberal-0.20.tar.gz ok
Scanning cache /root/.cpan/build for sizes
XML-Liberal-0.20/
XML-Liberal-0.20/.shipit
XML-Liberal-0.20/Changes
XML-Liberal-0.20/inc/
XML-Liberal-0.20/inc/Module/
XML-Liberal-0.20/inc/Module/Install/
XML-Liberal-0.20/inc/Module/Install/Base.pm
XML-Liberal-0.20/inc/Module/Install/Can.pm
XML-Liberal-0.20/inc/Module/Install/Fetch.pm
XML-Liberal-0.20/inc/Module/Install/Include.pm
XML-Liberal-0.20/inc/Module/Install/Makefile.pm
XML-Liberal-0.20/inc/Module/Install/Metadata.pm
XML-Liberal-0.20/inc/Module/Install/TestBase.pm
XML-Liberal-0.20/inc/Module/Install/Win32.pm
XML-Liberal-0.20/inc/Module/Install/WriteAll.pm
XML-Liberal-0.20/inc/Module/Install.pm
XML-Liberal-0.20/inc/Spiffy.pm
XML-Liberal-0.20/inc/Test/
XML-Liberal-0.20/inc/Test/Base/
XML-Liberal-0.20/inc/Test/Base/Filter.pm
XML-Liberal-0.20/inc/Test/Base.pm
XML-Liberal-0.20/inc/Test/Builder/
XML-Liberal-0.20/inc/Test/Builder/Module.pm
XML-Liberal-0.20/inc/Test/Builder.pm
XML-Liberal-0.20/inc/Test/More.pm
XML-Liberal-0.20/lib/
XML-Liberal-0.20/lib/XML/
XML-Liberal-0.20/lib/XML/Liberal/
XML-Liberal-0.20/lib/XML/Liberal/LibXML.pm
XML-Liberal-0.20/lib/XML/Liberal/Remedy/
XML-Liberal-0.20/lib/XML/Liberal/Remedy/ControlCode.pm
XML-Liberal-0.20/lib/XML/Liberal/Remedy/Declaration.pm
XML-Liberal-0.20/lib/XML/Liberal/Remedy/DeprecatedDTD.pm
XML-Liberal-0.20/lib/XML/Liberal/Remedy/EntityRef.pm
XML-Liberal-0.20/lib/XML/Liberal/Remedy/HTMLEntity.pm
XML-Liberal-0.20/lib/XML/Liberal/Remedy/InvalidEncoding.pm
XML-Liberal-0.20/lib/XML/Liberal/Remedy/LowAsciiChars.pm
XML-Liberal-0.20/lib/XML/Liberal/Remedy/NotUTF8.pm
XML-Liberal-0.20/lib/XML/Liberal/Remedy/StandaloneAttribute.pm
XML-Liberal-0.20/lib/XML/Liberal/Remedy/UndeclaredNS.pm
XML-Liberal-0.20/lib/XML/Liberal/Remedy/UnquotedAttribute.pm
XML-Liberal-0.20/lib/XML/Liberal/Remedy/XHTMLEmptyTag.pm
XML-Liberal-0.20/lib/XML/Liberal/Remedy.pm
XML-Liberal-0.20/lib/XML/Liberal.pm
XML-Liberal-0.20/Makefile.PL
XML-Liberal-0.20/MANIFEST
XML-Liberal-0.20/META.yml
XML-Liberal-0.20/t/
XML-Liberal-0.20/t/00_compile.t
XML-Liberal-0.20/t/01_bad.t
XML-Liberal-0.20/t/02_global.t
XML-Liberal-0.20/t/03_global_destroy.t
XML-Liberal-0.20/t/04_sanity.t
XML-Liberal-0.20/t/bad/
XML-Liberal-0.20/t/bad/BAD-ampersand.xml
XML-Liberal-0.20/t/bad/BAD-atttibute.xml
XML-Liberal-0.20/t/bad/BAD-br.xml
XML-Liberal-0.20/t/bad/BAD-charset.xml
XML-Liberal-0.20/t/bad/BAD-chr-0.xml
XML-Liberal-0.20/t/bad/BAD-chr-1.xml
XML-Liberal-0.20/t/bad/BAD-chr-11.xml
XML-Liberal-0.20/t/bad/BAD-chr-12.xml
XML-Liberal-0.20/t/bad/BAD-chr-14.xml
XML-Liberal-0.20/t/bad/BAD-chr-15.xml
XML-Liberal-0.20/t/bad/BAD-chr-16.xml
XML-Liberal-0.20/t/bad/BAD-chr-17.xml
XML-Liberal-0.20/t/bad/BAD-chr-18.xml
XML-Liberal-0.20/t/bad/BAD-chr-19.xml
XML-Liberal-0.20/t/bad/BAD-chr-2.xml
XML-Liberal-0.20/t/bad/BAD-chr-20.xml
XML-Liberal-0.20/t/bad/BAD-chr-21.xml
XML-Liberal-0.20/t/bad/BAD-chr-22-ref-hex.xml
XML-Liberal-0.20/t/bad/BAD-chr-22-ref.xml
XML-Liberal-0.20/t/bad/BAD-chr-22.xml
XML-Liberal-0.20/t/bad/BAD-chr-23.xml
XML-Liberal-0.20/t/bad/BAD-chr-24.xml
XML-Liberal-0.20/t/bad/BAD-chr-25.xml
XML-Liberal-0.20/t/bad/BAD-chr-26.xml
XML-Liberal-0.20/t/bad/BAD-chr-27.xml
XML-Liberal-0.20/t/bad/BAD-chr-28.xml
XML-Liberal-0.20/t/bad/BAD-chr-29.xml
XML-Liberal-0.20/t/bad/BAD-chr-3.xml
XML-Liberal-0.20/t/bad/BAD-chr-30.xml
XML-Liberal-0.20/t/bad/BAD-chr-31.xml
XML-Liberal-0.20/t/bad/BAD-chr-4.xml
XML-Liberal-0.20/t/bad/BAD-chr-5.xml
XML-Liberal-0.20/t/bad/BAD-chr-6.xml
XML-Liberal-0.20/t/bad/BAD-chr-7.xml
XML-Liberal-0.20/t/bad/BAD-chr-8.xml
XML-Liberal-0.20/t/bad/BAD-control-cdata.xml
XML-Liberal-0.20/t/bad/BAD-control.xml
XML-Liberal-0.20/t/bad/BAD-declaration.xml
XML-Liberal-0.20/t/bad/BAD-DTD-1.xml
XML-Liberal-0.20/t/bad/BAD-euc.xml
XML-Liberal-0.20/t/bad/BAD-html.xml
XML-Liberal-0.20/t/bad/BAD-html2.xml
XML-Liberal-0.20/t/bad/BAD-lowascii.xml
XML-Liberal-0.20/t/bad/BAD-undeclared-ns-element.xml
XML-Liberal-0.20/t/bad/BAD-undeclared-ns.xml
XML-Liberal-0.20/t/bad/BAD-unquoted-nbsp.xml
XML-Liberal-0.20/t/bad/BAD-unquoted.xml
Removing previously used /root/.cpan/build/XML-Liberal-0.20
CPAN.pm: Going to build M/MI/MIYAGAWA/XML-Liberal-0.20.tar.gz
Cannot determine perl version info from lib/XML/Liberal.pm
Checking if your kit is complete...
Looks good
Writing Makefile for XML::Liberal
cp lib/XML/Liberal/Remedy.pm blib/lib/XML/Liberal/Remedy.pm
cp lib/XML/Liberal/LibXML.pm blib/lib/XML/Liberal/LibXML.pm
cp lib/XML/Liberal/Remedy/DeprecatedDTD.pm blib/lib/XML/Liberal/Remedy/DeprecatedDTD.pm
cp lib/XML/Liberal/Remedy/InvalidEncoding.pm blib/lib/XML/Liberal/Remedy/InvalidEncoding.pm
cp lib/XML/Liberal/Remedy/HTMLEntity.pm blib/lib/XML/Liberal/Remedy/HTMLEntity.pm
cp lib/XML/Liberal.pm blib/lib/XML/Liberal.pm
cp lib/XML/Liberal/Remedy/EntityRef.pm blib/lib/XML/Liberal/Remedy/EntityRef.pm
cp lib/XML/Liberal/Remedy/UndeclaredNS.pm blib/lib/XML/Liberal/Remedy/UndeclaredNS.pm
cp lib/XML/Liberal/Remedy/XHTMLEmptyTag.pm blib/lib/XML/Liberal/Remedy/XHTMLEmptyTag.pm
cp lib/XML/Liberal/Remedy/NotUTF8.pm blib/lib/XML/Liberal/Remedy/NotUTF8.pm
cp lib/XML/Liberal/Remedy/ControlCode.pm blib/lib/XML/Liberal/Remedy/ControlCode.pm
cp lib/XML/Liberal/Remedy/LowAsciiChars.pm blib/lib/XML/Liberal/Remedy/LowAsciiChars.pm
cp lib/XML/Liberal/Remedy/StandaloneAttribute.pm blib/lib/XML/Liberal/Remedy/StandaloneAttribute.pm
cp lib/XML/Liberal/Remedy/Declaration.pm blib/lib/XML/Liberal/Remedy/Declaration.pm
cp lib/XML/Liberal/Remedy/UnquotedAttribute.pm blib/lib/XML/Liberal/Remedy/UnquotedAttribute.pm
Manifying blib/man3/XML::Liberal.3pm
/usr/bin/make -- OK
Running make test
PERL_DL_NONLAZY=1 /usr/bin/perl "-MExtUtils::Command::MM" "-e" "test_harness(0, 'inc', 'blib/lib', 'blib/arch')" t/*.t
t/00_compile...........
t/00_compile...........ok 1/1
t/00_compile...........ok
t/01_bad...............Use of uninitialized value in pattern match (m//) at /root/.cpan/build/XML-Liberal-0.20/blib/lib/XML/Liberal/LibXML.pm line 162, <$fh> line 1.
Can't get pos from :2: parser error : EntityRef: expecting ';'
at t/01_bad.t line 22
# Failed test '/root/.cpan/build/XML-Liberal-0.20/t/bad/BAD-ampersand.xml'
# at t/01_bad.t line 23.
# got: ':2: parser error : EntityRef: expecting ';'
# '
# expected: ''
# Failed test 'created DOM node with /root/.cpan/build/XML-Liberal-0.20/t/bad/BAD-ampersand.xml isa XML::LibXML::Document'
# at t/01_bad.t line 24.
# created DOM node with /root/.cpan/build/XML-Liberal-0.20/t/bad/BAD-ampersand.xml isn't defined
Use of uninitialized value in pattern match (m//) at /root/.cpan/build/XML-Liberal-0.20/blib/lib/XML/Liberal/LibXML.pm line 162, <$fh> line 1.
Can't get pos from :2: parser error : Specification mandate value for attribute noshade
at t/01_bad.t line 22
# Failed test '/root/.cpan/build/XML-Liberal-0.20/t/bad/BAD-atttibute.xml'
# at t/01_bad.t line 23.
# got: ':2: parser error : Specification mandate value for attribute noshade
# '
# expected: ''
# Failed test 'created DOM node with /root/.cpan/build/XML-Liberal-0.20/t/bad/BAD-atttibute.xml isa XML::LibXML::Document'
# at t/01_bad.t line 24.
# created DOM node with /root/.cpan/build/XML-Liberal-0.20/t/bad/BAD-atttibute.xml isn't defined
Use of uninitialized value in concatenation (.) or string at /root/.cpan/build/XML-Liberal-0.20/blib/lib/XML/Liberal/Remedy/ControlCode.pm line 19, <$fh> line 1.
Use of uninitialized value in concatenation (.) or string at /root/.cpan/build/XML-Liberal-0.20/blib/lib/XML/Liberal/Remedy/ControlCode.pm line 19, <$fh> line 1.
Can't find control code line : at /root/.cpan/build/XML-Liberal-0.20/blib/lib/XML/Liberal.pm line 73
# Failed test '/root/.cpan/build/XML-Liberal-0.20/t/bad/BAD-br.xml'
# at t/01_bad.t line 23.
t/01_bad...............ok 1/0
t/01_bad...............NOK 2
t/01_bad...............NOK 3
t/01_bad...............NOK 5
t/01_bad...............NOK 6
t/01_bad...............NOK 8# got: ':3: parser error : Premature end of data in tag xhtml line 2
# '
# expected: ''
# Failed test 'created DOM node with /root/.cpan/build/XML-Liberal-0.20/t/bad/BAD-br.xml isa XML::LibXML::Document'
# at t/01_bad.t line 24.
# created DOM node with /root/.cpan/build/XML-Liberal-0.20/t/bad/BAD-br.xml isn't defined
# Failed test '/root/.cpan/build/XML-Liberal-0.20/t/bad/BAD-control-cdata.xml'
# at t/01_bad.t line 23.
# got: ':3: parser error : Sequence ']]>' not allowed in content
# '
# expected: ''
# Failed test 'created DOM node with /root/.cpan/build/XML-Liberal-0.20/t/bad/BAD-control-cdata.xml isa XML::LibXML::Document'
# at t/01_bad.t line 24.
# created DOM node with /root/.cpan/build/XML-Liberal-0.20/t/bad/BAD-control-cdata.xml isn't defined
t/01_bad...............NOK 9
t/01_bad...............NOK 107
t/01_bad...............NOK 108
t/01_bad...............ok 115/0
# Failed test '/root/.cpan/build/XML-Liberal-0.20/t/bad/BAD-euc.xml'
# at t/01_bad.t line 23.
# got: 'Malformed UTF-8 character (fatal) at /root/.cpan/build/XML-Liberal-0.20/blib/lib/XML/Liberal/Remedy/ControlCode.pm line 13, <$fh> line 1.
# '
# expected: ''
# Failed test 'created DOM node with /root/.cpan/build/XML-Liberal-0.20/t/bad/BAD-euc.xml isa XML::LibXML::Document'
# at t/01_bad.t line 24.
# created DOM node with /root/.cpan/build/XML-Liberal-0.20/t/bad/BAD-euc.xml isn't defined
Use of uninitialized value in pattern match (m//) at /root/.cpan/build/XML-Liberal-0.20/blib/lib/XML/Liberal/LibXML.pm line 162, <$fh> line 1.
Can't get pos from :2: parser error : Entity 'nbsp' not defined
at t/01_bad.t line 22
# Failed test '/root/.cpan/build/XML-Liberal-0.20/t/bad/BAD-html.xml'
# at t/01_bad.t line 23.
# got: ':2: parser error : Entity 'nbsp' not defined
# '
# expected: ''
# Failed test 'created DOM node with /root/.cpan/build/XML-Liberal-0.20/t/bad/BAD-html.xml isa XML::LibXML::Document'
# at t/01_bad.t line 24.
# created DOM node with /root/.cpan/build/XML-Liberal-0.20/t/bad/BAD-html.xml isn't defined
Use of uninitialized value in pattern match (m//) at /root/.cpan/build/XML-Liberal-0.20/blib/lib/XML/Liberal/LibXML.pm line 162, <$fh> line 1.
Can't get pos from :2: parser error : Entity 'hearts' not defined
at t/01_bad.t line 22
# Failed test '/root/.cpan/build/XML-Liberal-0.20/t/bad/BAD-html2.xml'
# at t/01_bad.t line 23.
# got: ':2: parser error : Entity 'hearts' not defined
# '
# expected: ''
# Failed test 'created DOM node with /root/.cpan/build/XML-Liberal-0.20/t/bad/BAD-html2.xml isa XML::LibXML::Document'
# at t/01_bad.t line 24.
# created DOM node with /root/.cpan/build/XML-Liberal-0.20/t/bad/BAD-html2.xml isn't defined
Use of uninitialized value in pattern match (m//) at /root/.cpan/build/XML-Liberal-0.20/blib/lib/XML/Liberal/LibXML.pm line 162, <$fh> line 1.
Can't get pos from :3: namespace error : Namespace prefix content on encoded is not defined
at t/01_bad.t line 22
# Failed test '/root/.cpan/build/XML-Liberal-0.20/t/bad/BAD-undeclared-ns-element.xml'
# at t/01_bad.t line 23.
# got: ':3: namespace error : Namespace prefix content on encoded is not defined
# '
# expected: ''
# Failed test 'created DOM node with /root/.cpan/build/XML-Liberal-0.20/t/bad/BAD-undeclared-ns-element.xml isa XML::LibXML::Document'
# at t/01_bad.t line 24.
# created DOM node with /root/.cpan/build/XML-Liberal-0.20/t/bad/BAD-undeclared-ns-element.xml isn't defined
Use of uninitialized value in pattern match (m//) at /root/.cpan/build/XML-Liberal-0.20/blib/lib/XML/Liberal/LibXML.pm line 162, <$fh> line 1.
Can't get pos from :494: namespace error : Namespace prefix thr for when on link is not defined
at t/01_bad.t line 22
# Failed test '/root/.cpan/build/XML-Liberal-0.20/t/bad/BAD-undeclared-ns.xml'
# at t/01_bad.t line 23.
# got: ':494: namespace error : Namespace prefix thr for when on link is not defined
# '
# expected: ''
# Failed test 'created DOM node with /root/.cpan/build/XML-Liberal-0.20/t/bad/BAD-undeclared-ns.xml isa XML::LibXML::Document'
# at t/01_bad.t line 24.
# created DOM node with /root/.cpan/build/XML-Liberal-0.20/t/bad/BAD-undeclared-ns.xml isn't defined
Use of uninitialized value in concatenation (.) or string at /root/.cpan/build/XML-Liberal-0.20/blib/lib/XML/Liberal/Remedy/ControlCode.pm line 19, <$fh> line 1.
Use of uninitialized value in concatenation (.) or string at /root/.cpan/build/XML-Liberal-0.20/blib/lib/XML/Liberal/Remedy/ControlCode.pm line 19, <$fh> line 1.
Can't find control code line : at /root/.cpan/build/XML-Liberal-0.20/blib/lib/XML/Liberal.pm line 73
# Failed test '/root/.cpan/build/XML-Liberal-0.20/t/bad/BAD-unquoted-nbsp.xml'
# at t/01_bad.t line 23.
# got: ':2: parser error : Extra content at the end of the document
# '
# expected: ''
# Failed test 'created DOM node with /root/.cpan/build/XML-Liberal-0.20/t/bad/BAD-unquoted-nbsp.xml isa XML::LibXML::Document'
# at t/01_bad.t line 24.
# created DOM node with /root/.cpan/build/XML-Liberal-0.20/t/bad/BAD-unquoted-nbsp.xml isn't defined
Use of uninitialized value in concatenation (.) or string at /root/.cpan/build/XML-Liberal-0.20/blib/lib/XML/Liberal/Remedy/ControlCode.pm line 19, <$fh> line 1.
Use of uninitialized value in concatenation (.) or string at /root/.cpan/build/XML-Liberal-0.20/blib/lib/XML/Liberal/Remedy/ControlCode.pm line 19, <$fh> line 1.
Can't find control code line : at /root/.cpan/build/XML-Liberal-0.20/blib/lib/XML/Liberal.pm line 73
# Failed test '/root/.cpan/build/XML-Liberal-0.20/t/bad/BAD-unquoted.xml'
# at t/01_bad.t line 23.
# got: ':2: parser error : Extra content at the end of the document
# '
# expected: ''
# Failed test 'created DOM node with /root/.cpan/build/XML-Liberal-0.20/t/bad/BAD-unquoted.xml isa XML::LibXML::Document'
# at t/01_bad.t line 24.
# created DOM node with /root/.cpan/build/XML-Liberal-0.20/t/bad/BAD-unquoted.xml isn't defined
# Looks like you failed 22 tests of 141.
t/01_bad...............ok 116/0
t/01_bad...............NOK 119
t/01_bad...............NOK 120
t/01_bad...............NOK 122
t/01_bad...............NOK 123
t/01_bad...............NOK 125
t/01_bad...............NOK 126
t/01_bad...............NOK 131
t/01_bad...............NOK 132
t/01_bad...............NOK 134
t/01_bad...............NOK 135
t/01_bad...............NOK 137
t/01_bad...............NOK 138
t/01_bad...............NOK 140
t/01_bad...............NOK 141
t/01_bad...............dubious
Test returned status 22 (wstat 5632, 0x1600)
DIED. FAILED tests 2-3, 5-6, 8-9, 107-108, 119-120, 122-123, 125-126, 131-132, 134-135, 137-138, 140-141
Failed 22/141 tests, 84.40% okay
t/02_global............Use of uninitialized value in pattern match (m//) at /root/.cpan/build/XML-Liberal-0.20/blib/lib/XML/Liberal/LibXML.pm line 162, <$fh> line 2.
Can't get pos from :2: parser error : EntityRef: expecting ';'
at t/02_global.t line 18
t/02_global............NOK 1
# Failed test '/root/.cpan/build/XML-Liberal-0.20/t/bad/BAD-ampersand.xml'
# at t/02_global.t line 19.
# got: ':2: parser error : EntityRef: expecting ';'
# '
# expected: ''
t/02_global............NOK 2
# Failed test 'created DOM node with /root/.cpan/build/XML-Liberal-0.20/t/bad/BAD-ampersand.xml isa XML::LibXML::Document'
# at t/02_global.t line 20.
# created DOM node with /root/.cpan/build/XML-Liberal-0.20/t/bad/BAD-ampersand.xml isn't defined
Use of uninitialized value in pattern match (m//) at /root/.cpan/build/XML-Liberal-0.20/blib/lib/XML/Liberal/LibXML.pm line 162, <$fh> line 2.
Can't get pos from :2: parser error : EntityRef: expecting ';'
at t/02_global.t line 24
t/02_global............NOK 3
# Failed test '/root/.cpan/build/XML-Liberal-0.20/t/bad/BAD-ampersand.xml'
# at t/02_global.t line 25.
# got: ':2: parser error : EntityRef: expecting ';'
# '
# expected: ''
t/02_global............NOK 4
# Failed test 'created DOM node with /root/.cpan/build/XML-Liberal-0.20/t/bad/BAD-ampersand.xml isa XML::LibXML::Document'
# at t/02_global.t line 26.
# created DOM node with /root/.cpan/build/XML-Liberal-0.20/t/bad/BAD-ampersand.xml isn't defined
Use of uninitialized value in pattern match (m//) at /root/.cpan/build/XML-Liberal-0.20/blib/lib/XML/Liberal/LibXML.pm line 162, <$fh> line 2.
Can't get pos from :2: parser error : EntityRef: expecting ';'
at t/02_global.t line 29
t/02_global............NOK 5
# Failed test '/root/.cpan/build/XML-Liberal-0.20/t/bad/BAD-ampersand.xml'
# at t/02_global.t line 30.
# got: ':2: parser error : EntityRef: expecting ';'
# '
# expected: ''
t/02_global............NOK 6
# Failed test 'created DOM node with /root/.cpan/build/XML-Liberal-0.20/t/bad/BAD-ampersand.xml isa XML::LibXML::Document'
# at t/02_global.t line 31.
# created DOM node with /root/.cpan/build/XML-Liberal-0.20/t/bad/BAD-ampersand.xml isn't defined
Use of uninitialized value in pattern match (m//) at /root/.cpan/build/XML-Liberal-0.20/blib/lib/XML/Liberal/LibXML.pm line 162, <$fh> line 2.
Can't get pos from :2: parser error : Specification mandate value for attribute noshade
at t/02_global.t line 18
t/02_global............NOK 7
# Failed test '/root/.cpan/build/XML-Liberal-0.20/t/bad/BAD-atttibute.xml'
# at t/02_global.t line 19.
# got: ':2: parser error : Specification mandate value for attribute noshade
# '
# expected: ''
t/02_global............NOK 8
# Failed test 'created DOM node with /root/.cpan/build/XML-Liberal-0.20/t/bad/BAD-atttibute.xml isa XML::LibXML::Document'
# at t/02_global.t line 20.
# created DOM node with /root/.cpan/build/XML-Liberal-0.20/t/bad/BAD-atttibute.xml isn't defined
Use of uninitialized value in pattern match (m//) at /root/.cpan/build/XML-Liberal-0.20/blib/lib/XML/Liberal/LibXML.pm line 162, <$fh> line 2.
Can't get pos from :2: parser error : Specification mandate value for attribute noshade
at t/02_global.t line 24
t/02_global............NOK 9
# Failed test '/root/.cpan/build/XML-Liberal-0.20/t/bad/BAD-atttibute.xml'
# at t/02_global.t line 25.
# got: ':2: parser error : Specification mandate value for attribute noshade
# '
# expected: ''
t/02_global............NOK 10
# Failed test 'created DOM node with /root/.cpan/build/XML-Liberal-0.20/t/bad/BAD-atttibute.xml isa XML::LibXML::Document'
# at t/02_global.t line 26.
# created DOM node with /root/.cpan/build/XML-Liberal-0.20/t/bad/BAD-atttibute.xml isn't defined
Use of uninitialized value in pattern match (m//) at /root/.cpan/build/XML-Liberal-0.20/blib/lib/XML/Liberal/LibXML.pm line 162, <$fh> line 2.
Can't get pos from :2: parser error : Specification mandate value for attribute noshade
at t/02_global.t line 29
t/02_global............NOK 11
# Failed test '/root/.cpan/build/XML-Liberal-0.20/t/bad/BAD-atttibute.xml'
# at t/02_global.t line 30.
# got: ':2: parser error : Specification mandate value for attribute noshade
# '
# expected: ''
t/02_global............NOK 12
# Failed test 'created DOM node with /root/.cpan/build/XML-Liberal-0.20/t/bad/BAD-atttibute.xml isa XML::LibXML::Document'
# at t/02_global.t line 31.
# created DOM node with /root/.cpan/build/XML-Liberal-0.20/t/bad/BAD-atttibute.xml isn't defined
Use of uninitialized value in concatenation (.) or string at /root/.cpan/build/XML-Liberal-0.20/blib/lib/XML/Liberal/Remedy/ControlCode.pm line 19, <$fh> line 2.
Use of uninitialized value in concatenation (.) or string at /root/.cpan/build/XML-Liberal-0.20/blib/lib/XML/Liberal/Remedy/ControlCode.pm line 19, <$fh> line 2.
Can't find control code line : at /root/.cpan/build/XML-Liberal-0.20/blib/lib/XML/Liberal.pm line 73
t/02_global............NOK 13
# Failed test '/root/.cpan/build/XML-Liberal-0.20/t/bad/BAD-br.xml'
# at t/02_global.t line 19.
# got: ':3: parser error : Premature end of data in tag xhtml line 2
# '
# expected: ''
t/02_global............NOK 14
# Failed test 'created DOM node with /root/.cpan/build/XML-Liberal-0.20/t/bad/BAD-br.xml isa XML::LibXML::Document'
# at t/02_global.t line 20.
# created DOM node with /root/.cpan/build/XML-Liberal-0.20/t/bad/BAD-br.xml isn't defined
Use of uninitialized value in concatenation (.) or string at /root/.cpan/build/XML-Liberal-0.20/blib/lib/XML/Liberal/Remedy/ControlCode.pm line 19, <$fh> line 2.
Use of uninitialized value in concatenation (.) or string at /root/.cpan/build/XML-Liberal-0.20/blib/lib/XML/Liberal/Remedy/ControlCode.pm line 19, <$fh> line 2.
Can't find control code line : at /root/.cpan/build/XML-Liberal-0.20/blib/lib/XML/Liberal.pm line 73
t/02_global............NOK 15
# Failed test '/root/.cpan/build/XML-Liberal-0.20/t/bad/BAD-br.xml'
# at t/02_global.t line 25.
# got: ':3: parser error : Premature end of data in tag xhtml line 2
# '
# expected: ''
t/02_global............NOK 16
# Failed test 'created DOM node with /root/.cpan/build/XML-Liberal-0.20/t/bad/BAD-br.xml isa XML::LibXML::Document'
# at t/02_global.t line 26.
# created DOM node with /root/.cpan/build/XML-Liberal-0.20/t/bad/BAD-br.xml isn't defined
Use of uninitialized value in concatenation (.) or string at /root/.cpan/build/XML-Liberal-0.20/blib/lib/XML/Liberal/Remedy/ControlCode.pm line 19, <$fh> line 2.
Use of uninitialized value in concatenation (.) or string at /root/.cpan/build/XML-Liberal-0.20/blib/lib/XML/Liberal/Remedy/ControlCode.pm line 19, <$fh> line 2.
Can't find control code line : at /root/.cpan/build/XML-Liberal-0.20/blib/lib/XML/Liberal.pm line 73
t/02_global............NOK 17
# Failed test '/root/.cpan/build/XML-Liberal-0.20/t/bad/BAD-br.xml'
# at t/02_global.t line 30.
# got: ':3: parser error : Premature end of data in tag xhtml line 2
# '
# expected: ''
t/02_global............NOK 18
# Failed test 'created DOM node with /root/.cpan/build/XML-Liberal-0.20/t/bad/BAD-br.xml isa XML::LibXML::Document'
# at t/02_global.t line 31.
# created DOM node with /root/.cpan/build/XML-Liberal-0.20/t/bad/BAD-br.xml isn't defined
t/02_global............ok 19/0
t/02_global............NOK 25
# Failed test '/root/.cpan/build/XML-Liberal-0.20/t/bad/BAD-control-cdata.xml'
# at t/02_global.t line 19.
# got: ':3: parser error : Sequence ']]>' not allowed in content
# '
# expected: ''
t/02_global............NOK 26
# Failed test 'created DOM node with /root/.cpan/build/XML-Liberal-0.20/t/bad/BAD-control-cdata.xml isa XML::LibXML::Document'
# at t/02_global.t line 20.
# created DOM node with /root/.cpan/build/XML-Liberal-0.20/t/bad/BAD-control-cdata.xml isn't defined
t/02_global............NOK 27
# Failed test '/root/.cpan/build/XML-Liberal-0.20/t/bad/BAD-control-cdata.xml'
# at t/02_global.t line 25.
# got: ':3: parser error : Sequence ']]>' not allowed in content
# '
# expected: ''
t/02_global............NOK 28
# Failed test 'created DOM node with /root/.cpan/build/XML-Liberal-0.20/t/bad/BAD-control-cdata.xml isa XML::LibXML::Document'
# at t/02_global.t line 26.
# created DOM node with /root/.cpan/build/XML-Liberal-0.20/t/bad/BAD-control-cdata.xml isn't defined
t/02_global............NOK 29
# Failed test '/root/.cpan/build/XML-Liberal-0.20/t/bad/BAD-control-cdata.xml'
# at t/02_global.t line 30.
# got: ':3: parser error : Sequence ']]>' not allowed in content
# '
# expected: ''
t/02_global............NOK 30
# Failed test 'created DOM node with /root/.cpan/build/XML-Liberal-0.20/t/bad/BAD-control-cdata.xml isa XML::LibXML::Document'
# at t/02_global.t line 31.
# created DOM node with /root/.cpan/build/XML-Liberal-0.20/t/bad/BAD-control-cdata.xml isn't defined
t/02_global............ok 43/0
t/02_global............ok 45/0
# Failed test '/root/.cpan/build/XML-Liberal-0.20/t/bad/BAD-euc.xml'
# at t/02_global.t line 19.
# got: 'Malformed UTF-8 character (fatal) at /root/.cpan/build/XML-Liberal-0.20/blib/lib/XML/Liberal/Remedy/ControlCode.pm line 13, <$fh> line 442.
# '
# expected: ''
# Failed test 'created DOM node with /root/.cpan/build/XML-Liberal-0.20/t/bad/BAD-euc.xml isa XML::LibXML::Document'
# at t/02_global.t line 20.
# created DOM node with /root/.cpan/build/XML-Liberal-0.20/t/bad/BAD-euc.xml isn't defined
# Failed test '/root/.cpan/build/XML-Liberal-0.20/t/bad/BAD-euc.xml'
# at t/02_global.t line 25.
# got: 'Malformed UTF-8 character (fatal) at /root/.cpan/build/XML-Liberal-0.20/blib/lib/XML/Liberal/Remedy/ControlCode.pm line 13, <$fh> line 442.
# '
# expected: ''
# Failed test 'created DOM node with /root/.cpan/build/XML-Liberal-0.20/t/bad/BAD-euc.xml isa XML::LibXML::Document'
# at t/02_global.t line 26.
# created DOM node with /root/.cpan/build/XML-Liberal-0.20/t/bad/BAD-euc.xml isn't defined
# Failed test '/root/.cpan/build/XML-Liberal-0.20/t/bad/BAD-euc.xml'
# at t/02_global.t line 30.
# got: 'Malformed UTF-8 character (fatal) at /root/.cpan/build/XML-Liberal-0.20/blib/lib/XML/Liberal/Remedy/ControlCode.pm line 13, <$fh> line 442.
# '
# expected: ''
# Failed test 'created DOM node with /root/.cpan/build/XML-Liberal-0.20/t/bad/BAD-euc.xml isa XML::LibXML::Document'
# at t/02_global.t line 31.
# created DOM node with /root/.cpan/build/XML-Liberal-0.20/t/bad/BAD-euc.xml isn't defined
Use of uninitialized value in pattern match (m//) at /root/.cpan/build/XML-Liberal-0.20/blib/lib/XML/Liberal/LibXML.pm line 162, <$fh> line 2.
Can't get pos from :2: parser error : Entity 'nbsp' not defined
at t/02_global.t line 18
# Failed test '/root/.cpan/build/XML-Liberal-0.20/t/bad/BAD-html.xml'
# at t/02_global.t line 19.
# got: ':2: parser error : Entity 'nbsp' not defined
# '
# expected: ''
# Failed test 'created DOM node with /root/.cpan/build/XML-Liberal-0.20/t/bad/BAD-html.xml isa XML::LibXML::Document'
# at t/02_global.t line 20.
# created DOM node with /root/.cpan/build/XML-Liberal-0.20/t/bad/BAD-html.xml isn't defined
Use of uninitialized value in pattern match (m//) at /root/.cpan/build/XML-Liberal-0.20/blib/lib/XML/Liberal/LibXML.pm line 162, <$fh> line 2.
Can't get pos from :2: parser error : Entity 'nbsp' not defined
at t/02_global.t line 24
# Failed test '/root/.cpan/build/XML-Liberal-0.20/t/bad/BAD-html.xml'
# at t/02_global.t line 25.
# got: ':2: parser error : Entity 'nbsp' not defined
# '
# expected: ''
# Failed test 'created DOM node with /root/.cpan/build/XML-Liberal-0.20/t/bad/BAD-html.xml isa XML::LibXML::Document'
# at t/02_global.t line 26.
# created DOM node with /root/.cpan/build/XML-Liberal-0.20/t/bad/BAD-html.xml isn't defined
Use of uninitialized value in pattern match (m//) at /root/.cpan/build/XML-Liberal-0.20/blib/lib/XML/Liberal/LibXML.pm line 162, <$fh> line 2.
Can't get pos from :2: parser error : Entity 'nbsp' not defined
at t/02_global.t line 29
# Failed test '/root/.cpan/build/XML-Liberal-0.20/t/bad/BAD-html.xml'
# at t/02_global.t line 30.
# got: ':2: parser error : Entity 'nbsp' not defined
# '
# expected: ''
# Failed test 'created DOM node with /root/.cpan/build/XML-Liberal-0.20/t/bad/BAD-html.xml isa XML::LibXML::Document'
# at t/02_global.t line 31.
# created DOM node with /root/.cpan/build/XML-Liberal-0.20/t/bad/BAD-html.xml isn't defined
Use of uninitialized value in pattern match (m//) at /root/.cpan/build/XML-Liberal-0.20/blib/lib/XML/Liberal/LibXML.pm line 162, <$fh> line 2.
Can't get pos from :2: parser error : Entity 'hearts' not defined
at t/02_global.t line 18
# Failed test '/root/.cpan/build/XML-Liberal-0.20/t/bad/BAD-html2.xml'
# at t/02_global.t line 19.
# got: ':2: parser error : Entity 'hearts' not defined
# '
# expected: ''
# Failed test 'created DOM node with /root/.cpan/build/XML-Liberal-0.20/t/bad/BAD-html2.xml isa XML::LibXML::Document'
# at t/02_global.t line 20.
# created DOM node with /root/.cpan/build/XML-Liberal-0.20/t/bad/BAD-html2.xml isn't defined
Use of uninitialized value in pattern match (m//) at /root/.cpan/build/XML-Liberal-0.20/blib/lib/XML/Liberal/LibXML.pm line 162, <$fh> line 2.
Can't get pos from :2: parser error : Entity 'hearts' not defined
at t/02_global.t line 24
# Failed test '/root/.cpan/build/XML-Liberal-0.20/t/bad/BAD-html2.xml'
# at t/02_global.t line 25.
# got: ':2: parser error : Entity 'hearts' not defined
# '
# expected: ''
# Failed test 'created DOM node with /root/.cpan/build/XML-Liberal-0.20/t/bad/BAD-html2.xml isa XML::LibXML::Document'
# at t/02_global.t line 26.
# created DOM node with /root/.cpan/build/XML-Liberal-0.20/t/bad/BAD-html2.xml isn't defined
Use of uninitialized value in pattern match (m//) at /root/.cpan/build/XML-Liberal-0.20/blib/lib/XML/Liberal/LibXML.pm line 162, <$fh> line 2.
Can't get pos from :2: parser error : Entity 'hearts' not defined
at t/02_global.t line 29
# Failed test '/root/.cpan/build/XML-Liberal-0.20/t/bad/BAD-html2.xml'
# at t/02_global.t line 30.
# got: ':2: parser error : Entity 'hearts' not defined
# '
# expected: ''
# Failed test 'created DOM node with /root/.cpan/build/XML-Liberal-0.20/t/bad/BAD-html2.xml isa XML::LibXML::Document'
# at t/02_global.t line 31.
# created DOM node with /root/.cpan/build/XML-Liberal-0.20/t/bad/BAD-html2.xml isn't defined
Use of uninitialized value in pattern match (m//) at /root/.cpan/build/XML-Liberal-0.20/blib/lib/XML/Liberal/LibXML.pm line 162, <$fh> line 4.
Can't get pos from :3: namespace error : Namespace prefix content on encoded is not defined
at t/02_global.t line 18
# Failed test '/root/.cpan/build/XML-Liberal-0.20/t/bad/BAD-undeclared-ns-element.xml'
# at t/02_global.t line 19.
# got: ':3: namespace error : Namespace prefix content on encoded is not defined
# '
# expected: ''
# Failed test 'created DOM node with /root/.cpan/build/XML-Liberal-0.20/t/bad/BAD-undeclared-ns-element.xml isa XML::LibXML::Document'
# at t/02_global.t line 20.
# created DOM node with /root/.cpan/build/XML-Liberal-0.20/t/bad/BAD-undeclared-ns-element.xml isn't defined
Use of uninitialized value in pattern match (m//) at /root/.cpan/build/XML-Liberal-0.20/blib/lib/XML/Liberal/LibXML.pm line 162, <$fh> line 4.
Can't get pos from :3: namespace error : Namespace prefix content on encoded is not defined
at t/02_global.t line 24
# Failed test '/root/.cpan/build/XML-Liberal-0.20/t/bad/BAD-undeclared-ns-element.xml'
# at t/02_global.t line 25.
# got: ':3: namespace error : Namespace prefix content on encoded is not defined
# '
# expected: ''
# Failed test 'created DOM node with /root/.cpan/build/XML-Liberal-0.20/t/bad/BAD-undeclared-ns-element.xml isa XML::LibXML::Document'
# at t/02_global.t line 26.
# created DOM node with /root/.cpan/build/XML-Liberal-0.20/t/bad/BAD-undeclared-ns-element.xml isn't defined
Use of uninitialized value in pattern match (m//) at /root/.cpan/build/XML-Liberal-0.20/blib/lib/XML/Liberal/LibXML.pm line 162, <$fh> line 4.
Can't get pos from :3: namespace error : Namespace prefix content on encoded is not defined
at t/02_global.t line 29
# Failed test '/root/.cpan/build/XML-Liberal-0.20/t/bad/BAD-undeclared-ns-element.xml'
# at t/02_global.t line 30.
# got: ':3: namespace error : Namespace prefix content on encoded is not defined
# '
# expected: ''
# Failed test 'created DOM node with /root/.cpan/build/XML-Liberal-0.20/t/bad/BAD-undeclared-ns-element.xml isa XML::LibXML::Document'
# at t/02_global.t line 31.
# created DOM node with /root/.cpan/build/XML-Liberal-0.20/t/bad/BAD-undeclared-ns-element.xml isn't defined
Use of uninitialized value in pattern match (m//) at /root/.cpan/build/XML-Liberal-0.20/blib/lib/XML/Liberal/LibXML.pm line 162, <$fh> line 516.
Can't get pos from :494: namespace error : Namespace prefix thr for when on link is not defined
at t/02_global.t line 18
# Failed test '/root/.cpan/build/XML-Liberal-0.20/t/bad/BAD-undeclared-ns.xml'
# at t/02_global.t line 19.
# got: ':494: namespace error : Namespace prefix thr for when on link is not defined
# '
# expected: ''
# Failed test 'created DOM node with /root/.cpan/build/XML-Liberal-0.20/t/bad/BAD-undeclared-ns.xml isa XML::LibXML::Document'
# at t/02_global.t line 20.
# created DOM node with /root/.cpan/build/XML-Liberal-0.20/t/bad/BAD-undeclared-ns.xml isn't defined
Use of uninitialized value in pattern match (m//) at /root/.cpan/build/XML-Liberal-0.20/blib/lib/XML/Liberal/LibXML.pm line 162, <$fh> line 516.
Can't get pos from :494: namespace error : Namespace prefix thr for when on link is not defined
at t/02_global.t line 24
# Failed test '/root/.cpan/build/XML-Liberal-0.20/t/bad/BAD-undeclared-ns.xml'
# at t/02_global.t line 25.
# got: ':494: namespace error : Namespace prefix thr for when on link is not defined
# '
# expected: ''
# Failed test 'created DOM node with /root/.cpan/build/XML-Liberal-0.20/t/bad/BAD-undeclared-ns.xml isa XML::LibXML::Document'
# at t/02_global.t line 26.
# created DOM node with /root/.cpan/build/XML-Liberal-0.20/t/bad/BAD-undeclared-ns.xml isn't defined
Use of uninitialized value in pattern match (m//) at /root/.cpan/build/XML-Liberal-0.20/blib/lib/XML/Liberal/LibXML.pm line 162, <$fh> line 516.
Can't get pos from :494: namespace error : Namespace prefix thr for when on link is not defined
at t/02_global.t line 29
# Failed test '/root/.cpan/build/XML-Liberal-0.20/t/bad/BAD-undeclared-ns.xml'
# at t/02_global.t line 30.
# got: ':494: namespace error : Namespace prefix thr for when on link is not defined
# '
# expected: ''
# Failed test 'created DOM node with /root/.cpan/build/XML-Liberal-0.20/t/bad/BAD-undeclared-ns.xml isa XML::LibXML::Document'
# at t/02_global.t line 31.
# created DOM node with /root/.cpan/build/XML-Liberal-0.20/t/bad/BAD-undeclared-ns.xml isn't defined
Use of uninitialized value in concatenation (.) or string at /root/.cpan/build/XML-Liberal-0.20/blib/lib/XML/Liberal/Remedy/ControlCode.pm line 19, <$fh> line 2.
Use of uninitialized value in concatenation (.) or string at /root/.cpan/build/XML-Liberal-0.20/blib/lib/XML/Liberal/Remedy/ControlCode.pm line 19, <$fh> line 2.
Can't find control code line : at /root/.cpan/build/XML-Liberal-0.20/blib/lib/XML/Liberal.pm line 73
# Failed test '/root/.cpan/build/XML-Liberal-0.20/t/bad/BAD-unquoted-nbsp.xml'
# at t/02_global.t line 19.
# got: ':2: parser error : Extra content at the end of the document
# '
# expected: ''
# Failed test 'created DOM node with /root/.cpan/build/XML-Liberal-0.20/t/bad/BAD-unquoted-nbsp.xml isa XML::LibXML::Document'
# at t/02_global.t line 20.
# created DOM node with /root/.cpan/build/XML-Liberal-0.20/t/bad/BAD-unquoted-nbsp.xml isn't defined
Use of uninitialized value in concatenation (.) or string at /root/.cpan/build/XML-Liberal-0.20/blib/lib/XML/Liberal/Remedy/ControlCode.pm line 19, <$fh> line 2.
Use of uninitialized value in concatenation (.) or string at /root/.cpan/build/XML-Liberal-0.20/blib/lib/XML/Liberal/Remedy/ControlCode.pm line 19, <$fh> line 2.
Can't find control code line : at /root/.cpan/build/XML-Liberal-0.20/blib/lib/XML/Liberal.pm line 73
# Failed test '/root/.cpan/build/XML-Liberal-0.20/t/bad/BAD-unquoted-nbsp.xml'
# at t/02_global.t line 25.
# got: ':2: parser error : Extra content at the end of the document
# '
# expected: ''
# Failed test 'created DOM node with /root/.cpan/build/XML-Liberal-0.20/t/bad/BAD-unquoted-nbsp.xml isa XML::LibXML::Document'
# at t/02_global.t line 26.
# created DOM node with /root/.cpan/build/XML-Liberal-0.20/t/bad/BAD-unquoted-nbsp.xml isn't defined
Use of uninitialized value in concatenation (.) or string at /root/.cpan/build/XML-Liberal-0.20/blib/lib/XML/Liberal/Remedy/ControlCode.pm line 19, <$fh> line 2.
Use of uninitialized value in concatenation (.) or string at /root/.cpan/build/XML-Liberal-0.20/blib/lib/XML/Liberal/Remedy/ControlCode.pm line 19, <$fh> line 2.
Can't find control code line : at /root/.cpan/build/XML-Liberal-0.20/blib/lib/XML/Liberal.pm line 73
# Failed test '/root/.cpan/build/XML-Liberal-0.20/t/bad/BAD-unquoted-nbsp.xml'
# at t/02_global.t line 30.
# got: ':2: parser error : Extra content at the end of the document
# '
# expected: ''
# Failed test 'created DOM node with /root/.cpan/build/XML-Liberal-0.20/t/bad/BAD-unquoted-nbsp.xml isa XML::LibXML::Document'
# at t/02_global.t line 31.
# created DOM node with /root/.cpan/build/XML-Liberal-0.20/t/bad/BAD-unquoted-nbsp.xml isn't defined
Use of uninitialized value in concatenation (.) or string at /root/.cpan/build/XML-Liberal-0.20/blib/lib/XML/Liberal/Remedy/ControlCode.pm line 19, <$fh> line 2.
Use of uninitialized value in concatenation (.) or string at /root/.cpan/build/XML-Liberal-0.20/blib/lib/XML/Liberal/Remedy/ControlCode.pm line 19, <$fh> line 2.
Can't find control code line : at /root/.cpan/build/XML-Liberal-0.20/blib/lib/XML/Liberal.pm line 73
# Failed test '/root/.cpan/build/XML-Liberal-0.20/t/bad/BAD-unquoted.xml'
# at t/02_global.t line 19.
# got: ':2: parser error : Extra content at the end of the document
# '
# expected: ''
# Failed test 'created DOM node with /root/.cpan/build/XML-Liberal-0.20/t/bad/BAD-unquoted.xml isa XML::LibXML::Document'
# at t/02_global.t line 20.
# created DOM node with /root/.cpan/build/XML-Liberal-0.20/t/bad/BAD-unquoted.xml isn't defined
Use of uninitialized value in concatenation (.) or string at /root/.cpan/build/XML-Liberal-0.20/blib/lib/XML/Liberal/Remedy/ControlCode.pm line 19, <$fh> line 2.
Use of uninitialized value in concatenation (.) or string at /root/.cpan/build/XML-Liberal-0.20/blib/lib/XML/Liberal/Remedy/ControlCode.pm line 19, <$fh> line 2.
Can't find control code line : at /root/.cpan/build/XML-Liberal-0.20/blib/lib/XML/Liberal.pm line 73
# Failed test '/root/.cpan/build/XML-Liberal-0.20/t/bad/BAD-unquoted.xml'
# at t/02_global.t line 25.
# got: ':2: parser error : Extra content at the end of the document
# '
# expected: ''
# Failed test 'created DOM node with /root/.cpan/build/XML-Liberal-0.20/t/bad/BAD-unquoted.xml isa XML::LibXML::Document'
# at t/02_global.t line 26.
# created DOM node with /root/.cpan/build/XML-Liberal-0.20/t/bad/BAD-unquoted.xml isn't defined
Use of uninitialized value in concatenation (.) or string at /root/.cpan/build/XML-Liberal-0.20/blib/lib/XML/Liberal/Remedy/ControlCode.pm line 19, <$fh> line 2.
Use of uninitialized value in concatenation (.) or string at /root/.cpan/build/XML-Liberal-0.20/blib/lib/XML/Liberal/Remedy/ControlCode.pm line 19, <$fh> line 2.
Can't find control code line : at /root/.cpan/build/XML-Liberal-0.20/blib/lib/XML/Liberal.pm line 73
# Failed test '/root/.cpan/build/XML-Liberal-0.20/t/bad/BAD-unquoted.xml'
# at t/02_global.t line 30.
# got: ':2: parser error : Extra content at the end of the document
# '
# expected: ''
# Failed test 'created DOM node with /root/.cpan/build/XML-Liberal-0.20/t/bad/BAD-unquoted.xml isa XML::LibXML::Document'
# at t/02_global.t line 31.
# created DOM node with /root/.cpan/build/XML-Liberal-0.20/t/bad/BAD-unquoted.xml isn't defined
# Looks like you failed 66 tests of 90.
t/02_global............ok 47/0
t/02_global............NOK 49
t/02_global............NOK 50
t/02_global............NOK 51
t/02_global............NOK 52
t/02_global............NOK 53
t/02_global............NOK 54
t/02_global............NOK 55
t/02_global............NOK 56
t/02_global............NOK 57
t/02_global............NOK 58
t/02_global............NOK 59
t/02_global............NOK 60
t/02_global............NOK 61
t/02_global............NOK 62
t/02_global............NOK 63
t/02_global............NOK 64
t/02_global............NOK 65
t/02_global............NOK 66
t/02_global............NOK 67
t/02_global............NOK 68
t/02_global............NOK 69
t/02_global............NOK 70
t/02_global............NOK 71
t/02_global............NOK 72
t/02_global............NOK 73
t/02_global............NOK 74
t/02_global............NOK 75
t/02_global............NOK 76
t/02_global............NOK 77
t/02_global............NOK 78
t/02_global............NOK 79
t/02_global............NOK 80
t/02_global............NOK 81
t/02_global............NOK 82
t/02_global............NOK 83
t/02_global............NOK 84
t/02_global............NOK 85
t/02_global............NOK 86
t/02_global............NOK 87
t/02_global............NOK 88
t/02_global............NOK 89
t/02_global............NOK 90
t/02_global............dubious
Test returned status 66 (wstat 16896, 0x4200)
DIED. FAILED tests 1-18, 25-30, 49-90
Failed 66/90 tests, 26.67% okay
t/03_global_destroy....Use of uninitialized value in pattern match (m//) at /root/.cpan/build/XML-Liberal-0.20/blib/lib/XML/Liberal/LibXML.pm line 162, <$fh> line 2.
Can't get pos from :2: parser error : EntityRef: expecting ';'
at t/03_global_destroy.t line 20
t/03_global_destroy....NOK 1
# Failed test '/root/.cpan/build/XML-Liberal-0.20/t/bad/BAD-ampersand.xml'
# at t/03_global_destroy.t line 21.
# got: ':2: parser error : EntityRef: expecting ';'
# '
# expected: ''
t/03_global_destroy....NOK 2
# Failed test 'created DOM node with /root/.cpan/build/XML-Liberal-0.20/t/bad/BAD-ampersand.xml isa XML::LibXML::Document'
# at t/03_global_destroy.t line 22.
# created DOM node with /root/.cpan/build/XML-Liberal-0.20/t/bad/BAD-ampersand.xml isn't defined
t/03_global_destroy....ok 3/0Use of uninitialized value in pattern match (m//) at /root/.cpan/build/XML-Liberal-0.20/blib/lib/XML/Liberal/LibXML.pm line 162, <$fh> line 2.
Can't get pos from :2: parser error : Specification mandate value for attribute noshade
at t/03_global_destroy.t line 20
t/03_global_destroy....NOK 4
# Failed test '/root/.cpan/build/XML-Liberal-0.20/t/bad/BAD-atttibute.xml'
# at t/03_global_destroy.t line 21.
# got: ':2: parser error : Specification mandate value for attribute noshade
# '
# expected: ''
t/03_global_destroy....NOK 5
# Failed test 'created DOM node with /root/.cpan/build/XML-Liberal-0.20/t/bad/BAD-atttibute.xml isa XML::LibXML::Document'
# at t/03_global_destroy.t line 22.
# created DOM node with /root/.cpan/build/XML-Liberal-0.20/t/bad/BAD-atttibute.xml isn't defined
Use of uninitialized value in concatenation (.) or string at /root/.cpan/build/XML-Liberal-0.20/blib/lib/XML/Liberal/Remedy/ControlCode.pm line 19, <$fh> line 2.
Use of uninitialized value in concatenation (.) or string at /root/.cpan/build/XML-Liberal-0.20/blib/lib/XML/Liberal/Remedy/ControlCode.pm line 19, <$fh> line 2.
Can't find control code line : at /root/.cpan/build/XML-Liberal-0.20/blib/lib/XML/Liberal.pm line 73
t/03_global_destroy....NOK 7
# Failed test '/root/.cpan/build/XML-Liberal-0.20/t/bad/BAD-br.xml'
# at t/03_global_destroy.t line 21.
# got: ':3: parser error : Premature end of data in tag xhtml line 2
# '
# expected: ''
t/03_global_destroy....NOK 8
# Failed test 'created DOM node with /root/.cpan/build/XML-Liberal-0.20/t/bad/BAD-br.xml isa XML::LibXML::Document'
# at t/03_global_destroy.t line 22.
# created DOM node with /root/.cpan/build/XML-Liberal-0.20/t/bad/BAD-br.xml isn't defined
t/03_global_destroy....NOK 13
# Failed test '/root/.cpan/build/XML-Liberal-0.20/t/bad/BAD-control-cdata.xml'
# at t/03_global_destroy.t line 21.
# got: ':3: parser error : Sequence ']]>' not allowed in content
# '
# expected: ''
t/03_global_destroy....NOK 14
# Failed test 'created DOM node with /root/.cpan/build/XML-Liberal-0.20/t/bad/BAD-control-cdata.xml isa XML::LibXML::Document'
# at t/03_global_destroy.t line 22.
# created DOM node with /root/.cpan/build/XML-Liberal-0.20/t/bad/BAD-control-cdata.xml isn't defined
t/03_global_destroy....ok 22/0
# Failed test '/root/.cpan/build/XML-Liberal-0.20/t/bad/BAD-euc.xml'
# at t/03_global_destroy.t line 21.
# got: 'Malformed UTF-8 character (fatal) at /root/.cpan/build/XML-Liberal-0.20/blib/lib/XML/Liberal/Remedy/ControlCode.pm line 13, <$fh> line 442.
# '
# expected: ''
# Failed test 'created DOM node with /root/.cpan/build/XML-Liberal-0.20/t/bad/BAD-euc.xml isa XML::LibXML::Document'
# at t/03_global_destroy.t line 22.
# created DOM node with /root/.cpan/build/XML-Liberal-0.20/t/bad/BAD-euc.xml isn't defined
Use of uninitialized value in pattern match (m//) at /root/.cpan/build/XML-Liberal-0.20/blib/lib/XML/Liberal/LibXML.pm line 162, <$fh> line 2.
Can't get pos from :2: parser error : Entity 'nbsp' not defined
at t/03_global_destroy.t line 20
# Failed test '/root/.cpan/build/XML-Liberal-0.20/t/bad/BAD-html.xml'
# at t/03_global_destroy.t line 21.
# got: ':2: parser error : Entity 'nbsp' not defined
# '
# expected: ''
# Failed test 'created DOM node with /root/.cpan/build/XML-Liberal-0.20/t/bad/BAD-html.xml isa XML::LibXML::Document'
# at t/03_global_destroy.t line 22.
# created DOM node with /root/.cpan/build/XML-Liberal-0.20/t/bad/BAD-html.xml isn't defined
Use of uninitialized value in pattern match (m//) at /root/.cpan/build/XML-Liberal-0.20/blib/lib/XML/Liberal/LibXML.pm line 162, <$fh> line 2.
Can't get pos from :2: parser error : Entity 'hearts' not defined
at t/03_global_destroy.t line 20
# Failed test '/root/.cpan/build/XML-Liberal-0.20/t/bad/BAD-html2.xml'
# at t/03_global_destroy.t line 21.
# got: ':2: parser error : Entity 'hearts' not defined
# '
# expected: ''
# Failed test 'created DOM node with /root/.cpan/build/XML-Liberal-0.20/t/bad/BAD-html2.xml isa XML::LibXML::Document'
# at t/03_global_destroy.t line 22.
# created DOM node with /root/.cpan/build/XML-Liberal-0.20/t/bad/BAD-html2.xml isn't defined
Use of uninitialized value in pattern match (m//) at /root/.cpan/build/XML-Liberal-0.20/blib/lib/XML/Liberal/LibXML.pm line 162, <$fh> line 4.
Can't get pos from :3: namespace error : Namespace prefix content on encoded is not defined
at t/03_global_destroy.t line 20
# Failed test '/root/.cpan/build/XML-Liberal-0.20/t/bad/BAD-undeclared-ns-element.xml'
# at t/03_global_destroy.t line 21.
# got: ':3: namespace error : Namespace prefix content on encoded is not defined
# '
# expected: ''
# Failed test 'created DOM node with /root/.cpan/build/XML-Liberal-0.20/t/bad/BAD-undeclared-ns-element.xml isa XML::LibXML::Document'
# at t/03_global_destroy.t line 22.
# created DOM node with /root/.cpan/build/XML-Liberal-0.20/t/bad/BAD-undeclared-ns-element.xml isn't defined
Use of uninitialized value in pattern match (m//) at /root/.cpan/build/XML-Liberal-0.20/blib/lib/XML/Liberal/LibXML.pm line 162, <$fh> line 516.
Can't get pos from :494: namespace error : Namespace prefix thr for when on link is not defined
at t/03_global_destroy.t line 20
# Failed test '/root/.cpan/build/XML-Liberal-0.20/t/bad/BAD-undeclared-ns.xml'
# at t/03_global_destroy.t line 21.
# got: ':494: namespace error : Namespace prefix thr for when on link is not defined
# '
# expected: ''
# Failed test 'created DOM node with /root/.cpan/build/XML-Liberal-0.20/t/bad/BAD-undeclared-ns.xml isa XML::LibXML::Document'
# at t/03_global_destroy.t line 22.
# created DOM node with /root/.cpan/build/XML-Liberal-0.20/t/bad/BAD-undeclared-ns.xml isn't defined
Use of uninitialized value in concatenation (.) or string at /root/.cpan/build/XML-Liberal-0.20/blib/lib/XML/Liberal/Remedy/ControlCode.pm line 19, <$fh> line 2.
Use of uninitialized value in concatenation (.) or string at /root/.cpan/build/XML-Liberal-0.20/blib/lib/XML/Liberal/Remedy/ControlCode.pm line 19, <$fh> line 2.
Can't find control code line : at /root/.cpan/build/XML-Liberal-0.20/blib/lib/XML/Liberal.pm line 73
# Failed test '/root/.cpan/build/XML-Liberal-0.20/t/bad/BAD-unquoted-nbsp.xml'
# at t/03_global_destroy.t line 21.
# got: ':2: parser error : Extra content at the end of the document
# '
# expected: ''
# Failed test 'created DOM node with /root/.cpan/build/XML-Liberal-0.20/t/bad/BAD-unquoted-nbsp.xml isa XML::LibXML::Document'
# at t/03_global_destroy.t line 22.
# created DOM node with /root/.cpan/build/XML-Liberal-0.20/t/bad/BAD-unquoted-nbsp.xml isn't defined
Use of uninitialized value in concatenation (.) or string at /root/.cpan/build/XML-Liberal-0.20/blib/lib/XML/Liberal/Remedy/ControlCode.pm line 19, <$fh> line 2.
Use of uninitialized value in concatenation (.) or string at /root/.cpan/build/XML-Liberal-0.20/blib/lib/XML/Liberal/Remedy/ControlCode.pm line 19, <$fh> line 2.
Can't find control code line : at /root/.cpan/build/XML-Liberal-0.20/blib/lib/XML/Liberal.pm line 73
# Failed test '/root/.cpan/build/XML-Liberal-0.20/t/bad/BAD-unquoted.xml'
# at t/03_global_destroy.t line 21.
# got: ':2: parser error : Extra content at the end of the document
# '
# expected: ''
# Failed test 'created DOM node with /root/.cpan/build/XML-Liberal-0.20/t/bad/BAD-unquoted.xml isa XML::LibXML::Document'
# at t/03_global_destroy.t line 22.
# created DOM node with /root/.cpan/build/XML-Liberal-0.20/t/bad/BAD-unquoted.xml isn't defined
# Looks like you failed 22 tests of 45.
t/03_global_destroy....NOK 25
t/03_global_destroy....NOK 26
t/03_global_destroy....NOK 28
t/03_global_destroy....NOK 29
t/03_global_destroy....NOK 31
t/03_global_destroy....NOK 32
t/03_global_destroy....NOK 34
t/03_global_destroy....NOK 35
t/03_global_destroy....NOK 37
t/03_global_destroy....NOK 38
t/03_global_destroy....NOK 40
t/03_global_destroy....NOK 41
t/03_global_destroy....NOK 43
t/03_global_destroy....NOK 44
t/03_global_destroy....dubious
Test returned status 22 (wstat 5632, 0x1600)
DIED. FAILED tests 1-2, 4-5, 7-8, 13-14, 25-26, 28-29, 31-32, 34-35, 37-38, 40-41, 43-44
Failed 22/45 tests, 51.11% okay
t/04_sanity............
t/04_sanity............ok 1/0Use of uninitialized value in pattern match (m//) at /root/.cpan/build/XML-Liberal-0.20/blib/lib/XML/Liberal/LibXML.pm line 162, <DATA> line 1.
Can't get pos from :2: parser error : xmlParseEntityRef: no name
at t/04_sanity.t line 6
:2: parser error : xmlParseEntityRef: no name
# Looks like your test died just after 3.
t/04_sanity............dubious
Test returned status 255 (wstat 65280, 0xff00)
after all the subtests completed successfully
Failed Test Stat Wstat Total Fail Failed List of Failed
-------------------------------------------------------------------------------
t/01_bad.t 22 5632 141 22 15.60% 2-3 5-6 8-9 107-108 119-
120 122-123 125-126 131-
132 134-135 137-138 140-
141
t/02_global.t 66 16896 90 66 73.33% 1-18 25-30 49-90
t/03_global_destroy.t 22 5632 45 22 48.89% 1-2 4-5 7-8 13-14 25-26
28-29 31-32 34-35 37-38
40-41 43-44
t/04_sanity.t 255 65280 3 0 0.00% ??
Failed 4/5 test scripts, 20.00% okay. 110/280 subtests failed, 60.71% okay.
make: *** [test_dynamic] Error 255
/usr/bin/make test -- NOT OK
Running make install
make test had returned bad status, won't install without force
cpan> quit
Terminal does not support GetHistory.
Lockfile removed.
Script done on Mon 22 Dec 2008 10:15:39 AM CET