All pastes #128615 Raw Edit

bzfs compile errors

public text v1 · immutable
#128615 ·published 2006-08-13 03:09 UTC
rendered paste body
1>------ Build started: Project: bzfs, Configuration: Release Win32 ------
1>Linking...
1>   Creating library .\..\..\src\bzfs\bzfs.lib and object .\..\..\src\bzfs\bzfs.exp
1>common.lib(cURLManager.obj) : error LNK2019: unresolved external symbol __imp__curl_multi_init referenced in function "private: static void __cdecl cURLManager::setup(void)" (?setup@cURLManager@@CAXXZ)
1>common.lib(cURLManager.obj) : error LNK2019: unresolved external symbol __imp__curl_global_init referenced in function "private: static void __cdecl cURLManager::setup(void)" (?setup@cURLManager@@CAXXZ)
1>common.lib(cURLManager.obj) : error LNK2019: unresolved external symbol __imp__curl_version referenced in function "private: static void __cdecl cURLManager::setup(void)" (?setup@cURLManager@@CAXXZ)
1>common.lib(cURLManager.obj) : error LNK2019: unresolved external symbol __imp__curl_easy_setopt referenced in function "public: void __thiscall cURLManager::setTimeout(long)" (?setTimeout@cURLManager@@QAEXJ@Z)
1>common.lib(cURLManager.obj) : error LNK2019: unresolved external symbol __imp__curl_multi_add_handle referenced in function "public: void __thiscall cURLManager::addHandle(void)" (?addHandle@cURLManager@@QAEXXZ)
1>common.lib(cURLManager.obj) : error LNK2019: unresolved external symbol __imp__curl_multi_remove_handle referenced in function "public: void __thiscall cURLManager::removeHandle(void)" (?removeHandle@cURLManager@@QAEXXZ)
1>common.lib(cURLManager.obj) : error LNK2019: unresolved external symbol __imp__curl_multi_fdset referenced in function "public: static int __cdecl cURLManager::fdset(struct fd_set &,struct fd_set &)" (?fdset@cURLManager@@SAHAAUfd_set@@0@Z)
1>common.lib(cURLManager.obj) : error LNK2019: unresolved external symbol __imp__curl_formfree referenced in function "private: void __thiscall cURLManager::infoComplete(enum CURLcode)" (?infoComplete@cURLManager@@AAEXW4CURLcode@@@Z)
1>common.lib(cURLManager.obj) : error LNK2019: unresolved external symbol __imp__curl_easy_getinfo referenced in function "public: bool __thiscall cURLManager::getFileTime(__int64 &)" (?getFileTime@cURLManager@@QAE_NAA_J@Z)
1>common.lib(cURLManager.obj) : error LNK2019: unresolved external symbol __imp__curl_formadd referenced in function "public: void __thiscall cURLManager::addFormData(char const *,char const *)" (?addFormData@cURLManager@@QAEXPBD0@Z)
1>common.lib(cURLManager.obj) : error LNK2019: unresolved external symbol __imp__curl_easy_perform referenced in function "public: void __thiscall cURLManager::performWait(void)" (?performWait@cURLManager@@QAEXXZ)
1>common.lib(cURLManager.obj) : error LNK2019: unresolved external symbol __imp__curl_easy_cleanup referenced in function "public: virtual __thiscall cURLManager::~cURLManager(void)" (??1cURLManager@@UAE@XZ)
1>common.lib(cURLManager.obj) : error LNK2019: unresolved external symbol __imp__curl_easy_init referenced in function "public: __thiscall cURLManager::cURLManager(void)" (??0cURLManager@@QAE@XZ)
1>common.lib(cURLManager.obj) : error LNK2019: unresolved external symbol __imp__curl_multi_info_read referenced in function "public: static bool __cdecl cURLManager::perform(void)" (?perform@cURLManager@@SA_NXZ)
1>common.lib(cURLManager.obj) : error LNK2019: unresolved external symbol __imp__curl_multi_perform referenced in function "public: static bool __cdecl cURLManager::perform(void)" (?perform@cURLManager@@SA_NXZ)
1>common.lib(ErrorHandler.obj) : error LNK2019: unresolved external symbol __imp__MessageBoxA@16 referenced in function "void __cdecl printFatalError(char const *,...)" (?printFatalError@@YAXPBDZZ)
1>game.lib(DirectoryNames.obj) : error LNK2019: unresolved external symbol __imp__SHGetMalloc@4 referenced in function "class std::basic_string<char,struct std::char_traits<char>,class std::allocator<char> > __cdecl getConfigDirName(char const *)" (?getConfigDirName@@YA?AV?$basic_string@DU?$char_traits@D@std@@V?$allocator@D@2@@std@@PBD@Z)
1>game.lib(DirectoryNames.obj) : error LNK2019: unresolved external symbol __imp__SHGetPathFromIDListA@8 referenced in function "class std::basic_string<char,struct std::char_traits<char>,class std::allocator<char> > __cdecl getConfigDirName(char const *)" (?getConfigDirName@@YA?AV?$basic_string@DU?$char_traits@D@std@@V?$allocator@D@2@@std@@PBD@Z)
1>game.lib(DirectoryNames.obj) : error LNK2019: unresolved external symbol __imp__SHGetSpecialFolderLocation@12 referenced in function "class std::basic_string<char,struct std::char_traits<char>,class std::allocator<char> > __cdecl getConfigDirName(char const *)" (?getConfigDirName@@YA?AV?$basic_string@DU?$char_traits@D@std@@V?$allocator@D@2@@std@@PBD@Z)
1>ares.lib(ares_init.obj) : error LNK2019: unresolved external symbol __imp__RegQueryValueExA@24 referenced in function _get_res_nt
1>ares.lib(ares_gethostbyaddr.obj) : error LNK2001: unresolved external symbol __imp__RegQueryValueExA@24
1>ares.lib(ares_gethostbyname.obj) : error LNK2001: unresolved external symbol __imp__RegQueryValueExA@24
1>ares.lib(ares_init.obj) : error LNK2019: unresolved external symbol __imp__RegCloseKey@4 referenced in function _get_res_interfaces_nt
1>ares.lib(ares_gethostbyaddr.obj) : error LNK2001: unresolved external symbol __imp__RegCloseKey@4
1>ares.lib(ares_gethostbyname.obj) : error LNK2001: unresolved external symbol __imp__RegCloseKey@4
1>ares.lib(ares_init.obj) : error LNK2019: unresolved external symbol __imp__RegOpenKeyExA@20 referenced in function _get_res_interfaces_nt
1>ares.lib(ares_gethostbyaddr.obj) : error LNK2001: unresolved external symbol __imp__RegOpenKeyExA@20
1>ares.lib(ares_gethostbyname.obj) : error LNK2001: unresolved external symbol __imp__RegOpenKeyExA@20
1>ares.lib(ares_init.obj) : error LNK2019: unresolved external symbol __imp__RegEnumKeyExA@32 referenced in function _get_res_interfaces_nt
1>.\..\..\src\bzfs\bzfs.exe : fatal error LNK1120: 23 unresolved externals
1>Build log was saved at "file://c:\bzflag-2.0.8\bzflag\src\bzfs\BuildLog.htm"
1>bzfs - 30 error(s), 0 warning(s)
========== Build: 0 succeeded, 1 failed, 0 up-to-date, 0 skipped ==========