All pastes #128455 Raw Edit

Mine

public text v1 · immutable
#128455 ·published 2006-08-13 00:25 UTC
rendered paste body
In file included from ../../../../cfe/trunk/libstdc++-v3/libsupc++/del_op.cc:31:
../../../../cfe/trunk/libstdc++-v3/libsupc++/new:41:19: error: cstddef: No such file or directory
In file included from ../../../../cfe/trunk/libstdc++-v3/libsupc++/del_op.cc:32:
/more/llvmgcc4/build/i686-pc-linux-gnu/libstdc++-v3/include/i686-pc-linux-gnu/bits/c++config.h:35:29: error: bits/os_defines.h: No such file or directory
../../../../cfe/trunk/libstdc++-v3/libsupc++/del_op.cc:34:19: error: cstdlib: No such file or directory
../../../../cfe/trunk/libstdc++-v3/libsupc++/new:84: error: declaration of 'operator new' as non-function
../../../../cfe/trunk/libstdc++-v3/libsupc++/new:84: error: 'size_t' is not a member of 'std'
../../../../cfe/trunk/libstdc++-v3/libsupc++/new:85: error: declaration of 'operator new []' as non-function
../../../../cfe/trunk/libstdc++-v3/libsupc++/new:85: error: 'size_t' is not a member of 'std'
../../../../cfe/trunk/libstdc++-v3/libsupc++/new:88: error: declaration of 'operator new' as non-function
../../../../cfe/trunk/libstdc++-v3/libsupc++/new:88: error: 'size_t' is not a member of 'std'
../../../../cfe/trunk/libstdc++-v3/libsupc++/new:88: error: expected primary-expression before 'const'
../../../../cfe/trunk/libstdc++-v3/libsupc++/new:89: error: declaration of 'operator new []' as non-function
../../../../cfe/trunk/libstdc++-v3/libsupc++/new:89: error: 'size_t' is not a member of 'std'
../../../../cfe/trunk/libstdc++-v3/libsupc++/new:89: error: expected primary-expression before 'const'
../../../../cfe/trunk/libstdc++-v3/libsupc++/new:94: error: declaration of 'operator new' as non-function
../../../../cfe/trunk/libstdc++-v3/libsupc++/new:94: error: 'size_t' is not a member of 'std'
../../../../cfe/trunk/libstdc++-v3/libsupc++/new:94: error: expected primary-expression before 'void'
../../../../cfe/trunk/libstdc++-v3/libsupc++/new:95: error: declaration of 'operator new []' as non-function
../../../../cfe/trunk/libstdc++-v3/libsupc++/new:95: error: 'size_t' is not a member of 'std'
../../../../cfe/trunk/libstdc++-v3/libsupc++/new:95: error: expected primary-expression before 'void'
../../../../cfe/trunk/libstdc++-v3/libsupc++/del_op.cc:38: error: 'std::free' has not been declared
../../../../cfe/trunk/libstdc++-v3/libsupc++/del_op.cc: In function 'void operator delete(void*)':
../../../../cfe/trunk/libstdc++-v3/libsupc++/del_op.cc:49: error: 'free' was not declared in this scope
make[3]: *** [del_op.lo] Error 1
make[3]: Leaving directory `/more/llvmgcc4/build/i686-pc-linux-gnu/libstdc++-v3/libsupc++'
make[2]: *** [all-recursive] Error 1
make[2]: Leaving directory `/more/llvmgcc4/build/i686-pc-linux-gnu/libstdc++-v3'
make[1]: *** [all] Error 2
make[1]: Leaving directory `/more/llvmgcc4/build/i686-pc-linux-gnu/libstdc++-v3'
make: *** [all-target-libstdc++-v3] Error 2
saem@suse:/more/llvmgcc4/build> echo $PATH
/more/hlvm/install/bin:/home/saem/bin:/usr/local/bin:/usr/bin:/usr/X11R6/bin:/bin:/usr/games:/opt/gnome/bin:/opt/kde3/bin:/usr/lib/qt3/bin:/more/llvm/install/bin:/more/hlvm/install/bin:/more/llvm/install/bin:/more/hlvm/install/bin