All pastes #127829 Raw Edit

Mine

public text v1 · immutable
·published 2006-08-12 14:45 UTC
rendered paste body
user@tyrel:/usr/src/linux-2.6.16.13-4-obj/i386/default> ls /lib/modules/`uname -
r`/build
linux-2.6.15.13-4-default  Module.symvers
user@tyrel:/usr/src/linux-2.6.16.13-4-obj/i386/default> make uninstall
make: *** No rule to make target `uninstall'.  Stop.
user@tyrel:/usr/src/linux-2.6.16.13-4-obj/i386/default> pwd
/usr/src/linux-2.6.16.13-4-obj/i386/default
user@tyrel:/usr/src/linux-2.6.16.13-4-obj/i386/default> cd ..
user@tyrel:/usr/src/linux-2.6.16.13-4-obj/i386> cd ~
user@tyrel:~> ls
bin  Desktop  Documents  ndiswrapper-1.22  public_html  stuff
user@tyrel:~> cd ndiswrapper-1.22/
user@tyrel:~/ndiswrapper-1.22> make uninstall
which: no loadndisdriver in (/home/user/bin:/usr/local/bin:/usr/bin:/usr/X11R6/b
in:/bin:/usr/games:/opt/gnome/bin:/opt/kde3/bin:/usr/lib/mit/bin:/usr/lib/mit/sb
in)
which: no loadndisdriver in (/home/user/bin:/usr/local/bin:/usr/bin:/usr/X11R6/b
in:/bin:/usr/games:/opt/gnome/bin:/opt/kde3/bin:/usr/lib/mit/bin:/usr/lib/mit/sb
in)
which: no loadndisdriver in (/home/user/bin:/usr/local/bin:/usr/bin:/usr/X11R6/b                  in:/bin:/usr/games:/opt/gnome/bin:/opt/kde3/bin:/usr/lib/mit/bin:/usr/lib/mit/sb                  in)
which: no ndiswrapper in (/home/user/bin:/usr/local/bin:/usr/bin:/usr/X11R6/bin:                  /bin:/usr/games:/opt/gnome/bin:/opt/kde3/bin:/usr/lib/mit/bin:/usr/lib/mit/sbin)
which: no ndiswrapper in (/home/user/bin:/usr/local/bin:/usr/bin:/usr/X11R6/bin:                  /bin:/usr/games:/opt/gnome/bin:/opt/kde3/bin:/usr/lib/mit/bin:/usr/lib/mit/sbin)
which: no ndiswrapper in (/home/user/bin:/usr/local/bin:/usr/bin:/usr/X11R6/bin:                  /bin:/usr/games:/opt/gnome/bin:/opt/kde3/bin:/usr/lib/mit/bin:/usr/lib/mit/sbin)
which: no ndiswrapper-buginfo in (/home/user/bin:/usr/local/bin:/usr/bin:/usr/X1                  1R6/bin:/bin:/usr/games:/opt/gnome/bin:/opt/kde3/bin:/usr/lib/mit/bin:/usr/lib/m                  it/sbin)
which: no ndiswrapper-buginfo in (/home/user/bin:/usr/local/bin:/usr/bin:/usr/X1                  1R6/bin:/bin:/usr/games:/opt/gnome/bin:/opt/kde3/bin:/usr/lib/mit/bin:/usr/lib/m                  it/sbin)
which: no ndiswrapper-buginfo in (/home/user/bin:/usr/local/bin:/usr/bin:/usr/X1                  1R6/bin:/bin:/usr/games:/opt/gnome/bin:/opt/kde3/bin:/usr/lib/mit/bin:/usr/lib/m                  it/sbin)
NOTE: Not all installed files are removed, as different distributions install nd                  iswrapper files at different places.
Run uninstall as many times as necessary until no "removing" messages appear bel                  ow.
user@tyrel:~/ndiswrapper-1.22> make
make -C driver
make[1]: Entering directory `/home/user/ndiswrapper-1.22/driver'
Can't find kernel build files in /lib/modules/2.6.16.13-4-default/build;
  give the path to kernel build directory with
  KBUILD=<path> argument to make
make[1]: *** [prereq_check] Error 1
make[1]: Leaving directory `/home/user/ndiswrapper-1.22/driver'
make: *** [all] Error 2
user@tyrel:~/ndiswrapper-1.22> su
Password:
tyrel:/home/user/ndiswrapper-1.22 # make INSTALL
make: Nothing to be done for `INSTALL'.
tyrel:/home/user/ndiswrapper-1.22 # ls
AUTHORS    driver   .INSTALL.swp  ndiswrapper.8     README
ChangeLog  INSTALL  Makefile      ndiswrapper.spec  utils
tyrel:/home/user/ndiswrapper-1.22 # cd driver/
tyrel:/home/user/ndiswrapper-1.22/driver # ls
divdi3.c   loader.c      ndis.c         ntoskernel_io.c  proc.c           workqueue.c  wrapper.c
hal.c      loader.h      ndis.h         pe_linker.c      usb.c            wrapmem.c
iw_ndis.c  longlong.h    ndiswrapper.h  pe_linker.h      usb.h            wrapmem.h
iw_ndis.h  Makefile      ntoskernel.c   pnp.c            win2lin_stubs.S  wrapndis.c
lin2win.h  misc_funcs.c  ntoskernel.h   pnp.h            winnt_types.h    wrapndis.h
tyrel:/home/user/ndiswrapper-1.22/driver # cd ..
tyrel:/home/user/ndiswrapper-1.22 # ls
AUTHORS    driver   .INSTALL.swp  ndiswrapper.8     README
ChangeLog  INSTALL  Makefile      ndiswrapper.spec  utils
tyrel:/home/user/ndiswrapper-1.22 # make install
make -C driver install
make[1]: Entering directory `/home/user/ndiswrapper-1.22/driver'
Can't find kernel build files in /lib/modules/2.6.16.13-4-default/build;
  give the path to kernel build directory with
  KBUILD=<path> argument to make
make[1]: *** [prereq_check] Error 1
make[1]: Leaving directory `/home/user/ndiswrapper-1.22/driver'
make: *** [install] Error 2
tyrel:/home/user/ndiswrapper-1.22 #