rendered paste bodysun$ cat config.log
This file contains any messages produced by compilers while
running configure, to aid debugging if configure makes a mistake.
It was created by configure, which was
generated by GNU Autoconf 2.59. Invocation command line was
$ ./configure --with-sdl-prefix=/usr/local
## --------- ##
## Platform. ##
## --------- ##
hostname = sun
uname -m = sun4u
uname -r = 5.10
uname -s = SunOS
uname -v = Generic
/usr/bin/uname -p = sparc
/bin/uname -X = System = SunOS
Node = sun
Release = 5.10
KernelID = Generic
Machine = sun4u
BusType = <unknown>
Serial = <unknown>
Users = <unknown>
OEM# = 0
Origin# = 1
NumCPU = 1
/bin/arch = sun4
/usr/bin/arch -k = sun4u
/usr/convex/getsysinfo = unknown
hostinfo = unknown
/bin/machine = unknown
/usr/bin/oslevel = unknown
/bin/universe = unknown
PATH: /home/sears/bin
PATH: /usr/local/bin
PATH: /opt/csw/sbin
PATH: /opt/csw/bin
PATH: /opt/csw/gcc3/bin
PATH: /sbin
PATH: /bin
PATH: /usr/sbin
PATH: /usr/bin
PATH: /usr/ccs/bin
## ----------- ##
## Core tests. ##
## ----------- ##
configure:1384: checking build system type
configure:1402: result: sparc-sun-solaris2.10
configure:1410: checking host system type
configure:1424: result: sparc-sun-solaris2.10
configure:1432: checking target system type
configure:1446: result: sparc-sun-solaris2.10
configure:1474: checking for a BSD-compatible install
configure:1529: result: /opt/csw/bin/ginstall -c
configure:1540: checking whether build environment is sane
configure:1583: result: yes
configure:1640: checking for gawk
configure:1656: found /opt/csw/bin/gawk
configure:1666: result: gawk
configure:1676: checking whether make sets $(MAKE)
configure:1696: result: yes
configure:1875: checking for whoami
configure:1902: result: no
configure:1969: checking whether make sets $(MAKE)
configure:1989: result: yes
configure:2044: checking for gcc
configure:2060: found /opt/csw/gcc3/bin/gcc
configure:2070: result: gcc
configure:2314: checking for C compiler version
configure:2317: gcc --version </dev/null >&5
gcc (GCC) 3.4.3
Copyright (C) 2004 Free Software Foundation, Inc.
This is free software; see the source for copying conditions. There is NO
warranty; not even for MERCHANTABILITY or FITNESS FOR A PARTICULAR PURPOSE.
configure:2320: $? = 0
configure:2322: gcc -v </dev/null >&5
Reading specs from /opt/csw/gcc3/lib/gcc/sparc-sun-solaris2.8/3.4.3/specs
Configured with: ../sources/gcc-3.4.3/configure --prefix=/opt/csw/gcc3 --with-local-prefix=/opt/csw --without-gnu-as --with-as=/usr/ccs/bin/as --without-gnu-ld --with-ld=/usr/ccs/bin/ld --enable-threads=posix --enable-shared --enable-multilib --enable-nls --with-included-gettext --with-libiconv-prefix=/opt/csw --with-x --enable-java-awt=xlib --enable-languages=all
Thread model: posix
gcc version 3.4.3
configure:2325: $? = 0
configure:2327: gcc -V </dev/null >&5
gcc: `-V' option must have argument
configure:2330: $? = 1
configure:2353: checking for C compiler default output file name
configure:2356: gcc conftest.c >&5
configure:2359: $? = 0
configure:2405: result: a.out
configure:2410: checking whether the C compiler works
configure:2416: ./a.out
configure:2419: $? = 0
configure:2436: result: yes
configure:2443: checking whether we are cross compiling
configure:2445: result: no
configure:2448: checking for suffix of executables
configure:2450: gcc -o conftest conftest.c >&5
configure:2453: $? = 0
configure:2478: result:
configure:2484: checking for suffix of object files
configure:2505: gcc -c conftest.c >&5
configure:2508: $? = 0
configure:2530: result: o
configure:2534: checking whether we are using the GNU C compiler
configure:2558: gcc -c conftest.c >&5
configure:2564: $? = 0
configure:2568: test -z
|| test ! -s conftest.err
configure:2571: $? = 0
configure:2574: test -s conftest.o
configure:2577: $? = 0
configure:2590: result: yes
configure:2596: checking whether gcc accepts -g
configure:2617: gcc -c -g conftest.c >&5
configure:2623: $? = 0
configure:2627: test -z
|| test ! -s conftest.err
configure:2630: $? = 0
configure:2633: test -s conftest.o
configure:2636: $? = 0
configure:2647: result: yes
configure:2664: checking for gcc option to accept ANSI C
configure:2734: gcc -c -g -O2 conftest.c >&5
configure:2740: $? = 0
configure:2744: test -z
|| test ! -s conftest.err
configure:2747: $? = 0
configure:2750: test -s conftest.o
configure:2753: $? = 0
configure:2771: result: none needed
configure:2789: gcc -c -g -O2 conftest.c >&5
conftest.c:2: error: parse error before "me"
configure:2795: $? = 1
configure: failed program was:
| #ifndef __cplusplus
| choke me
| #endif
configure:2939: checking for style of include used by make
configure:2967: result: GNU
configure:2995: checking dependency style of gcc
configure:3080: result: gcc3
configure:3149: checking for g++
configure:3165: found /opt/csw/gcc3/bin/g++
configure:3175: result: g++
configure:3191: checking for C++ compiler version
configure:3194: g++ --version </dev/null >&5
g++ (GCC) 3.4.3
Copyright (C) 2004 Free Software Foundation, Inc.
This is free software; see the source for copying conditions. There is NO
warranty; not even for MERCHANTABILITY or FITNESS FOR A PARTICULAR PURPOSE.
configure:3197: $? = 0
configure:3199: g++ -v </dev/null >&5
Reading specs from /opt/csw/gcc3/lib/gcc/sparc-sun-solaris2.8/3.4.3/specs
Configured with: ../sources/gcc-3.4.3/configure --prefix=/opt/csw/gcc3 --with-local-prefix=/opt/csw --without-gnu-as --with-as=/usr/ccs/bin/as --without-gnu-ld --with-ld=/usr/ccs/bin/ld --enable-threads=posix --enable-shared --enable-multilib --enable-nls --with-included-gettext --with-libiconv-prefix=/opt/csw --with-x --enable-java-awt=xlib --enable-languages=all
Thread model: posix
gcc version 3.4.3
configure:3202: $? = 0
configure:3204: g++ -V </dev/null >&5
g++: `-V' option must have argument
configure:3207: $? = 1
configure:3210: checking whether we are using the GNU C++ compiler
configure:3234: g++ -c conftest.cc >&5
configure:3240: $? = 0
configure:3244: test -z
|| test ! -s conftest.err
configure:3247: $? = 0
configure:3250: test -s conftest.o
configure:3253: $? = 0
configure:3266: result: yes
configure:3272: checking whether g++ accepts -g
configure:3293: g++ -c -g conftest.cc >&5
configure:3299: $? = 0
configure:3303: test -z
|| test ! -s conftest.err
configure:3306: $? = 0
configure:3309: test -s conftest.o
configure:3312: $? = 0
configure:3323: result: yes
configure:3365: g++ -c -g -O2 conftest.cc >&5
configure:3371: $? = 0
configure:3375: test -z
|| test ! -s conftest.err
configure:3378: $? = 0
configure:3381: test -s conftest.o
configure:3384: $? = 0
configure:3410: g++ -c -g -O2 conftest.cc >&5
conftest.cc: In function `int main()':
conftest.cc:18: error: `exit' undeclared (first use this function)
conftest.cc:18: error: (Each undeclared identifier is reported only once for each function it appears in.)
configure:3416: $? = 1
configure: failed program was:
| /* confdefs.h. */
|
| #define PACKAGE_NAME ""
| #define PACKAGE_TARNAME ""
| #define PACKAGE_VERSION ""
| #define PACKAGE_STRING ""
| #define PACKAGE_BUGREPORT ""
| #define PACKAGE "bzflag"
| #define VERSION "2.0.3.20050526"
| #define BZ_BUILD_OS "solaris2.10"
| #define BZ_BUILD_USER "anonymous"
| #define BUILD_REGEX 1
| /* end confdefs.h. */
|
| int
| main ()
| {
| exit (42);
| ;
| return 0;
| }
configure:3365: g++ -c -g -O2 conftest.cc >&5
configure:3371: $? = 0
configure:3375: test -z
|| test ! -s conftest.err
configure:3378: $? = 0
configure:3381: test -s conftest.o
configure:3384: $? = 0
configure:3410: g++ -c -g -O2 conftest.cc >&5
configure:3416: $? = 0
configure:3420: test -z
|| test ! -s conftest.err
configure:3423: $? = 0
configure:3426: test -s conftest.o
configure:3429: $? = 0
configure:3454: checking dependency style of g++
configure:3539: result: gcc3
configure:3560: checking for ccache
configure:3593: result: no
configure:3644: checking for windres
configure:3671: result: :
configure:3742: checking whether ln -s works
configure:3746: result: yes
configure:3794: checking for ranlib
configure:3810: found /usr/ccs/bin/ranlib
configure:3821: result: ranlib
configure:3835: checking for pod2man
configure:3851: found /opt/csw/bin/pod2man
configure:3862: result: yes
configure:3886: checking for ar
configure:3902: found /usr/ccs/bin/ar
configure:3912: result: ar
configure:3921: checking for compress in -lz
configure:3951: gcc -o conftest -g -O2 conftest.c -lz >&5
configure:3957: $? = 0
configure:3961: test -z
|| test ! -s conftest.err
configure:3964: $? = 0
configure:3967: test -s conftest
configure:3970: $? = 0
configure:3983: result: yes
configure:4012: checking for curl >= 7.10.0
configure:4022: result: 7.14.0
configure:4121: checking for artificial intelligence for bz's robots
configure:4123: result: not found
configure:4132: checking how to run the C preprocessor
configure:4167: gcc -E conftest.c
configure:4173: $? = 0
configure:4205: gcc -E conftest.c
conftest.c:18:28: ac_nonexistent.h: No such file or directory
configure:4211: $? = 1
configure: failed program was:
| /* confdefs.h. */
|
| #define PACKAGE_NAME ""
| #define PACKAGE_TARNAME ""
| #define PACKAGE_VERSION ""
| #define PACKAGE_STRING ""
| #define PACKAGE_BUGREPORT ""
| #define PACKAGE "bzflag"
| #define VERSION "2.0.3.20050526"
| #define BZ_BUILD_OS "solaris2.10"
| #define BZ_BUILD_USER "anonymous"
| #define BUILD_REGEX 1
| #ifdef __cplusplus
| extern "C" void std::exit (int) throw (); using std::exit;
| #endif
| #define HAVE_CURL 1
| /* end confdefs.h. */
| #include <ac_nonexistent.h>
configure:4250: result: gcc -E
configure:4274: gcc -E conftest.c
configure:4280: $? = 0
configure:4312: gcc -E conftest.c
conftest.c:18:28: ac_nonexistent.h: No such file or directory
configure:4318: $? = 1
configure: failed program was:
| /* confdefs.h. */
|
| #define PACKAGE_NAME ""
| #define PACKAGE_TARNAME ""
| #define PACKAGE_VERSION ""
| #define PACKAGE_STRING ""
| #define PACKAGE_BUGREPORT ""
| #define PACKAGE "bzflag"
| #define VERSION "2.0.3.20050526"
| #define BZ_BUILD_OS "solaris2.10"
| #define BZ_BUILD_USER "anonymous"
| #define BUILD_REGEX 1
| #ifdef __cplusplus
| extern "C" void std::exit (int) throw (); using std::exit;
| #endif
| #define HAVE_CURL 1
| /* end confdefs.h. */
| #include <ac_nonexistent.h>
configure:4362: checking for egrep
configure:4372: result: egrep
configure:4377: checking for ANSI C header files
configure:4402: gcc -c -g -O2 conftest.c >&5
configure:4408: $? = 0
configure:4412: test -z
|| test ! -s conftest.err
configure:4415: $? = 0
configure:4418: test -s conftest.o
configure:4421: $? = 0
configure:4510: gcc -o conftest -g -O2 conftest.c >&5
configure:4513: $? = 0
configure:4515: ./conftest
configure:4518: $? = 0
configure:4533: result: yes
configure:4566: checking for sys/types.h
configure:4582: g++ -c -g -O2 conftest.cc >&5
configure:4588: $? = 0
configure:4592: test -z
|| test ! -s conftest.err
configure:4595: $? = 0
configure:4598: test -s conftest.o
configure:4601: $? = 0
configure:4612: result: yes
configure:4566: checking for sys/stat.h
configure:4582: g++ -c -g -O2 conftest.cc >&5
configure:4588: $? = 0
configure:4592: test -z
|| test ! -s conftest.err
configure:4595: $? = 0
configure:4598: test -s conftest.o
configure:4601: $? = 0
configure:4612: result: yes
configure:4566: checking for stdlib.h
configure:4582: g++ -c -g -O2 conftest.cc >&5
configure:4588: $? = 0
configure:4592: test -z
|| test ! -s conftest.err
configure:4595: $? = 0
configure:4598: test -s conftest.o
configure:4601: $? = 0
configure:4612: result: yes
configure:4566: checking for string.h
configure:4582: g++ -c -g -O2 conftest.cc >&5
configure:4588: $? = 0
configure:4592: test -z
|| test ! -s conftest.err
configure:4595: $? = 0
configure:4598: test -s conftest.o
configure:4601: $? = 0
configure:4612: result: yes
configure:4566: checking for memory.h
configure:4582: g++ -c -g -O2 conftest.cc >&5
configure:4588: $? = 0
configure:4592: test -z
|| test ! -s conftest.err
configure:4595: $? = 0
configure:4598: test -s conftest.o
configure:4601: $? = 0
configure:4612: result: yes
configure:4566: checking for strings.h
configure:4582: g++ -c -g -O2 conftest.cc >&5
configure:4588: $? = 0
configure:4592: test -z
|| test ! -s conftest.err
configure:4595: $? = 0
configure:4598: test -s conftest.o
configure:4601: $? = 0
configure:4612: result: yes
configure:4566: checking for inttypes.h
configure:4582: g++ -c -g -O2 conftest.cc >&5
configure:4588: $? = 0
configure:4592: test -z
|| test ! -s conftest.err
configure:4595: $? = 0
configure:4598: test -s conftest.o
configure:4601: $? = 0
configure:4612: result: yes
configure:4566: checking for stdint.h
configure:4582: g++ -c -g -O2 conftest.cc >&5
configure:4588: $? = 0
configure:4592: test -z
|| test ! -s conftest.err
configure:4595: $? = 0
configure:4598: test -s conftest.o
configure:4601: $? = 0
configure:4612: result: yes
configure:4566: checking for unistd.h
configure:4582: g++ -c -g -O2 conftest.cc >&5
configure:4588: $? = 0
configure:4592: test -z
|| test ! -s conftest.err
configure:4595: $? = 0
configure:4598: test -s conftest.o
configure:4601: $? = 0
configure:4612: result: yes
configure:4629: checking how to run the C++ preprocessor
configure:4660: g++ -E conftest.cc
configure:4666: $? = 0
configure:4698: g++ -E conftest.cc
conftest.cc:28:28: ac_nonexistent.h: No such file or directory
configure:4704: $? = 1
configure: failed program was:
| /* confdefs.h. */
|
| #define PACKAGE_NAME ""
| #define PACKAGE_TARNAME ""
| #define PACKAGE_VERSION ""
| #define PACKAGE_STRING ""
| #define PACKAGE_BUGREPORT ""
| #define PACKAGE "bzflag"
| #define VERSION "2.0.3.20050526"
| #define BZ_BUILD_OS "solaris2.10"
| #define BZ_BUILD_USER "anonymous"
| #define BUILD_REGEX 1
| #ifdef __cplusplus
| extern "C" void std::exit (int) throw (); using std::exit;
| #endif
| #define HAVE_CURL 1
| #define STDC_HEADERS 1
| #define HAVE_SYS_TYPES_H 1
| #define HAVE_SYS_STAT_H 1
| #define HAVE_STDLIB_H 1
| #define HAVE_STRING_H 1
| #define HAVE_MEMORY_H 1
| #define HAVE_STRINGS_H 1
| #define HAVE_INTTYPES_H 1
| #define HAVE_STDINT_H 1
| #define HAVE_UNISTD_H 1
| /* end confdefs.h. */
| #include <ac_nonexistent.h>
configure:4743: result: g++ -E
configure:4767: g++ -E conftest.cc
configure:4773: $? = 0
configure:4805: g++ -E conftest.cc
conftest.cc:28:28: ac_nonexistent.h: No such file or directory
configure:4811: $? = 1
configure: failed program was:
| /* confdefs.h. */
|
| #define PACKAGE_NAME ""
| #define PACKAGE_TARNAME ""
| #define PACKAGE_VERSION ""
| #define PACKAGE_STRING ""
| #define PACKAGE_BUGREPORT ""
| #define PACKAGE "bzflag"
| #define VERSION "2.0.3.20050526"
| #define BZ_BUILD_OS "solaris2.10"
| #define BZ_BUILD_USER "anonymous"
| #define BUILD_REGEX 1
| #ifdef __cplusplus
| extern "C" void std::exit (int) throw (); using std::exit;
| #endif
| #define HAVE_CURL 1
| #define STDC_HEADERS 1
| #define HAVE_SYS_TYPES_H 1
| #define HAVE_SYS_STAT_H 1
| #define HAVE_STDLIB_H 1
| #define HAVE_STRING_H 1
| #define HAVE_MEMORY_H 1
| #define HAVE_STRINGS_H 1
| #define HAVE_INTTYPES_H 1
| #define HAVE_STDINT_H 1
| #define HAVE_UNISTD_H 1
| /* end confdefs.h. */
| #include <ac_nonexistent.h>
configure:4875: checking cstdlib usability
configure:4887: g++ -c -g -O2 conftest.cc >&5
configure:4893: $? = 0
configure:4897: test -z
|| test ! -s conftest.err
configure:4900: $? = 0
configure:4903: test -s conftest.o
configure:4906: $? = 0
configure:4916: result: yes
configure:4920: checking cstdlib presence
configure:4930: g++ -E conftest.cc
configure:4936: $? = 0
configure:4956: result: yes
configure:4991: checking for cstdlib
configure:4998: result: yes
configure:4875: checking cstdio usability
configure:4887: g++ -c -g -O2 conftest.cc >&5
configure:4893: $? = 0
configure:4897: test -z
|| test ! -s conftest.err
configure:4900: $? = 0
configure:4903: test -s conftest.o
configure:4906: $? = 0
configure:4916: result: yes
configure:4920: checking cstdio presence
configure:4930: g++ -E conftest.cc
configure:4936: $? = 0
configure:4956: result: yes
configure:4991: checking for cstdio
configure:4998: result: yes
configure:4875: checking cstring usability
configure:4887: g++ -c -g -O2 conftest.cc >&5
configure:4893: $? = 0
configure:4897: test -z
|| test ! -s conftest.err
configure:4900: $? = 0
configure:4903: test -s conftest.o
configure:4906: $? = 0
configure:4916: result: yes
configure:4920: checking cstring presence
configure:4930: g++ -E conftest.cc
configure:4936: $? = 0
configure:4956: result: yes
configure:4991: checking for cstring
configure:4998: result: yes
configure:5207: checking GL/glx.h usability
configure:5219: gcc -c -g -O2 conftest.c >&5
configure:5225: $? = 0
configure:5229: test -z
|| test ! -s conftest.err
configure:5232: $? = 0
configure:5235: test -s conftest.o
configure:5238: $? = 0
configure:5248: result: yes
configure:5252: checking GL/glx.h presence
configure:5262: gcc -E conftest.c
configure:5268: $? = 0
configure:5288: result: yes
configure:5323: checking for GL/glx.h
configure:5330: result: yes
configure:5207: checking SDL/SDL.h usability
configure:5219: gcc -c -g -O2 conftest.c >&5
conftest.c:66:21: SDL/SDL.h: No such file or directory
configure:5225: $? = 1
configure: failed program was:
| /* confdefs.h. */
|
| #define PACKAGE_NAME ""
| #define PACKAGE_TARNAME ""
| #define PACKAGE_VERSION ""
| #define PACKAGE_STRING ""
| #define PACKAGE_BUGREPORT ""
| #define PACKAGE "bzflag"
| #define VERSION "2.0.3.20050526"
| #define BZ_BUILD_OS "solaris2.10"
| #define BZ_BUILD_USER "anonymous"
| #define BUILD_REGEX 1
| #ifdef __cplusplus
| extern "C" void std::exit (int) throw (); using std::exit;
| #endif
| #define HAVE_CURL 1
| #define STDC_HEADERS 1
| #define HAVE_SYS_TYPES_H 1
| #define HAVE_SYS_STAT_H 1
| #define HAVE_STDLIB_H 1
| #define HAVE_STRING_H 1
| #define HAVE_MEMORY_H 1
| #define HAVE_STRINGS_H 1
| #define HAVE_INTTYPES_H 1
| #define HAVE_STDINT_H 1
| #define HAVE_UNISTD_H 1
| #define HAVE_CSTDLIB 1
| #define HAVE_CSTDIO 1
| #define HAVE_CSTRING 1
| #define HAVE_GL_GLX_H 1
| /* end confdefs.h. */
| #include <stdio.h>
| #if HAVE_SYS_TYPES_H
| # include <sys/types.h>
| #endif
| #if HAVE_SYS_STAT_H
| # include <sys/stat.h>
| #endif
| #if STDC_HEADERS
| # include <stdlib.h>
| # include <stddef.h>
| #else
| # if HAVE_STDLIB_H
| # include <stdlib.h>
| # endif
| #endif
| #if HAVE_STRING_H
| # if !STDC_HEADERS && HAVE_MEMORY_H
| # include <memory.h>
| # endif
| # include <string.h>
| #endif
| #if HAVE_STRINGS_H
| # include <strings.h>
| #endif
| #if HAVE_INTTYPES_H
| # include <inttypes.h>
| #else
| # if HAVE_STDINT_H
| # include <stdint.h>
| # endif
| #endif
| #if HAVE_UNISTD_H
| # include <unistd.h>
| #endif
| #include <SDL/SDL.h>
configure:5248: result: no
configure:5252: checking SDL/SDL.h presence
configure:5262: gcc -E conftest.c
conftest.c:32:21: SDL/SDL.h: No such file or directory
configure:5268: $? = 1
configure: failed program was:
| /* confdefs.h. */
|
| #define PACKAGE_NAME ""
| #define PACKAGE_TARNAME ""
| #define PACKAGE_VERSION ""
| #define PACKAGE_STRING ""
| #define PACKAGE_BUGREPORT ""
| #define PACKAGE "bzflag"
| #define VERSION "2.0.3.20050526"
| #define BZ_BUILD_OS "solaris2.10"
| #define BZ_BUILD_USER "anonymous"
| #define BUILD_REGEX 1
| #ifdef __cplusplus
| extern "C" void std::exit (int) throw (); using std::exit;
| #endif
| #define HAVE_CURL 1
| #define STDC_HEADERS 1
| #define HAVE_SYS_TYPES_H 1
| #define HAVE_SYS_STAT_H 1
| #define HAVE_STDLIB_H 1
| #define HAVE_STRING_H 1
| #define HAVE_MEMORY_H 1
| #define HAVE_STRINGS_H 1
| #define HAVE_INTTYPES_H 1
| #define HAVE_STDINT_H 1
| #define HAVE_UNISTD_H 1
| #define HAVE_CSTDLIB 1
| #define HAVE_CSTDIO 1
| #define HAVE_CSTRING 1
| #define HAVE_GL_GLX_H 1
| /* end confdefs.h. */
| #include <SDL/SDL.h>
configure:5288: result: no
configure:5323: checking for SDL/SDL.h
configure:5330: result: no
configure:5207: checking X11/Xlib.h usability
configure:5219: gcc -c -g -O2 conftest.c >&5
configure:5225: $? = 0
configure:5229: test -z
|| test ! -s conftest.err
configure:5232: $? = 0
configure:5235: test -s conftest.o
configure:5238: $? = 0
configure:5248: result: yes
configure:5252: checking X11/Xlib.h presence
configure:5262: gcc -E conftest.c
configure:5268: $? = 0
configure:5288: result: yes
configure:5323: checking for X11/Xlib.h
configure:5330: result: yes
configure:5207: checking bstring.h usability
configure:5219: gcc -c -g -O2 conftest.c >&5
conftest.c:67:21: bstring.h: No such file or directory
configure:5225: $? = 1
configure: failed program was:
| /* confdefs.h. */
|
| #define PACKAGE_NAME ""
| #define PACKAGE_TARNAME ""
| #define PACKAGE_VERSION ""
| #define PACKAGE_STRING ""
| #define PACKAGE_BUGREPORT ""
| #define PACKAGE "bzflag"
| #define VERSION "2.0.3.20050526"
| #define BZ_BUILD_OS "solaris2.10"
| #define BZ_BUILD_USER "anonymous"
| #define BUILD_REGEX 1
| #ifdef __cplusplus
| extern "C" void std::exit (int) throw (); using std::exit;
| #endif
| #define HAVE_CURL 1
| #define STDC_HEADERS 1
| #define HAVE_SYS_TYPES_H 1
| #define HAVE_SYS_STAT_H 1
| #define HAVE_STDLIB_H 1
| #define HAVE_STRING_H 1
| #define HAVE_MEMORY_H 1
| #define HAVE_STRINGS_H 1
| #define HAVE_INTTYPES_H 1
| #define HAVE_STDINT_H 1
| #define HAVE_UNISTD_H 1
| #define HAVE_CSTDLIB 1
| #define HAVE_CSTDIO 1
| #define HAVE_CSTRING 1
| #define HAVE_GL_GLX_H 1
| #define HAVE_X11_XLIB_H 1
| /* end confdefs.h. */
| #include <stdio.h>
| #if HAVE_SYS_TYPES_H
| # include <sys/types.h>
| #endif
| #if HAVE_SYS_STAT_H
| # include <sys/stat.h>
| #endif
| #if STDC_HEADERS
| # include <stdlib.h>
| # include <stddef.h>
| #else
| # if HAVE_STDLIB_H
| # include <stdlib.h>
| # endif
| #endif
| #if HAVE_STRING_H
| # if !STDC_HEADERS && HAVE_MEMORY_H
| # include <memory.h>
| # endif
| # include <string.h>
| #endif
| #if HAVE_STRINGS_H
| # include <strings.h>
| #endif
| #if HAVE_INTTYPES_H
| # include <inttypes.h>
| #else
| # if HAVE_STDINT_H
| # include <stdint.h>
| # endif
| #endif
| #if HAVE_UNISTD_H
| # include <unistd.h>
| #endif
| #include <bstring.h>
configure:5248: result: no
configure:5252: checking bstring.h presence
configure:5262: gcc -E conftest.c
conftest.c:33:21: bstring.h: No such file or directory
configure:5268: $? = 1
configure: failed program was:
| /* confdefs.h. */
|
| #define PACKAGE_NAME ""
| #define PACKAGE_TARNAME ""
| #define PACKAGE_VERSION ""
| #define PACKAGE_STRING ""
| #define PACKAGE_BUGREPORT ""
| #define PACKAGE "bzflag"
| #define VERSION "2.0.3.20050526"
| #define BZ_BUILD_OS "solaris2.10"
| #define BZ_BUILD_USER "anonymous"
| #define BUILD_REGEX 1
| #ifdef __cplusplus
| extern "C" void std::exit (int) throw (); using std::exit;
| #endif
| #define HAVE_CURL 1
| #define STDC_HEADERS 1
| #define HAVE_SYS_TYPES_H 1
| #define HAVE_SYS_STAT_H 1
| #define HAVE_STDLIB_H 1
| #define HAVE_STRING_H 1
| #define HAVE_MEMORY_H 1
| #define HAVE_STRINGS_H 1
| #define HAVE_INTTYPES_H 1
| #define HAVE_STDINT_H 1
| #define HAVE_UNISTD_H 1
| #define HAVE_CSTDLIB 1
| #define HAVE_CSTDIO 1
| #define HAVE_CSTRING 1
| #define HAVE_GL_GLX_H 1
| #define HAVE_X11_XLIB_H 1
| /* end confdefs.h. */
| #include <bstring.h>
configure:5288: result: no
configure:5323: checking for bstring.h
configure:5330: result: no
configure:5207: checking linux/input.h usability
configure:5219: gcc -c -g -O2 conftest.c >&5
conftest.c:67:25: linux/input.h: No such file or directory
configure:5225: $? = 1
configure: failed program was:
| /* confdefs.h. */
|
| #define PACKAGE_NAME ""
| #define PACKAGE_TARNAME ""
| #define PACKAGE_VERSION ""
| #define PACKAGE_STRING ""
| #define PACKAGE_BUGREPORT ""
| #define PACKAGE "bzflag"
| #define VERSION "2.0.3.20050526"
| #define BZ_BUILD_OS "solaris2.10"
| #define BZ_BUILD_USER "anonymous"
| #define BUILD_REGEX 1
| #ifdef __cplusplus
| extern "C" void std::exit (int) throw (); using std::exit;
| #endif
| #define HAVE_CURL 1
| #define STDC_HEADERS 1
| #define HAVE_SYS_TYPES_H 1
| #define HAVE_SYS_STAT_H 1
| #define HAVE_STDLIB_H 1
| #define HAVE_STRING_H 1
| #define HAVE_MEMORY_H 1
| #define HAVE_STRINGS_H 1
| #define HAVE_INTTYPES_H 1
| #define HAVE_STDINT_H 1
| #define HAVE_UNISTD_H 1
| #define HAVE_CSTDLIB 1
| #define HAVE_CSTDIO 1
| #define HAVE_CSTRING 1
| #define HAVE_GL_GLX_H 1
| #define HAVE_X11_XLIB_H 1
| /* end confdefs.h. */
| #include <stdio.h>
| #if HAVE_SYS_TYPES_H
| # include <sys/types.h>
| #endif
| #if HAVE_SYS_STAT_H
| # include <sys/stat.h>
| #endif
| #if STDC_HEADERS
| # include <stdlib.h>
| # include <stddef.h>
| #else
| # if HAVE_STDLIB_H
| # include <stdlib.h>
| # endif
| #endif
| #if HAVE_STRING_H
| # if !STDC_HEADERS && HAVE_MEMORY_H
| # include <memory.h>
| # endif
| # include <string.h>
| #endif
| #if HAVE_STRINGS_H
| # include <strings.h>
| #endif
| #if HAVE_INTTYPES_H
| # include <inttypes.h>
| #else
| # if HAVE_STDINT_H
| # include <stdint.h>
| # endif
| #endif
| #if HAVE_UNISTD_H
| # include <unistd.h>
| #endif
| #include <linux/input.h>
configure:5248: result: no
configure:5252: checking linux/input.h presence
configure:5262: gcc -E conftest.c
conftest.c:33:25: linux/input.h: No such file or directory
configure:5268: $? = 1
configure: failed program was:
| /* confdefs.h. */
|
| #define PACKAGE_NAME ""
| #define PACKAGE_TARNAME ""
| #define PACKAGE_VERSION ""
| #define PACKAGE_STRING ""
| #define PACKAGE_BUGREPORT ""
| #define PACKAGE "bzflag"
| #define VERSION "2.0.3.20050526"
| #define BZ_BUILD_OS "solaris2.10"
| #define BZ_BUILD_USER "anonymous"
| #define BUILD_REGEX 1
| #ifdef __cplusplus
| extern "C" void std::exit (int) throw (); using std::exit;
| #endif
| #define HAVE_CURL 1
| #define STDC_HEADERS 1
| #define HAVE_SYS_TYPES_H 1
| #define HAVE_SYS_STAT_H 1
| #define HAVE_STDLIB_H 1
| #define HAVE_STRING_H 1
| #define HAVE_MEMORY_H 1
| #define HAVE_STRINGS_H 1
| #define HAVE_INTTYPES_H 1
| #define HAVE_STDINT_H 1
| #define HAVE_UNISTD_H 1
| #define HAVE_CSTDLIB 1
| #define HAVE_CSTDIO 1
| #define HAVE_CSTRING 1
| #define HAVE_GL_GLX_H 1
| #define HAVE_X11_XLIB_H 1
| /* end confdefs.h. */
| #include <linux/input.h>
configure:5288: result: no
configure:5323: checking for linux/input.h
configure:5330: result: no
configure:5198: checking for stdint.h
configure:5203: result: yes
configure:5207: checking sys/param.h usability
configure:5219: gcc -c -g -O2 conftest.c >&5
configure:5225: $? = 0
configure:5229: test -z
|| test ! -s conftest.err
configure:5232: $? = 0
configure:5235: test -s conftest.o
configure:5238: $? = 0
configure:5248: result: yes
configure:5252: checking sys/param.h presence
configure:5262: gcc -E conftest.c
configure:5268: $? = 0
configure:5288: result: yes
configure:5323: checking for sys/param.h
configure:5330: result: yes
configure:5198: checking for unistd.h
configure:5203: result: yes
configure:5207: checking values.h usability
configure:5219: gcc -c -g -O2 conftest.c >&5
configure:5225: $? = 0
configure:5229: test -z
|| test ! -s conftest.err
configure:5232: $? = 0
configure:5235: test -s conftest.o
configure:5238: $? = 0
configure:5248: result: yes
configure:5252: checking values.h presence
configure:5262: gcc -E conftest.c
configure:5268: $? = 0
configure:5288: result: yes
configure:5323: checking for values.h
configure:5330: result: yes
configure:5207: checking dsound.h usability
configure:5219: gcc -c -g -O2 conftest.c >&5
conftest.c:71:20: dsound.h: No such file or directory
configure:5225: $? = 1
configure: failed program was:
| /* confdefs.h. */
|
| #define PACKAGE_NAME ""
| #define PACKAGE_TARNAME ""
| #define PACKAGE_VERSION ""
| #define PACKAGE_STRING ""
| #define PACKAGE_BUGREPORT ""
| #define PACKAGE "bzflag"
| #define VERSION "2.0.3.20050526"
| #define BZ_BUILD_OS "solaris2.10"
| #define BZ_BUILD_USER "anonymous"
| #define BUILD_REGEX 1
| #ifdef __cplusplus
| extern "C" void std::exit (int) throw (); using std::exit;
| #endif
| #define HAVE_CURL 1
| #define STDC_HEADERS 1
| #define HAVE_SYS_TYPES_H 1
| #define HAVE_SYS_STAT_H 1
| #define HAVE_STDLIB_H 1
| #define HAVE_STRING_H 1
| #define HAVE_MEMORY_H 1
| #define HAVE_STRINGS_H 1
| #define HAVE_INTTYPES_H 1
| #define HAVE_STDINT_H 1
| #define HAVE_UNISTD_H 1
| #define HAVE_CSTDLIB 1
| #define HAVE_CSTDIO 1
| #define HAVE_CSTRING 1
| #define HAVE_GL_GLX_H 1
| #define HAVE_X11_XLIB_H 1
| #define HAVE_STDINT_H 1
| #define HAVE_SYS_PARAM_H 1
| #define HAVE_UNISTD_H 1
| #define HAVE_VALUES_H 1
| /* end confdefs.h. */
| #include <stdio.h>
| #if HAVE_SYS_TYPES_H
| # include <sys/types.h>
| #endif
| #if HAVE_SYS_STAT_H
| # include <sys/stat.h>
| #endif
| #if STDC_HEADERS
| # include <stdlib.h>
| # include <stddef.h>
| #else
| # if HAVE_STDLIB_H
| # include <stdlib.h>
| # endif
| #endif
| #if HAVE_STRING_H
| # if !STDC_HEADERS && HAVE_MEMORY_H
| # include <memory.h>
| # endif
| # include <string.h>
| #endif
| #if HAVE_STRINGS_H
| # include <strings.h>
| #endif
| #if HAVE_INTTYPES_H
| # include <inttypes.h>
| #else
| # if HAVE_STDINT_H
| # include <stdint.h>
| # endif
| #endif
| #if HAVE_UNISTD_H
| # include <unistd.h>
| #endif
| #include <dsound.h>
configure:5248: result: no
configure:5252: checking dsound.h presence
configure:5262: gcc -E conftest.c
conftest.c:37:20: dsound.h: No such file or directory
configure:5268: $? = 1
configure: failed program was:
| /* confdefs.h. */
|
| #define PACKAGE_NAME ""
| #define PACKAGE_TARNAME ""
| #define PACKAGE_VERSION ""
| #define PACKAGE_STRING ""
| #define PACKAGE_BUGREPORT ""
| #define PACKAGE "bzflag"
| #define VERSION "2.0.3.20050526"
| #define BZ_BUILD_OS "solaris2.10"
| #define BZ_BUILD_USER "anonymous"
| #define BUILD_REGEX 1
| #ifdef __cplusplus
| extern "C" void std::exit (int) throw (); using std::exit;
| #endif
| #define HAVE_CURL 1
| #define STDC_HEADERS 1
| #define HAVE_SYS_TYPES_H 1
| #define HAVE_SYS_STAT_H 1
| #define HAVE_STDLIB_H 1
| #define HAVE_STRING_H 1
| #define HAVE_MEMORY_H 1
| #define HAVE_STRINGS_H 1
| #define HAVE_INTTYPES_H 1
| #define HAVE_STDINT_H 1
| #define HAVE_UNISTD_H 1
| #define HAVE_CSTDLIB 1
| #define HAVE_CSTDIO 1
| #define HAVE_CSTRING 1
| #define HAVE_GL_GLX_H 1
| #define HAVE_X11_XLIB_H 1
| #define HAVE_STDINT_H 1
| #define HAVE_SYS_PARAM_H 1
| #define HAVE_UNISTD_H 1
| #define HAVE_VALUES_H 1
| /* end confdefs.h. */
| #include <dsound.h>
configure:5288: result: no
configure:5323: checking for dsound.h
configure:5330: result: no
configure:5347: checking for an ANSI C-conforming const
configure:5414: gcc -c -g -O2 conftest.c >&5
configure:5420: $? = 0
configure:5424: test -z
|| test ! -s conftest.err
configure:5427: $? = 0
configure:5430: test -s conftest.o
configure:5433: $? = 0
configure:5444: result: yes
configure:5455: checking for socklen_t type
configure:5474: gcc -c -g -O2 conftest.c >&5
configure:5480: $? = 0
configure:5484: test -z
|| test ! -s conftest.err
configure:5487: $? = 0
configure:5490: test -s conftest.o
configure:5493: $? = 0
configure:5516: result: yes
configure:5520: checking for linux rumble joystick support
configure:5538: gcc -c -g -O2 conftest.c >&5
conftest.c:38:25: linux/input.h: No such file or directory
conftest.c: In function `main':
conftest.c:42: error: storage size of 'x' isn't known
configure:5544: $? = 1
configure: failed program was:
| /* confdefs.h. */
|
| #define PACKAGE_NAME ""
| #define PACKAGE_TARNAME ""
| #define PACKAGE_VERSION ""
| #define PACKAGE_STRING ""
| #define PACKAGE_BUGREPORT ""
| #define PACKAGE "bzflag"
| #define VERSION "2.0.3.20050526"
| #define BZ_BUILD_OS "solaris2.10"
| #define BZ_BUILD_USER "anonymous"
| #define BUILD_REGEX 1
| #ifdef __cplusplus
| extern "C" void std::exit (int) throw (); using std::exit;
| #endif
| #define HAVE_CURL 1
| #define STDC_HEADERS 1
| #define HAVE_SYS_TYPES_H 1
| #define HAVE_SYS_STAT_H 1
| #define HAVE_STDLIB_H 1
| #define HAVE_STRING_H 1
| #define HAVE_MEMORY_H 1
| #define HAVE_STRINGS_H 1
| #define HAVE_INTTYPES_H 1
| #define HAVE_STDINT_H 1
| #define HAVE_UNISTD_H 1
| #define HAVE_CSTDLIB 1
| #define HAVE_CSTDIO 1
| #define HAVE_CSTRING 1
| #define HAVE_GL_GLX_H 1
| #define HAVE_X11_XLIB_H 1
| #define HAVE_STDINT_H 1
| #define HAVE_SYS_PARAM_H 1
| #define HAVE_UNISTD_H 1
| #define HAVE_VALUES_H 1
| #define HAVE_SOCKLEN_T 1
| /* end confdefs.h. */
| #include <linux/input.h>
| int
| main ()
| {
| struct ff_effect x; x.u.rumble.weak_magnitude = 42; return 0;
| ;
| return 0;
| }
configure:5574: result: no
configure:5705: checking for X
configure:5810: gcc -E conftest.c
configure:5816: $? = 0
configure:5866: gcc -o conftest -g -O2 conftest.c -lXt >&5
configure:5872: $? = 0
configure:5876: test -z
|| test ! -s conftest.err
configure:5879: $? = 0
configure:5882: test -s conftest
configure:5885: $? = 0
configure:5935: result: libraries , headers
configure:6107: gcc -o conftest -g -O2 conftest.c -lX11 >&5
configure:6113: $? = 0
configure:6117: test -z
|| test ! -s conftest.err
configure:6120: $? = 0
configure:6123: test -s conftest
configure:6126: $? = 0
configure:6284: checking for gethostbyname
configure:6341: gcc -o conftest -g -O2 conftest.c >&5
Undefined first referenced
symbol in file
gethostbyname /var/tmp//ccCYgHp8.o
ld: fatal: Symbol referencing errors. No output written to conftest
collect2: ld returned 1 exit status
configure:6347: $? = 1
configure: failed program was:
| /* confdefs.h. */
|
| #define PACKAGE_NAME ""
| #define PACKAGE_TARNAME ""
| #define PACKAGE_VERSION ""
| #define PACKAGE_STRING ""
| #define PACKAGE_BUGREPORT ""
| #define PACKAGE "bzflag"
| #define VERSION "2.0.3.20050526"
| #define BZ_BUILD_OS "solaris2.10"
| #define BZ_BUILD_USER "anonymous"
| #define BUILD_REGEX 1
| #ifdef __cplusplus
| extern "C" void std::exit (int) throw (); using std::exit;
| #endif
| #define HAVE_CURL 1
| #define STDC_HEADERS 1
| #define HAVE_SYS_TYPES_H 1
| #define HAVE_SYS_STAT_H 1
| #define HAVE_STDLIB_H 1
| #define HAVE_STRING_H 1
| #define HAVE_MEMORY_H 1
| #define HAVE_STRINGS_H 1
| #define HAVE_INTTYPES_H 1
| #define HAVE_STDINT_H 1
| #define HAVE_UNISTD_H 1
| #define HAVE_CSTDLIB 1
| #define HAVE_CSTDIO 1
| #define HAVE_CSTRING 1
| #define HAVE_GL_GLX_H 1
| #define HAVE_X11_XLIB_H 1
| #define HAVE_STDINT_H 1
| #define HAVE_SYS_PARAM_H 1
| #define HAVE_UNISTD_H 1
| #define HAVE_VALUES_H 1
| #define HAVE_SOCKLEN_T 1
| /* end confdefs.h. */
| /* Define gethostbyname to an innocuous variant, in case <limits.h> declares gethostbyname.
| For example, HP-UX 11i <limits.h> declares gettimeofday. */
| #define gethostbyname innocuous_gethostbyname
|
| /* System header to define __stub macros and hopefully few prototypes,
| which can conflict with char gethostbyname (); below.
| Prefer <limits.h> to <assert.h> if __STDC__ is defined, since
| <limits.h> exists even on freestanding compilers. */
|
| #ifdef __STDC__
| # include <limits.h>
| #else
| # include <assert.h>
| #endif
|
| #undef gethostbyname
|
| /* Override any gcc2 internal prototype to avoid an error. */
| #ifdef __cplusplus
| extern "C"
| {
| #endif
| /* We use char because int might match the return type of a gcc2
| builtin and then its argument prototype would still apply. */
| char gethostbyname ();
| /* The GNU C library defines this for functions which it implements
| to always fail with ENOSYS. Some functions are actually named
| something starting with __ and the normal name is an alias. */
| #if defined (__stub_gethostbyname) || defined (__stub___gethostbyname)
| choke me
| #else
| char (*f) () = gethostbyname;
| #endif
| #ifdef __cplusplus
| }
| #endif
|
| int
| main ()
| {
| return f != gethostbyname;
| ;
| return 0;
| }
configure:6372: result: no
configure:6376: checking for gethostbyname in -lnsl
configure:6406: gcc -o conftest -g -O2 conftest.c -lnsl >&5
configure:6412: $? = 0
configure:6416: test -z
|| test ! -s conftest.err
configure:6419: $? = 0
configure:6422: test -s conftest
configure:6425: $? = 0
configure:6438: result: yes
configure:6523: checking for connect
configure:6580: gcc -o conftest -g -O2 conftest.c >&5
Undefined first referenced
symbol in file
connect /var/tmp//cc9lzPHd.o
ld: fatal: Symbol referencing errors. No output written to conftest
collect2: ld returned 1 exit status
configure:6586: $? = 1
configure: failed program was:
| /* confdefs.h. */
|
| #define PACKAGE_NAME ""
| #define PACKAGE_TARNAME ""
| #define PACKAGE_VERSION ""
| #define PACKAGE_STRING ""
| #define PACKAGE_BUGREPORT ""
| #define PACKAGE "bzflag"
| #define VERSION "2.0.3.20050526"
| #define BZ_BUILD_OS "solaris2.10"
| #define BZ_BUILD_USER "anonymous"
| #define BUILD_REGEX 1
| #ifdef __cplusplus
| extern "C" void std::exit (int) throw (); using std::exit;
| #endif
| #define HAVE_CURL 1
| #define STDC_HEADERS 1
| #define HAVE_SYS_TYPES_H 1
| #define HAVE_SYS_STAT_H 1
| #define HAVE_STDLIB_H 1
| #define HAVE_STRING_H 1
| #define HAVE_MEMORY_H 1
| #define HAVE_STRINGS_H 1
| #define HAVE_INTTYPES_H 1
| #define HAVE_STDINT_H 1
| #define HAVE_UNISTD_H 1
| #define HAVE_CSTDLIB 1
| #define HAVE_CSTDIO 1
| #define HAVE_CSTRING 1
| #define HAVE_GL_GLX_H 1
| #define HAVE_X11_XLIB_H 1
| #define HAVE_STDINT_H 1
| #define HAVE_SYS_PARAM_H 1
| #define HAVE_UNISTD_H 1
| #define HAVE_VALUES_H 1
| #define HAVE_SOCKLEN_T 1
| /* end confdefs.h. */
| /* Define connect to an innocuous variant, in case <limits.h> declares connect.
| For example, HP-UX 11i <limits.h> declares gettimeofday. */
| #define connect innocuous_connect
|
| /* System header to define __stub macros and hopefully few prototypes,
| which can conflict with char connect (); below.
| Prefer <limits.h> to <assert.h> if __STDC__ is defined, since
| <limits.h> exists even on freestanding compilers. */
|
| #ifdef __STDC__
| # include <limits.h>
| #else
| # include <assert.h>
| #endif
|
| #undef connect
|
| /* Override any gcc2 internal prototype to avoid an error. */
| #ifdef __cplusplus
| extern "C"
| {
| #endif
| /* We use char because int might match the return type of a gcc2
| builtin and then its argument prototype would still apply. */
| char connect ();
| /* The GNU C library defines this for functions which it implements
| to always fail with ENOSYS. Some functions are actually named
| something starting with __ and the normal name is an alias. */
| #if defined (__stub_connect) || defined (__stub___connect)
| choke me
| #else
| char (*f) () = connect;
| #endif
| #ifdef __cplusplus
| }
| #endif
|
| int
| main ()
| {
| return f != connect;
| ;
| return 0;
| }
configure:6611: result: no
configure:6615: checking for connect in -lsocket
configure:6645: gcc -o conftest -g -O2 conftest.c -lsocket -lnsl >&5
configure:6651: $? = 0
configure:6655: test -z
|| test ! -s conftest.err
configure:6658: $? = 0
configure:6661: test -s conftest
configure:6664: $? = 0
configure:6677: result: yes
configure:6686: checking for remove
configure:6743: gcc -o conftest -g -O2 conftest.c >&5
configure:6749: $? = 0
configure:6753: test -z
|| test ! -s conftest.err
configure:6756: $? = 0
configure:6759: test -s conftest
configure:6762: $? = 0
configure:6774: result: yes
configure:6849: checking for shmat
configure:6906: gcc -o conftest -g -O2 conftest.c >&5
configure:6912: $? = 0
configure:6916: test -z
|| test ! -s conftest.err
configure:6919: $? = 0
configure:6922: test -s conftest
configure:6925: $? = 0
configure:6937: result: yes
configure:7021: checking for IceConnectionNumber in -lICE
configure:7051: gcc -o conftest -g -O2 conftest.c -lICE -lsocket -lnsl >&5
configure:7057: $? = 0
configure:7061: test -z
|| test ! -s conftest.err
configure:7064: $? = 0
configure:7067: test -s conftest
configure:7070: $? = 0
configure:7083: result: yes
configure:7119: checking for sqrtf in -lm
configure:7149: gcc -o conftest -g -O2 -L/usr/demo/SOUND/lib conftest.c -lm -lsocket -lnsl -lresolv >&5
conftest.c:45: warning: conflicting types for built-in function 'sqrtf'
configure:7155: $? = 0
configure:7159: test -z
|| test ! -s conftest.err
configure:7162: $? = 0
configure:7165: test -s conftest
configure:7168: $? = 0
configure:7181: result: yes
configure:7195: checking for socket in -lsocket
configure:7225: gcc -o conftest -g -O2 -L/usr/demo/SOUND/lib conftest.c -lsocket -lm -lsocket -lnsl -lresolv >&5
configure:7231: $? = 0
configure:7235: test -z
|| test ! -s conftest.err
configure:7238: $? = 0
configure:7241: test -s conftest
configure:7244: $? = 0
configure:7257: result: yes
configure:7269: checking for gethostent in -lbind
configure:7299: gcc -o conftest -g -O2 -L/usr/demo/SOUND/lib conftest.c -lbind -lsocket -lm -lsocket -lnsl -lresolv >&5
ld: fatal: library -lbind: not found
ld: fatal: File processing errors. No output written to conftest
collect2: ld returned 1 exit status
configure:7305: $? = 1
configure: failed program was:
| /* confdefs.h. */
|
| #define PACKAGE_NAME ""
| #define PACKAGE_TARNAME ""
| #define PACKAGE_VERSION ""
| #define PACKAGE_STRING ""
| #define PACKAGE_BUGREPORT ""
| #define PACKAGE "bzflag"
| #define VERSION "2.0.3.20050526"
| #define BZ_BUILD_OS "solaris2.10"
| #define BZ_BUILD_USER "anonymous"
| #define BUILD_REGEX 1
| #ifdef __cplusplus
| extern "C" void std::exit (int) throw (); using std::exit;
| #endif
| #define HAVE_CURL 1
| #define STDC_HEADERS 1
| #define HAVE_SYS_TYPES_H 1
| #define HAVE_SYS_STAT_H 1
| #define HAVE_STDLIB_H 1
| #define HAVE_STRING_H 1
| #define HAVE_MEMORY_H 1
| #define HAVE_STRINGS_H 1
| #define HAVE_INTTYPES_H 1
| #define HAVE_STDINT_H 1
| #define HAVE_UNISTD_H 1
| #define HAVE_CSTDLIB 1
| #define HAVE_CSTDIO 1
| #define HAVE_CSTRING 1
| #define HAVE_GL_GLX_H 1
| #define HAVE_X11_XLIB_H 1
| #define HAVE_STDINT_H 1
| #define HAVE_SYS_PARAM_H 1
| #define HAVE_UNISTD_H 1
| #define HAVE_VALUES_H 1
| #define HAVE_SOCKLEN_T 1
| #define HAVE_LIBM 1
| #define HAVE_LIBSOCKET 1
| /* end confdefs.h. */
|
| /* Override any gcc2 internal prototype to avoid an error. */
| #ifdef __cplusplus
| extern "C"
| #endif
| /* We use char because int might match the return type of a gcc2
| builtin and then its argument prototype would still apply. */
| char gethostent ();
| int
| main ()
| {
| gethostent ();
| ;
| return 0;
| }
configure:7331: result: no
configure:7344: checking for acosf in -lm
configure:7374: gcc -o conftest -g -O2 -L/usr/demo/SOUND/lib conftest.c -lm -lsocket -lm -lsocket -lnsl -lresolv >&5
conftest.c:47: warning: conflicting types for built-in function 'acosf'
configure:7380: $? = 0
configure:7384: test -z
|| test ! -s conftest.err
configure:7387: $? = 0
configure:7390: test -s conftest
configure:7393: $? = 0
configure:7406: result: yes
configure:7416: checking for asinf in -lm
configure:7446: gcc -o conftest -g -O2 -L/usr/demo/SOUND/lib conftest.c -lm -lsocket -lm -lsocket -lnsl -lresolv >&5
conftest.c:48: warning: conflicting types for built-in function 'asinf'
configure:7452: $? = 0
configure:7456: test -z
|| test ! -s conftest.err
configure:7459: $? = 0
configure:7462: test -s conftest
configure:7465: $? = 0
configure:7478: result: yes
configure:7488: checking for atan2f in -lm
configure:7518: gcc -o conftest -g -O2 -L/usr/demo/SOUND/lib conftest.c -lm -lsocket -lm -lsocket -lnsl -lresolv >&5
conftest.c:49: warning: conflicting types for built-in function 'atan2f'
configure:7524: $? = 0
configure:7528: test -z
|| test ! -s conftest.err
configure:7531: $? = 0
configure:7534: test -s conftest
configure:7537: $? = 0
configure:7550: result: yes
configure:7560: checking for atanf in -lm
configure:7590: gcc -o conftest -g -O2 -L/usr/demo/SOUND/lib conftest.c -lm -lsocket -lm -lsocket -lnsl -lresolv >&5
conftest.c:50: warning: conflicting types for built-in function 'atanf'
configure:7596: $? = 0
configure:7600: test -z
|| test ! -s conftest.err
configure:7603: $? = 0
configure:7606: test -s conftest
configure:7609: $? = 0
configure:7622: result: yes
configure:7632: checking for cosf in -lm
configure:7662: gcc -o conftest -g -O2 -L/usr/demo/SOUND/lib conftest.c -lm -lsocket -lm -lsocket -lnsl -lresolv >&5
conftest.c:51: warning: conflicting types for built-in function 'cosf'
configure:7668: $? = 0
configure:7672: test -z
|| test ! -s conftest.err
configure:7675: $? = 0
configure:7678: test -s conftest
configure:7681: $? = 0
configure:7694: result: yes
configure:7704: checking for expf in -lm
configure:7734: gcc -o conftest -g -O2 -L/usr/demo/SOUND/lib conftest.c -lm -lsocket -lm -lsocket -lnsl -lresolv >&5
conftest.c:52: warning: conflicting types for built-in function 'expf'
configure:7740: $? = 0
configure:7744: test -z
|| test ! -s conftest.err
configure:7747: $? = 0
configure:7750: test -s conftest
configure:7753: $? = 0
configure:7766: result: yes
configure:7776: checking for fabsf in -lm
configure:7806: gcc -o conftest -g -O2 -L/usr/demo/SOUND/lib conftest.c -lm -lsocket -lm -lsocket -lnsl -lresolv >&5
conftest.c:53: warning: conflicting types for built-in function 'fabsf'
configure:7812: $? = 0
configure:7816: test -z
|| test ! -s conftest.err
configure:7819: $? = 0
configure:7822: test -s conftest
configure:7825: $? = 0
configure:7838: result: yes
configure:7848: checking for floorf in -lm
configure:7878: gcc -o conftest -g -O2 -L/usr/demo/SOUND/lib conftest.c -lm -lsocket -lm -lsocket -lnsl -lresolv >&5
conftest.c:54: warning: conflicting types for built-in function 'floorf'
configure:7884: $? = 0
configure:7888: test -z
|| test ! -s conftest.err
configure:7891: $? = 0
configure:7894: test -s conftest
configure:7897: $? = 0
configure:7910: result: yes
configure:7920: checking for fmodf in -lm
configure:7950: gcc -o conftest -g -O2 -L/usr/demo/SOUND/lib conftest.c -lm -lsocket -lm -lsocket -lnsl -lresolv >&5
conftest.c:55: warning: conflicting types for built-in function 'fmodf'
configure:7956: $? = 0
configure:7960: test -z
|| test ! -s conftest.err
configure:7963: $? = 0
configure:7966: test -s conftest
configure:7969: $? = 0
configure:7982: result: yes
configure:7992: checking for hypotf in -lm
configure:8022: gcc -o conftest -g -O2 -L/usr/demo/SOUND/lib conftest.c -lm -lsocket -lm -lsocket -lnsl -lresolv >&5
conftest.c:56: warning: conflicting types for built-in function 'hypotf'
configure:8028: $? = 0
configure:8032: test -z
|| test ! -s conftest.err
configure:8035: $? = 0
configure:8038: test -s conftest
configure:8041: $? = 0
configure:8054: result: yes
configure:8064: checking for logf in -lm
configure:8094: gcc -o conftest -g -O2 -L/usr/demo/SOUND/lib conftest.c -lm -lsocket -lm -lsocket -lnsl -lresolv >&5
conftest.c:57: warning: conflicting types for built-in function 'logf'
configure:8100: $? = 0
configure:8104: test -z
|| test ! -s conftest.err
configure:8107: $? = 0
configure:8110: test -s conftest
configure:8113: $? = 0
configure:8126: result: yes
configure:8136: checking for powf in -lm
configure:8166: gcc -o conftest -g -O2 -L/usr/demo/SOUND/lib conftest.c -lm -lsocket -lm -lsocket -lnsl -lresolv >&5
conftest.c:58: warning: conflicting types for built-in function 'powf'
configure:8172: $? = 0
configure:8176: test -z
|| test ! -s conftest.err
configure:8179: $? = 0
configure:8182: test -s conftest
configure:8185: $? = 0
configure:8198: result: yes
configure:8208: checking for sinf in -lm
configure:8238: gcc -o conftest -g -O2 -L/usr/demo/SOUND/lib conftest.c -lm -lsocket -lm -lsocket -lnsl -lresolv >&5
conftest.c:59: warning: conflicting types for built-in function 'sinf'
configure:8244: $? = 0
configure:8248: test -z
|| test ! -s conftest.err
configure:8251: $? = 0
configure:8254: test -s conftest
configure:8257: $? = 0
configure:8270: result: yes
configure:8280: checking for sqrtf in -lm
configure:8342: result: yes
configure:8352: checking for tanf in -lm
configure:8382: gcc -o conftest -g -O2 -L/usr/demo/SOUND/lib conftest.c -lm -lsocket -lm -lsocket -lnsl -lresolv >&5
conftest.c:61: warning: conflicting types for built-in function 'tanf'
configure:8388: $? = 0
configure:8392: test -z
|| test ! -s conftest.err
configure:8395: $? = 0
configure:8398: test -s conftest
configure:8401: $? = 0
configure:8414: result: yes
configure:8437: checking for XextAddDisplay in -lXext
configure:8467: gcc -o conftest -g -O2 -L/usr/demo/SOUND/lib conftest.c -lXext -lSM -lICE -lX11 -lresolv -laudio -lsocket -lm -lsocket -lnsl -lresolv >&5
ld: fatal: library -laudio: not found
ld: fatal: File processing errors. No output written to conftest
collect2: ld returned 1 exit status
configure:8473: $? = 1
configure: failed program was:
| /* confdefs.h. */
|
| #define PACKAGE_NAME ""
| #define PACKAGE_TARNAME ""
| #define PACKAGE_VERSION ""
| #define PACKAGE_STRING ""
| #define PACKAGE_BUGREPORT ""
| #define PACKAGE "bzflag"
| #define VERSION "2.0.3.20050526"
| #define BZ_BUILD_OS "solaris2.10"
| #define BZ_BUILD_USER "anonymous"
| #define BUILD_REGEX 1
| #ifdef __cplusplus
| extern "C" void std::exit (int) throw (); using std::exit;
| #endif
| #define HAVE_CURL 1
| #define STDC_HEADERS 1
| #define HAVE_SYS_TYPES_H 1
| #define HAVE_SYS_STAT_H 1
| #define HAVE_STDLIB_H 1
| #define HAVE_STRING_H 1
| #define HAVE_MEMORY_H 1
| #define HAVE_STRINGS_H 1
| #define HAVE_INTTYPES_H 1
| #define HAVE_STDINT_H 1
| #define HAVE_UNISTD_H 1
| #define HAVE_CSTDLIB 1
| #define HAVE_CSTDIO 1
| #define HAVE_CSTRING 1
| #define HAVE_GL_GLX_H 1
| #define HAVE_X11_XLIB_H 1
| #define HAVE_STDINT_H 1
| #define HAVE_SYS_PARAM_H 1
| #define HAVE_UNISTD_H 1
| #define HAVE_VALUES_H 1
| #define HAVE_SOCKLEN_T 1
| #define HAVE_LIBM 1
| #define HAVE_LIBSOCKET 1
| #define HAVE_ACOSF 1
| #define HAVE_ASINF 1
| #define HAVE_ATAN2F 1
| #define HAVE_ATANF 1
| #define HAVE_COSF 1
| #define HAVE_EXPF 1
| #define HAVE_FABSF 1
| #define HAVE_FLOORF 1
| #define HAVE_FMODF 1
| #define HAVE_HYPOTF 1
| #define HAVE_LOGF 1
| #define HAVE_POWF 1
| #define HAVE_SINF 1
| #define HAVE_SQRTF 1
| #define HAVE_TANF 1
| /* end confdefs.h. */
|
| /* Override any gcc2 internal prototype to avoid an error. */
| #ifdef __cplusplus
| extern "C"
| #endif
| /* We use char because int might match the return type of a gcc2
| builtin and then its argument prototype would still apply. */
| char XextAddDisplay ();
| int
| main ()
| {
| XextAddDisplay ();
| ;
| return 0;
| }
configure:8499: result: no
configure:8676: g++ -o conftest -g -O2 -L/usr/demo/SOUND/lib conftest.cc -lsocket -lm -lsocket -lnsl -lresolv >&5
configure:8682: $? = 0
configure:8686: test -z
|| test ! -s conftest.err
configure:8689: $? = 0
configure:8692: test -s conftest
configure:8695: $? = 0
configure:8731: g++ -c -g -O2 conftest.cc >&5
configure:8737: $? = 0
configure:8741: test -z
|| test ! -s conftest.err
configure:8744: $? = 0
configure:8747: test -s conftest.o
configure:8750: $? = 0
configure:8785: g++ -o conftest -g -O2 -L/usr/demo/SOUND/lib conftest.cc -framework OpenGL -lSM -lICE -lX11 -lresolv -laudio -lsocket -lm -lsocket -lnsl -lresolv >&5
g++: OpenGL: No such file or directory
cc1plus: error: unrecognized command line option "-framework"
configure:8791: $? = 1
configure: failed program was:
| /* confdefs.h. */
|
| #define PACKAGE_NAME ""
| #define PACKAGE_TARNAME ""
| #define PACKAGE_VERSION ""
| #define PACKAGE_STRING ""
| #define PACKAGE_BUGREPORT ""
| #define PACKAGE "bzflag"
| #define VERSION "2.0.3.20050526"
| #define BZ_BUILD_OS "solaris2.10"
| #define BZ_BUILD_USER "anonymous"
| #define BUILD_REGEX 1
| #ifdef __cplusplus
| extern "C" void std::exit (int) throw (); using std::exit;
| #endif
| #define HAVE_CURL 1
| #define STDC_HEADERS 1
| #define HAVE_SYS_TYPES_H 1
| #define HAVE_SYS_STAT_H 1
| #define HAVE_STDLIB_H 1
| #define HAVE_STRING_H 1
| #define HAVE_MEMORY_H 1
| #define HAVE_STRINGS_H 1
| #define HAVE_INTTYPES_H 1
| #define HAVE_STDINT_H 1
| #define HAVE_UNISTD_H 1
| #define HAVE_CSTDLIB 1
| #define HAVE_CSTDIO 1
| #define HAVE_CSTRING 1
| #define HAVE_GL_GLX_H 1
| #define HAVE_X11_XLIB_H 1
| #define HAVE_STDINT_H 1
| #define HAVE_SYS_PARAM_H 1
| #define HAVE_UNISTD_H 1
| #define HAVE_VALUES_H 1
| #define HAVE_SOCKLEN_T 1
| #define HAVE_LIBM 1
| #define HAVE_LIBSOCKET 1
| #define HAVE_ACOSF 1
| #define HAVE_ASINF 1
| #define HAVE_ATAN2F 1
| #define HAVE_ATANF 1
| #define HAVE_COSF 1
| #define HAVE_EXPF 1
| #define HAVE_FABSF 1
| #define HAVE_FLOORF 1
| #define HAVE_FMODF 1
| #define HAVE_HYPOTF 1
| #define HAVE_LOGF 1
| #define HAVE_POWF 1
| #define HAVE_SINF 1
| #define HAVE_SQRTF 1
| #define HAVE_TANF 1
| #define HAVE_REGEX_H 1
| #define HAVE_STD_COUNT 1
| /* end confdefs.h. */
| #include <OpenGL/gl.h>
| int
| main ()
| {
| glBegin(GL_POINTS)
| ;
| return 0;
| }
configure:8832: g++ -o conftest -g -O2 -L/usr/demo/SOUND/lib conftest.cc -lopengl32 -lSM -lICE -lX11 -lresolv -laudio -lsocket -lm -lsocket -lnsl -lresolv >&5
ld: fatal: library -lopengl32: not found
ld: fatal: library -laudio: not found
ld: fatal: File processing errors. No output written to conftest
collect2: ld returned 1 exit status
configure:8838: $? = 1
configure: failed program was:
| /* confdefs.h. */
|
| #define PACKAGE_NAME ""
| #define PACKAGE_TARNAME ""
| #define PACKAGE_VERSION ""
| #define PACKAGE_STRING ""
| #define PACKAGE_BUGREPORT ""
| #define PACKAGE "bzflag"
| #define VERSION "2.0.3.20050526"
| #define BZ_BUILD_OS "solaris2.10"
| #define BZ_BUILD_USER "anonymous"
| #define BUILD_REGEX 1
| #ifdef __cplusplus
| extern "C" void std::exit (int) throw (); using std::exit;
| #endif
| #define HAVE_CURL 1
| #define STDC_HEADERS 1
| #define HAVE_SYS_TYPES_H 1
| #define HAVE_SYS_STAT_H 1
| #define HAVE_STDLIB_H 1
| #define HAVE_STRING_H 1
| #define HAVE_MEMORY_H 1
| #define HAVE_STRINGS_H 1
| #define HAVE_INTTYPES_H 1
| #define HAVE_STDINT_H 1
| #define HAVE_UNISTD_H 1
| #define HAVE_CSTDLIB 1
| #define HAVE_CSTDIO 1
| #define HAVE_CSTRING 1
| #define HAVE_GL_GLX_H 1
| #define HAVE_X11_XLIB_H 1
| #define HAVE_STDINT_H 1
| #define HAVE_SYS_PARAM_H 1
| #define HAVE_UNISTD_H 1
| #define HAVE_VALUES_H 1
| #define HAVE_SOCKLEN_T 1
| #define HAVE_LIBM 1
| #define HAVE_LIBSOCKET 1
| #define HAVE_ACOSF 1
| #define HAVE_ASINF 1
| #define HAVE_ATAN2F 1
| #define HAVE_ATANF 1
| #define HAVE_COSF 1
| #define HAVE_EXPF 1
| #define HAVE_FABSF 1
| #define HAVE_FLOORF 1
| #define HAVE_FMODF 1
| #define HAVE_HYPOTF 1
| #define HAVE_LOGF 1
| #define HAVE_POWF 1
| #define HAVE_SINF 1
| #define HAVE_SQRTF 1
| #define HAVE_TANF 1
| #define HAVE_REGEX_H 1
| #define HAVE_STD_COUNT 1
| /* end confdefs.h. */
| #include <GL/gl.h>
| int
| main ()
| {
| glBegin(GL_POINTS)
| ;
| return 0;
| }
configure:8832: g++ -o conftest -g -O2 -L/usr/demo/SOUND/lib conftest.cc -lGL -lSM -lICE -lX11 -lresolv -laudio -lsocket -lm -lsocket -lnsl -lresolv >&5
ld: fatal: library -laudio: not found
ld: fatal: File processing errors. No output written to conftest
collect2: ld returned 1 exit status
configure:8838: $? = 1
configure: failed program was:
| /* confdefs.h. */
|
| #define PACKAGE_NAME ""
| #define PACKAGE_TARNAME ""
| #define PACKAGE_VERSION ""
| #define PACKAGE_STRING ""
| #define PACKAGE_BUGREPORT ""
| #define PACKAGE "bzflag"
| #define VERSION "2.0.3.20050526"
| #define BZ_BUILD_OS "solaris2.10"
| #define BZ_BUILD_USER "anonymous"
| #define BUILD_REGEX 1
| #ifdef __cplusplus
| extern "C" void std::exit (int) throw (); using std::exit;
| #endif
| #define HAVE_CURL 1
| #define STDC_HEADERS 1
| #define HAVE_SYS_TYPES_H 1
| #define HAVE_SYS_STAT_H 1
| #define HAVE_STDLIB_H 1
| #define HAVE_STRING_H 1
| #define HAVE_MEMORY_H 1
| #define HAVE_STRINGS_H 1
| #define HAVE_INTTYPES_H 1
| #define HAVE_STDINT_H 1
| #define HAVE_UNISTD_H 1
| #define HAVE_CSTDLIB 1
| #define HAVE_CSTDIO 1
| #define HAVE_CSTRING 1
| #define HAVE_GL_GLX_H 1
| #define HAVE_X11_XLIB_H 1
| #define HAVE_STDINT_H 1
| #define HAVE_SYS_PARAM_H 1
| #define HAVE_UNISTD_H 1
| #define HAVE_VALUES_H 1
| #define HAVE_SOCKLEN_T 1
| #define HAVE_LIBM 1
| #define HAVE_LIBSOCKET 1
| #define HAVE_ACOSF 1
| #define HAVE_ASINF 1
| #define HAVE_ATAN2F 1
| #define HAVE_ATANF 1
| #define HAVE_COSF 1
| #define HAVE_EXPF 1
| #define HAVE_FABSF 1
| #define HAVE_FLOORF 1
| #define HAVE_FMODF 1
| #define HAVE_HYPOTF 1
| #define HAVE_LOGF 1
| #define HAVE_POWF 1
| #define HAVE_SINF 1
| #define HAVE_SQRTF 1
| #define HAVE_TANF 1
| #define HAVE_REGEX_H 1
| #define HAVE_STD_COUNT 1
| /* end confdefs.h. */
| #include <GL/gl.h>
| int
| main ()
| {
| glBegin(GL_POINTS)
| ;
| return 0;
| }
configure:8832: g++ -o conftest -g -O2 -L/usr/demo/SOUND/lib conftest.cc -lGL2 -lSM -lICE -lX11 -lresolv -laudio -lsocket -lm -lsocket -lnsl -lresolv >&5
ld: fatal: library -lGL2: not found
ld: fatal: library -laudio: not found
ld: fatal: File processing errors. No output written to conftest
collect2: ld returned 1 exit status
configure:8838: $? = 1
configure: failed program was:
| /* confdefs.h. */
|
| #define PACKAGE_NAME ""
| #define PACKAGE_TARNAME ""
| #define PACKAGE_VERSION ""
| #define PACKAGE_STRING ""
| #define PACKAGE_BUGREPORT ""
| #define PACKAGE "bzflag"
| #define VERSION "2.0.3.20050526"
| #define BZ_BUILD_OS "solaris2.10"
| #define BZ_BUILD_USER "anonymous"
| #define BUILD_REGEX 1
| #ifdef __cplusplus
| extern "C" void std::exit (int) throw (); using std::exit;
| #endif
| #define HAVE_CURL 1
| #define STDC_HEADERS 1
| #define HAVE_SYS_TYPES_H 1
| #define HAVE_SYS_STAT_H 1
| #define HAVE_STDLIB_H 1
| #define HAVE_STRING_H 1
| #define HAVE_MEMORY_H 1
| #define HAVE_STRINGS_H 1
| #define HAVE_INTTYPES_H 1
| #define HAVE_STDINT_H 1
| #define HAVE_UNISTD_H 1
| #define HAVE_CSTDLIB 1
| #define HAVE_CSTDIO 1
| #define HAVE_CSTRING 1
| #define HAVE_GL_GLX_H 1
| #define HAVE_X11_XLIB_H 1
| #define HAVE_STDINT_H 1
| #define HAVE_SYS_PARAM_H 1
| #define HAVE_UNISTD_H 1
| #define HAVE_VALUES_H 1
| #define HAVE_SOCKLEN_T 1
| #define HAVE_LIBM 1
| #define HAVE_LIBSOCKET 1
| #define HAVE_ACOSF 1
| #define HAVE_ASINF 1
| #define HAVE_ATAN2F 1
| #define HAVE_ATANF 1
| #define HAVE_COSF 1
| #define HAVE_EXPF 1
| #define HAVE_FABSF 1
| #define HAVE_FLOORF 1
| #define HAVE_FMODF 1
| #define HAVE_HYPOTF 1
| #define HAVE_LOGF 1
| #define HAVE_POWF 1
| #define HAVE_SINF 1
| #define HAVE_SQRTF 1
| #define HAVE_TANF 1
| #define HAVE_REGEX_H 1
| #define HAVE_STD_COUNT 1
| /* end confdefs.h. */
| #include <GL/gl.h>
| int
| main ()
| {
| glBegin(GL_POINTS)
| ;
| return 0;
| }
configure:9102: checking for ares_init in -lcares
configure:9132: g++ -o conftest -g -O2 -L/usr/demo/SOUND/lib conftest.cc -lcares -lsocket -lm -lsocket -lnsl -lresolv >&5
ld: fatal: library -lcares: not found
ld: fatal: File processing errors. No output written to conftest
collect2: ld returned 1 exit status
configure:9138: $? = 1
configure: failed program was:
| /* confdefs.h. */
|
| #define PACKAGE_NAME ""
| #define PACKAGE_TARNAME ""
| #define PACKAGE_VERSION ""
| #define PACKAGE_STRING ""
| #define PACKAGE_BUGREPORT ""
| #define PACKAGE "bzflag"
| #define VERSION "2.0.3.20050526"
| #define BZ_BUILD_OS "solaris2.10"
| #define BZ_BUILD_USER "anonymous"
| #define BUILD_REGEX 1
| #ifdef __cplusplus
| extern "C" void std::exit (int) throw (); using std::exit;
| #endif
| #define HAVE_CURL 1
| #define STDC_HEADERS 1
| #define HAVE_SYS_TYPES_H 1
| #define HAVE_SYS_STAT_H 1
| #define HAVE_STDLIB_H 1
| #define HAVE_STRING_H 1
| #define HAVE_MEMORY_H 1
| #define HAVE_STRINGS_H 1
| #define HAVE_INTTYPES_H 1
| #define HAVE_STDINT_H 1
| #define HAVE_UNISTD_H 1
| #define HAVE_CSTDLIB 1
| #define HAVE_CSTDIO 1
| #define HAVE_CSTRING 1
| #define HAVE_GL_GLX_H 1
| #define HAVE_X11_XLIB_H 1
| #define HAVE_STDINT_H 1
| #define HAVE_SYS_PARAM_H 1
| #define HAVE_UNISTD_H 1
| #define HAVE_VALUES_H 1
| #define HAVE_SOCKLEN_T 1
| #define HAVE_LIBM 1
| #define HAVE_LIBSOCKET 1
| #define HAVE_ACOSF 1
| #define HAVE_ASINF 1
| #define HAVE_ATAN2F 1
| #define HAVE_ATANF 1
| #define HAVE_COSF 1
| #define HAVE_EXPF 1
| #define HAVE_FABSF 1
| #define HAVE_FLOORF 1
| #define HAVE_FMODF 1
| #define HAVE_HYPOTF 1
| #define HAVE_LOGF 1
| #define HAVE_POWF 1
| #define HAVE_SINF 1
| #define HAVE_SQRTF 1
| #define HAVE_TANF 1
| #define HAVE_REGEX_H 1
| #define HAVE_STD_COUNT 1
| #define _USE_BZ_API 1
| /* end confdefs.h. */
|
| /* Override any gcc2 internal prototype to avoid an error. */
| #ifdef __cplusplus
| extern "C"
| #endif
| /* We use char because int might match the return type of a gcc2
| builtin and then its argument prototype would still apply. */
| char ares_init ();
| int
| main ()
| {
| ares_init ();
| ;
| return 0;
| }
configure:9164: result: no
configure:9183: WARNING: using an internal c-ares lib.
configure:9185: WARNING: Consider installing an updated library at system level
configure:9187: WARNING: link is http://daniel.haxx.se/projects/c-ares/
configure:9215: checking for working ncurses
configure:9237: g++ -o conftest -g -O2 -L/usr/demo/SOUND/lib conftest.cc -lsocket -lm -lsocket -lnsl -lresolv -lncurses >&5
conftest.cc:58:21: ncurses.h: No such file or directory
conftest.cc: In function `int main()':
conftest.cc:62: error: `chtype' undeclared (first use this function)
conftest.cc:62: error: (Each undeclared identifier is reported only once for each function it appears in.)
conftest.cc:62: error: expected `;' before "a"
conftest.cc:62: error: `A_STANDOUT' undeclared (first use this function)
conftest.cc:62: error: `KEY_LEFT' undeclared (first use this function)
conftest.cc:62: error: `initscr' undeclared (first use this function)
configure:9243: $? = 1
configure: failed program was:
| /* confdefs.h. */
|
| #define PACKAGE_NAME ""
| #define PACKAGE_TARNAME ""
| #define PACKAGE_VERSION ""
| #define PACKAGE_STRING ""
| #define PACKAGE_BUGREPORT ""
| #define PACKAGE "bzflag"
| #define VERSION "2.0.3.20050526"
| #define BZ_BUILD_OS "solaris2.10"
| #define BZ_BUILD_USER "anonymous"
| #define BUILD_REGEX 1
| #ifdef __cplusplus
| extern "C" void std::exit (int) throw (); using std::exit;
| #endif
| #define HAVE_CURL 1
| #define STDC_HEADERS 1
| #define HAVE_SYS_TYPES_H 1
| #define HAVE_SYS_STAT_H 1
| #define HAVE_STDLIB_H 1
| #define HAVE_STRING_H 1
| #define HAVE_MEMORY_H 1
| #define HAVE_STRINGS_H 1
| #define HAVE_INTTYPES_H 1
| #define HAVE_STDINT_H 1
| #define HAVE_UNISTD_H 1
| #define HAVE_CSTDLIB 1
| #define HAVE_CSTDIO 1
| #define HAVE_CSTRING 1
| #define HAVE_GL_GLX_H 1
| #define HAVE_X11_XLIB_H 1
| #define HAVE_STDINT_H 1
| #define HAVE_SYS_PARAM_H 1
| #define HAVE_UNISTD_H 1
| #define HAVE_VALUES_H 1
| #define HAVE_SOCKLEN_T 1
| #define HAVE_LIBM 1
| #define HAVE_LIBSOCKET 1
| #define HAVE_ACOSF 1
| #define HAVE_ASINF 1
| #define HAVE_ATAN2F 1
| #define HAVE_ATANF 1
| #define HAVE_COSF 1
| #define HAVE_EXPF 1
| #define HAVE_FABSF 1
| #define HAVE_FLOORF 1
| #define HAVE_FMODF 1
| #define HAVE_HYPOTF 1
| #define HAVE_LOGF 1
| #define HAVE_POWF 1
| #define HAVE_SINF 1
| #define HAVE_SQRTF 1
| #define HAVE_TANF 1
| #define HAVE_REGEX_H 1
| #define HAVE_STD_COUNT 1
| #define _USE_BZ_API 1
| /* end confdefs.h. */
| #include <ncurses.h>
| int
| main ()
| {
| chtype a; int b=A_STANDOUT, c=KEY_LEFT; initscr();
| ;
| return 0;
| }
configure:9268: result: no
configure:9282: checking for working curses
configure:9304: g++ -o conftest -g -O2 -L/usr/demo/SOUND/lib conftest.cc -lsocket -lm -lsocket -lnsl -lresolv -lcurses >&5
configure:9310: $? = 0
configure:9314: test -z
|| test ! -s conftest.err
configure:9317: $? = 0
configure:9320: test -s conftest
configure:9323: $? = 0
configure:9335: result: yes
configure:9546: checking for SDL framework
configure:9567: gcc -o conftest -g -O2 -L/usr/demo/SOUND/lib -framework SDL conftest.c -lSM -lICE -lX11 -lresolv -laudio -lsocket -lm -lsocket -lnsl -lresolv >&5
gcc: SDL: No such file or directory
cc1: error: unrecognized command line option "-framework"
configure:9573: $? = 1
configure: failed program was:
| /* confdefs.h. */
|
| #define PACKAGE_NAME ""
| #define PACKAGE_TARNAME ""
| #define PACKAGE_VERSION ""
| #define PACKAGE_STRING ""
| #define PACKAGE_BUGREPORT ""
| #define PACKAGE "bzflag"
| #define VERSION "2.0.3.20050526"
| #define BZ_BUILD_OS "solaris2.10"
| #define BZ_BUILD_USER "anonymous"
| #define BUILD_REGEX 1
| #ifdef __cplusplus
| extern "C" void std::exit (int) throw (); using std::exit;
| #endif
| #define HAVE_CURL 1
| #define STDC_HEADERS 1
| #define HAVE_SYS_TYPES_H 1
| #define HAVE_SYS_STAT_H 1
| #define HAVE_STDLIB_H 1
| #define HAVE_STRING_H 1
| #define HAVE_MEMORY_H 1
| #define HAVE_STRINGS_H 1
| #define HAVE_INTTYPES_H 1
| #define HAVE_STDINT_H 1
| #define HAVE_UNISTD_H 1
| #define HAVE_CSTDLIB 1
| #define HAVE_CSTDIO 1
| #define HAVE_CSTRING 1
| #define HAVE_GL_GLX_H 1
| #define HAVE_X11_XLIB_H 1
| #define HAVE_STDINT_H 1
| #define HAVE_SYS_PARAM_H 1
| #define HAVE_UNISTD_H 1
| #define HAVE_VALUES_H 1
| #define HAVE_SOCKLEN_T 1
| #define HAVE_LIBM 1
| #define HAVE_LIBSOCKET 1
| #define HAVE_ACOSF 1
| #define HAVE_ASINF 1
| #define HAVE_ATAN2F 1
| #define HAVE_ATANF 1
| #define HAVE_COSF 1
| #define HAVE_EXPF 1
| #define HAVE_FABSF 1
| #define HAVE_FLOORF 1
| #define HAVE_FMODF 1
| #define HAVE_HYPOTF 1
| #define HAVE_LOGF 1
| #define HAVE_POWF 1
| #define HAVE_SINF 1
| #define HAVE_SQRTF 1
| #define HAVE_TANF 1
| #define HAVE_REGEX_H 1
| #define HAVE_STD_COUNT 1
| #define _USE_BZ_API 1
| #define HAVE_CURSES_H
| /* end confdefs.h. */
| #include <SDL/SDL_version.h>
| int
| main ()
| {
|
| ;
| return 0;
| }
configure:9597: result: no
configure:9646: checking for sdl-config
configure:9677: result: /usr/local/bin/sdl-config
configure:9685: checking for SDL - version >= 1.2.5
configure:9777: gcc -o conftest -g -O2 -I/usr/local/include/SDL -D_REENTRANT -L/usr/demo/SOUND/lib conftest.c -lSM -lICE -lX11 -lresolv -laudio -lsocket -lm -lsocket -lnsl -lresolv -L/usr/local/lib -R/usr/local/lib -lSDL -lpthread -lposix4 >&5
ld: fatal: library -laudio: not found
ld: fatal: File processing errors. No output written to conftest
collect2: ld returned 1 exit status
configure:9780: $? = 1
configure: program exited with status 1
configure: failed program was:
| /* confdefs.h. */
|
| #define PACKAGE_NAME ""
| #define PACKAGE_TARNAME ""
| #define PACKAGE_VERSION ""
| #define PACKAGE_STRING ""
| #define PACKAGE_BUGREPORT ""
| #define PACKAGE "bzflag"
| #define VERSION "2.0.3.20050526"
| #define BZ_BUILD_OS "solaris2.10"
| #define BZ_BUILD_USER "anonymous"
| #define BUILD_REGEX 1
| #ifdef __cplusplus
| extern "C" void std::exit (int) throw (); using std::exit;
| #endif
| #define HAVE_CURL 1
| #define STDC_HEADERS 1
| #define HAVE_SYS_TYPES_H 1
| #define HAVE_SYS_STAT_H 1
| #define HAVE_STDLIB_H 1
| #define HAVE_STRING_H 1
| #define HAVE_MEMORY_H 1
| #define HAVE_STRINGS_H 1
| #define HAVE_INTTYPES_H 1
| #define HAVE_STDINT_H 1
| #define HAVE_UNISTD_H 1
| #define HAVE_CSTDLIB 1
| #define HAVE_CSTDIO 1
| #define HAVE_CSTRING 1
| #define HAVE_GL_GLX_H 1
| #define HAVE_X11_XLIB_H 1
| #define HAVE_STDINT_H 1
| #define HAVE_SYS_PARAM_H 1
| #define HAVE_UNISTD_H 1
| #define HAVE_VALUES_H 1
| #define HAVE_SOCKLEN_T 1
| #define HAVE_LIBM 1
| #define HAVE_LIBSOCKET 1
| #define HAVE_ACOSF 1
| #define HAVE_ASINF 1
| #define HAVE_ATAN2F 1
| #define HAVE_ATANF 1
| #define HAVE_COSF 1
| #define HAVE_EXPF 1
| #define HAVE_FABSF 1
| #define HAVE_FLOORF 1
| #define HAVE_FMODF 1
| #define HAVE_HYPOTF 1
| #define HAVE_LOGF 1
| #define HAVE_POWF 1
| #define HAVE_SINF 1
| #define HAVE_SQRTF 1
| #define HAVE_TANF 1
| #define HAVE_REGEX_H 1
| #define HAVE_STD_COUNT 1
| #define _USE_BZ_API 1
| #define HAVE_CURSES_H
| /* end confdefs.h. */
|
| #include <stdio.h>
| #include <stdlib.h>
| #include <string.h>
| #include "SDL.h"
|
| char*
| my_strdup (char *str)
| {
| char *new_str;
|
| if (str)
| {
| new_str = (char *)malloc ((strlen (str) + 1) * sizeof(char));
| strcpy (new_str, str);
| }
| else
| new_str = NULL;
|
| return new_str;
| }
|
| int main (int argc, char *argv[])
| {
| int major, minor, micro;
| char *tmp_version;
|
| /* This hangs on some systems (?)
| system ("touch conf.sdltest");
| */
| { FILE *fp = fopen("conf.sdltest", "a"); if ( fp ) fclose(fp); }
|
| /* HP/UX 9 (%@#!) writes to sscanf strings */
| tmp_version = my_strdup("1.2.5");
| if (sscanf(tmp_version, "%d.%d.%d", &major, &minor, µ) != 3) {
| printf("%s, bad version string\n", "1.2.5");
| exit(1);
| }
|
| if ((1 > major) ||
| ((1 == major) && (2 > minor)) ||
| ((1 == major) && (2 == minor) && (8 >= micro)))
| {
| return 0;
| }
| else
| {
| printf("\n*** 'sdl-config --version' returned %d.%d.%d, but the minimum version\n", 1, 2, 8);
| printf("*** of SDL required is %d.%d.%d. If sdl-config is correct, then it is\n", major, minor, micro);
| printf("*** best to upgrade to the required version.\n");
| printf("*** If sdl-config was wrong, set the environment variable SDL_CONFIG\n");
| printf("*** to point to the correct copy of sdl-config, and remove the file\n");
| printf("*** config.cache before re-running configure\n");
| return 1;
| }
| }
|
|
configure:9808: result: no
configure:9847: gcc -o conftest -g -O2 -I/usr/local/include/SDL -D_REENTRANT -L/usr/demo/SOUND/lib conftest.c -lSM -lICE -lX11 -lresolv -laudio -lsocket -lm -lsocket -lnsl -lresolv -L/usr/local/lib -R/usr/local/lib -lSDL -lpthread -lposix4 >&5
ld: fatal: library -laudio: not found
ld: fatal: File processing errors. No output written to conftest
collect2: ld returned 1 exit status
configure:9853: $? = 1
configure: failed program was:
| /* confdefs.h. */
|
| #define PACKAGE_NAME ""
| #define PACKAGE_TARNAME ""
| #define PACKAGE_VERSION ""
| #define PACKAGE_STRING ""
| #define PACKAGE_BUGREPORT ""
| #define PACKAGE "bzflag"
| #define VERSION "2.0.3.20050526"
| #define BZ_BUILD_OS "solaris2.10"
| #define BZ_BUILD_USER "anonymous"
| #define BUILD_REGEX 1
| #ifdef __cplusplus
| extern "C" void std::exit (int) throw (); using std::exit;
| #endif
| #define HAVE_CURL 1
| #define STDC_HEADERS 1
| #define HAVE_SYS_TYPES_H 1
| #define HAVE_SYS_STAT_H 1
| #define HAVE_STDLIB_H 1
| #define HAVE_STRING_H 1
| #define HAVE_MEMORY_H 1
| #define HAVE_STRINGS_H 1
| #define HAVE_INTTYPES_H 1
| #define HAVE_STDINT_H 1
| #define HAVE_UNISTD_H 1
| #define HAVE_CSTDLIB 1
| #define HAVE_CSTDIO 1
| #define HAVE_CSTRING 1
| #define HAVE_GL_GLX_H 1
| #define HAVE_X11_XLIB_H 1
| #define HAVE_STDINT_H 1
| #define HAVE_SYS_PARAM_H 1
| #define HAVE_UNISTD_H 1
| #define HAVE_VALUES_H 1
| #define HAVE_SOCKLEN_T 1
| #define HAVE_LIBM 1
| #define HAVE_LIBSOCKET 1
| #define HAVE_ACOSF 1
| #define HAVE_ASINF 1
| #define HAVE_ATAN2F 1
| #define HAVE_ATANF 1
| #define HAVE_COSF 1
| #define HAVE_EXPF 1
| #define HAVE_FABSF 1
| #define HAVE_FLOORF 1
| #define HAVE_FMODF 1
| #define HAVE_HYPOTF 1
| #define HAVE_LOGF 1
| #define HAVE_POWF 1
| #define HAVE_SINF 1
| #define HAVE_SQRTF 1
| #define HAVE_TANF 1
| #define HAVE_REGEX_H 1
| #define HAVE_STD_COUNT 1
| #define _USE_BZ_API 1
| #define HAVE_CURSES_H
| /* end confdefs.h. */
|
| #include <stdio.h>
| #include "SDL.h"
|
| int main(int argc, char *argv[])
| { return 0; }
| #undef main
| #define main K_and_R_C_main
|
| int
| main ()
| {
| return 0;
| ;
| return 0;
| }
configure:9902: WARNING: could not find an appropriate SDL version. BZflag will build without SDL
configure:9968: WARNING: Client build has been requested, but GL is not fully available (missing gl.h)
... disabling client generation
configure:10195: checking if the compiler understands -Wl,-search_paths_first -mdynamic-no-pic
configure:10216: g++ -o conftest -g -O2 -DBZ_BUILD_DATE=20050526 -O -L/usr/demo/SOUND/lib -Wl,-search_paths_first -mdynamic-no-pic conftest.cc -lsocket -lm -lsocket -lnsl -lresolv >&5
cc1plus: error: invalid option `dynamic-no-pic'
configure:10222: $? = 1
configure: failed program was:
| /* confdefs.h. */
|
| #define PACKAGE_NAME ""
| #define PACKAGE_TARNAME ""
| #define PACKAGE_VERSION ""
| #define PACKAGE_STRING ""
| #define PACKAGE_BUGREPORT ""
| #define PACKAGE "bzflag"
| #define VERSION "2.0.3.20050526"
| #define BZ_BUILD_OS "solaris2.10"
| #define BZ_BUILD_USER "anonymous"
| #define BUILD_REGEX 1
| #ifdef __cplusplus
| extern "C" void std::exit (int) throw (); using std::exit;
| #endif
| #define HAVE_CURL 1
| #define STDC_HEADERS 1
| #define HAVE_SYS_TYPES_H 1
| #define HAVE_SYS_STAT_H 1
| #define HAVE_STDLIB_H 1
| #define HAVE_STRING_H 1
| #define HAVE_MEMORY_H 1
| #define HAVE_STRINGS_H 1
| #define HAVE_INTTYPES_H 1
| #define HAVE_STDINT_H 1
| #define HAVE_UNISTD_H 1
| #define HAVE_CSTDLIB 1
| #define HAVE_CSTDIO 1
| #define HAVE_CSTRING 1
| #define HAVE_GL_GLX_H 1
| #define HAVE_X11_XLIB_H 1
| #define HAVE_STDINT_H 1
| #define HAVE_SYS_PARAM_H 1
| #define HAVE_UNISTD_H 1
| #define HAVE_VALUES_H 1
| #define HAVE_SOCKLEN_T 1
| #define HAVE_LIBM 1
| #define HAVE_LIBSOCKET 1
| #define HAVE_ACOSF 1
| #define HAVE_ASINF 1
| #define HAVE_ATAN2F 1
| #define HAVE_ATANF 1
| #define HAVE_COSF 1
| #define HAVE_EXPF 1
| #define HAVE_FABSF 1
| #define HAVE_FLOORF 1
| #define HAVE_FMODF 1
| #define HAVE_HYPOTF 1
| #define HAVE_LOGF 1
| #define HAVE_POWF 1
| #define HAVE_SINF 1
| #define HAVE_SQRTF 1
| #define HAVE_TANF 1
| #define HAVE_REGEX_H 1
| #define HAVE_STD_COUNT 1
| #define _USE_BZ_API 1
| #define HAVE_CURSES_H
| #define ROBOT 1
| #define SNAPPING 1
| #define INSTALL_DATA_DIR "/usr/local/share/bzflag"
| #define ETC_INET
| #define SUN_OGL_NO_VERTEX_MACROS
| #define NDEBUG 1
| /* end confdefs.h. */
|
| int
| main ()
| {
|
| ;
| return 0;
| }
configure:10246: result: no
configure:10286: checking for CGLGetCurrentContext
configure:10343: g++ -o conftest -g -O2 -DBZ_BUILD_DATE=20050526 -O -L/usr/demo/SOUND/lib conftest.cc -lsocket -lm -lsocket -lnsl -lresolv >&5
Undefined first referenced
symbol in file
CGLGetCurrentContext /var/tmp//cc6xfo12.o
ld: fatal: Symbol referencing errors. No output written to conftest
collect2: ld returned 1 exit status
configure:10349: $? = 1
configure: failed program was:
| /* confdefs.h. */
|
| #define PACKAGE_NAME ""
| #define PACKAGE_TARNAME ""
| #define PACKAGE_VERSION ""
| #define PACKAGE_STRING ""
| #define PACKAGE_BUGREPORT ""
| #define PACKAGE "bzflag"
| #define VERSION "2.0.3.20050526"
| #define BZ_BUILD_OS "solaris2.10"
| #define BZ_BUILD_USER "anonymous"
| #define BUILD_REGEX 1
| #ifdef __cplusplus
| extern "C" void std::exit (int) throw (); using std::exit;
| #endif
| #define HAVE_CURL 1
| #define STDC_HEADERS 1
| #define HAVE_SYS_TYPES_H 1
| #define HAVE_SYS_STAT_H 1
| #define HAVE_STDLIB_H 1
| #define HAVE_STRING_H 1
| #define HAVE_MEMORY_H 1
| #define HAVE_STRINGS_H 1
| #define HAVE_INTTYPES_H 1
| #define HAVE_STDINT_H 1
| #define HAVE_UNISTD_H 1
| #define HAVE_CSTDLIB 1
| #define HAVE_CSTDIO 1
| #define HAVE_CSTRING 1
| #define HAVE_GL_GLX_H 1
| #define HAVE_X11_XLIB_H 1
| #define HAVE_STDINT_H 1
| #define HAVE_SYS_PARAM_H 1
| #define HAVE_UNISTD_H 1
| #define HAVE_VALUES_H 1
| #define HAVE_SOCKLEN_T 1
| #define HAVE_LIBM 1
| #define HAVE_LIBSOCKET 1
| #define HAVE_ACOSF 1
| #define HAVE_ASINF 1
| #define HAVE_ATAN2F 1
| #define HAVE_ATANF 1
| #define HAVE_COSF 1
| #define HAVE_EXPF 1
| #define HAVE_FABSF 1
| #define HAVE_FLOORF 1
| #define HAVE_FMODF 1
| #define HAVE_HYPOTF 1
| #define HAVE_LOGF 1
| #define HAVE_POWF 1
| #define HAVE_SINF 1
| #define HAVE_SQRTF 1
| #define HAVE_TANF 1
| #define HAVE_REGEX_H 1
| #define HAVE_STD_COUNT 1
| #define _USE_BZ_API 1
| #define HAVE_CURSES_H
| #define ROBOT 1
| #define SNAPPING 1
| #define INSTALL_DATA_DIR "/usr/local/share/bzflag"
| #define ETC_INET
| #define SUN_OGL_NO_VERTEX_MACROS
| #define NDEBUG 1
| /* end confdefs.h. */
| /* Define CGLGetCurrentContext to an innocuous variant, in case <limits.h> declares CGLGetCurrentContext.
| For example, HP-UX 11i <limits.h> declares gettimeofday. */
| #define CGLGetCurrentContext innocuous_CGLGetCurrentContext
|
| /* System header to define __stub macros and hopefully few prototypes,
| which can conflict with char CGLGetCurrentContext (); below.
| Prefer <limits.h> to <assert.h> if __STDC__ is defined, since
| <limits.h> exists even on freestanding compilers. */
|
| #ifdef __STDC__
| # include <limits.h>
| #else
| # include <assert.h>
| #endif
|
| #undef CGLGetCurrentContext
|
| /* Override any gcc2 internal prototype to avoid an error. */
| #ifdef __cplusplus
| extern "C"
| {
| #endif
| /* We use char because int might match the return type of a gcc2
| builtin and then its argument prototype would still apply. */
| char CGLGetCurrentContext ();
| /* The GNU C library defines this for functions which it implements
| to always fail with ENOSYS. Some functions are actually named
| something starting with __ and the normal name is an alias. */
| #if defined (__stub_CGLGetCurrentContext) || defined (__stub___CGLGetCurrentContext)
| choke me
| #else
| char (*f) () = CGLGetCurrentContext;
| #endif
| #ifdef __cplusplus
| }
| #endif
|
| int
| main ()
| {
| return f != CGLGetCurrentContext;
| ;
| return 0;
| }
configure:10374: result: no
configure:10286: checking for Sleep
configure:10343: g++ -o conftest -g -O2 -DBZ_BUILD_DATE=20050526 -O -L/usr/demo/SOUND/lib conftest.cc -lsocket -lm -lsocket -lnsl -lresolv >&5
Undefined first referenced
symbol in file
Sleep /var/tmp//cc74CzWc.o
ld: fatal: Symbol referencing errors. No output written to conftest
collect2: ld returned 1 exit status
configure:10349: $? = 1
configure: failed program was:
| /* confdefs.h. */
|
| #define PACKAGE_NAME ""
| #define PACKAGE_TARNAME ""
| #define PACKAGE_VERSION ""
| #define PACKAGE_STRING ""
| #define PACKAGE_BUGREPORT ""
| #define PACKAGE "bzflag"
| #define VERSION "2.0.3.20050526"
| #define BZ_BUILD_OS "solaris2.10"
| #define BZ_BUILD_USER "anonymous"
| #define BUILD_REGEX 1
| #ifdef __cplusplus
| extern "C" void std::exit (int) throw (); using std::exit;
| #endif
| #define HAVE_CURL 1
| #define STDC_HEADERS 1
| #define HAVE_SYS_TYPES_H 1
| #define HAVE_SYS_STAT_H 1
| #define HAVE_STDLIB_H 1
| #define HAVE_STRING_H 1
| #define HAVE_MEMORY_H 1
| #define HAVE_STRINGS_H 1
| #define HAVE_INTTYPES_H 1
| #define HAVE_STDINT_H 1
| #define HAVE_UNISTD_H 1
| #define HAVE_CSTDLIB 1
| #define HAVE_CSTDIO 1
| #define HAVE_CSTRING 1
| #define HAVE_GL_GLX_H 1
| #define HAVE_X11_XLIB_H 1
| #define HAVE_STDINT_H 1
| #define HAVE_SYS_PARAM_H 1
| #define HAVE_UNISTD_H 1
| #define HAVE_VALUES_H 1
| #define HAVE_SOCKLEN_T 1
| #define HAVE_LIBM 1
| #define HAVE_LIBSOCKET 1
| #define HAVE_ACOSF 1
| #define HAVE_ASINF 1
| #define HAVE_ATAN2F 1
| #define HAVE_ATANF 1
| #define HAVE_COSF 1
| #define HAVE_EXPF 1
| #define HAVE_FABSF 1
| #define HAVE_FLOORF 1
| #define HAVE_FMODF 1
| #define HAVE_HYPOTF 1
| #define HAVE_LOGF 1
| #define HAVE_POWF 1
| #define HAVE_SINF 1
| #define HAVE_SQRTF 1
| #define HAVE_TANF 1
| #define HAVE_REGEX_H 1
| #define HAVE_STD_COUNT 1
| #define _USE_BZ_API 1
| #define HAVE_CURSES_H
| #define ROBOT 1
| #define SNAPPING 1
| #define INSTALL_DATA_DIR "/usr/local/share/bzflag"
| #define ETC_INET
| #define SUN_OGL_NO_VERTEX_MACROS
| #define NDEBUG 1
| /* end confdefs.h. */
| /* Define Sleep to an innocuous variant, in case <limits.h> declares Sleep.
| For example, HP-UX 11i <limits.h> declares gettimeofday. */
| #define Sleep innocuous_Sleep
|
| /* System header to define __stub macros and hopefully few prototypes,
| which can conflict with char Sleep (); below.
| Prefer <limits.h> to <assert.h> if __STDC__ is defined, since
| <limits.h> exists even on freestanding compilers. */
|
| #ifdef __STDC__
| # include <limits.h>
| #else
| # include <assert.h>
| #endif
|
| #undef Sleep
|
| /* Override any gcc2 internal prototype to avoid an error. */
| #ifdef __cplusplus
| extern "C"
| {
| #endif
| /* We use char because int might match the return type of a gcc2
| builtin and then its argument prototype would still apply. */
| char Sleep ();
| /* The GNU C library defines this for functions which it implements
| to always fail with ENOSYS. Some functions are actually named
| something starting with __ and the normal name is an alias. */
| #if defined (__stub_Sleep) || defined (__stub___Sleep)
| choke me
| #else
| char (*f) () = Sleep;
| #endif
| #ifdef __cplusplus
| }
| #endif
|
| int
| main ()
| {
| return f != Sleep;
| ;
| return 0;
| }
configure:10374: result: no
configure:10286: checking for WaitForSingleObject
configure:10343: g++ -o conftest -g -O2 -DBZ_BUILD_DATE=20050526 -O -L/usr/demo/SOUND/lib conftest.cc -lsocket -lm -lsocket -lnsl -lresolv >&5
Undefined first referenced
symbol in file
WaitForSingleObject /var/tmp//cc5mFvDt.o
ld: fatal: Symbol referencing errors. No output written to conftest
collect2: ld returned 1 exit status
configure:10349: $? = 1
configure: failed program was:
| /* confdefs.h. */
|
| #define PACKAGE_NAME ""
| #define PACKAGE_TARNAME ""
| #define PACKAGE_VERSION ""
| #define PACKAGE_STRING ""
| #define PACKAGE_BUGREPORT ""
| #define PACKAGE "bzflag"
| #define VERSION "2.0.3.20050526"
| #define BZ_BUILD_OS "solaris2.10"
| #define BZ_BUILD_USER "anonymous"
| #define BUILD_REGEX 1
| #ifdef __cplusplus
| extern "C" void std::exit (int) throw (); using std::exit;
| #endif
| #define HAVE_CURL 1
| #define STDC_HEADERS 1
| #define HAVE_SYS_TYPES_H 1
| #define HAVE_SYS_STAT_H 1
| #define HAVE_STDLIB_H 1
| #define HAVE_STRING_H 1
| #define HAVE_MEMORY_H 1
| #define HAVE_STRINGS_H 1
| #define HAVE_INTTYPES_H 1
| #define HAVE_STDINT_H 1
| #define HAVE_UNISTD_H 1
| #define HAVE_CSTDLIB 1
| #define HAVE_CSTDIO 1
| #define HAVE_CSTRING 1
| #define HAVE_GL_GLX_H 1
| #define HAVE_X11_XLIB_H 1
| #define HAVE_STDINT_H 1
| #define HAVE_SYS_PARAM_H 1
| #define HAVE_UNISTD_H 1
| #define HAVE_VALUES_H 1
| #define HAVE_SOCKLEN_T 1
| #define HAVE_LIBM 1
| #define HAVE_LIBSOCKET 1
| #define HAVE_ACOSF 1
| #define HAVE_ASINF 1
| #define HAVE_ATAN2F 1
| #define HAVE_ATANF 1
| #define HAVE_COSF 1
| #define HAVE_EXPF 1
| #define HAVE_FABSF 1
| #define HAVE_FLOORF 1
| #define HAVE_FMODF 1
| #define HAVE_HYPOTF 1
| #define HAVE_LOGF 1
| #define HAVE_POWF 1
| #define HAVE_SINF 1
| #define HAVE_SQRTF 1
| #define HAVE_TANF 1
| #define HAVE_REGEX_H 1
| #define HAVE_STD_COUNT 1
| #define _USE_BZ_API 1
| #define HAVE_CURSES_H
| #define ROBOT 1
| #define SNAPPING 1
| #define INSTALL_DATA_DIR "/usr/local/share/bzflag"
| #define ETC_INET
| #define SUN_OGL_NO_VERTEX_MACROS
| #define NDEBUG 1
| /* end confdefs.h. */
| /* Define WaitForSingleObject to an innocuous variant, in case <limits.h> declares WaitForSingleObject.
| For example, HP-UX 11i <limits.h> declares gettimeofday. */
| #define WaitForSingleObject innocuous_WaitForSingleObject
|
| /* System header to define __stub macros and hopefully few prototypes,
| which can conflict with char WaitForSingleObject (); below.
| Prefer <limits.h> to <assert.h> if __STDC__ is defined, since
| <limits.h> exists even on freestanding compilers. */
|
| #ifdef __STDC__
| # include <limits.h>
| #else
| # include <assert.h>
| #endif
|
| #undef WaitForSingleObject
|
| /* Override any gcc2 internal prototype to avoid an error. */
| #ifdef __cplusplus
| extern "C"
| {
| #endif
| /* We use char because int might match the return type of a gcc2
| builtin and then its argument prototype would still apply. */
| char WaitForSingleObject ();
| /* The GNU C library defines this for functions which it implements
| to always fail with ENOSYS. Some functions are actually named
| something starting with __ and the normal name is an alias. */
| #if defined (__stub_WaitForSingleObject) || defined (__stub___WaitForSingleObject)
| choke me
| #else
| char (*f) () = WaitForSingleObject;
| #endif
| #ifdef __cplusplus
| }
| #endif
|
| int
| main ()
| {
| return f != WaitForSingleObject;
| ;
| return 0;
| }
configure:10374: result: no
configure:10286: checking for _stricmp
configure:10343: g++ -o conftest -g -O2 -DBZ_BUILD_DATE=20050526 -O -L/usr/demo/SOUND/lib conftest.cc -lsocket -lm -lsocket -lnsl -lresolv >&5
Undefined first referenced
symbol in file
_stricmp /var/tmp//ccopcEZz.o
ld: fatal: Symbol referencing errors. No output written to conftest
collect2: ld returned 1 exit status
configure:10349: $? = 1
configure: failed program was:
| /* confdefs.h. */
|
| #define PACKAGE_NAME ""
| #define PACKAGE_TARNAME ""
| #define PACKAGE_VERSION ""
| #define PACKAGE_STRING ""
| #define PACKAGE_BUGREPORT ""
| #define PACKAGE "bzflag"
| #define VERSION "2.0.3.20050526"
| #define BZ_BUILD_OS "solaris2.10"
| #define BZ_BUILD_USER "anonymous"
| #define BUILD_REGEX 1
| #ifdef __cplusplus
| extern "C" void std::exit (int) throw (); using std::exit;
| #endif
| #define HAVE_CURL 1
| #define STDC_HEADERS 1
| #define HAVE_SYS_TYPES_H 1
| #define HAVE_SYS_STAT_H 1
| #define HAVE_STDLIB_H 1
| #define HAVE_STRING_H 1
| #define HAVE_MEMORY_H 1
| #define HAVE_STRINGS_H 1
| #define HAVE_INTTYPES_H 1
| #define HAVE_STDINT_H 1
| #define HAVE_UNISTD_H 1
| #define HAVE_CSTDLIB 1
| #define HAVE_CSTDIO 1
| #define HAVE_CSTRING 1
| #define HAVE_GL_GLX_H 1
| #define HAVE_X11_XLIB_H 1
| #define HAVE_STDINT_H 1
| #define HAVE_SYS_PARAM_H 1
| #define HAVE_UNISTD_H 1
| #define HAVE_VALUES_H 1
| #define HAVE_SOCKLEN_T 1
| #define HAVE_LIBM 1
| #define HAVE_LIBSOCKET 1
| #define HAVE_ACOSF 1
| #define HAVE_ASINF 1
| #define HAVE_ATAN2F 1
| #define HAVE_ATANF 1
| #define HAVE_COSF 1
| #define HAVE_EXPF 1
| #define HAVE_FABSF 1
| #define HAVE_FLOORF 1
| #define HAVE_FMODF 1
| #define HAVE_HYPOTF 1
| #define HAVE_LOGF 1
| #define HAVE_POWF 1
| #define HAVE_SINF 1
| #define HAVE_SQRTF 1
| #define HAVE_TANF 1
| #define HAVE_REGEX_H 1
| #define HAVE_STD_COUNT 1
| #define _USE_BZ_API 1
| #define HAVE_CURSES_H
| #define ROBOT 1
| #define SNAPPING 1
| #define INSTALL_DATA_DIR "/usr/local/share/bzflag"
| #define ETC_INET
| #define SUN_OGL_NO_VERTEX_MACROS
| #define NDEBUG 1
| /* end confdefs.h. */
| /* Define _stricmp to an innocuous variant, in case <limits.h> declares _stricmp.
| For example, HP-UX 11i <limits.h> declares gettimeofday. */
| #define _stricmp innocuous__stricmp
|
| /* System header to define __stub macros and hopefully few prototypes,
| which can conflict with char _stricmp (); below.
| Prefer <limits.h> to <assert.h> if __STDC__ is defined, since
| <limits.h> exists even on freestanding compilers. */
|
| #ifdef __STDC__
| # include <limits.h>
| #else
| # include <assert.h>
| #endif
|
| #undef _stricmp
|
| /* Override any gcc2 internal prototype to avoid an error. */
| #ifdef __cplusplus
| extern "C"
| {
| #endif
| /* We use char because int might match the return type of a gcc2
| builtin and then its argument prototype would still apply. */
| char _stricmp ();
| /* The GNU C library defines this for functions which it implements
| to always fail with ENOSYS. Some functions are actually named
| something starting with __ and the normal name is an alias. */
| #if defined (__stub__stricmp) || defined (__stub____stricmp)
| choke me
| #else
| char (*f) () = _stricmp;
| #endif
| #ifdef __cplusplus
| }
| #endif
|
| int
| main ()
| {
| return f != _stricmp;
| ;
| return 0;
| }
configure:10374: result: no
configure:10286: checking for _strnicmp
configure:10343: g++ -o conftest -g -O2 -DBZ_BUILD_DATE=20050526 -O -L/usr/demo/SOUND/lib conftest.cc -lsocket -lm -lsocket -lnsl -lresolv >&5
Undefined first referenced
symbol in file
_strnicmp /var/tmp//ccu7NAGP.o
ld: fatal: Symbol referencing errors. No output written to conftest
collect2: ld returned 1 exit status
configure:10349: $? = 1
configure: failed program was:
| /* confdefs.h. */
|
| #define PACKAGE_NAME ""
| #define PACKAGE_TARNAME ""
| #define PACKAGE_VERSION ""
| #define PACKAGE_STRING ""
| #define PACKAGE_BUGREPORT ""
| #define PACKAGE "bzflag"
| #define VERSION "2.0.3.20050526"
| #define BZ_BUILD_OS "solaris2.10"
| #define BZ_BUILD_USER "anonymous"
| #define BUILD_REGEX 1
| #ifdef __cplusplus
| extern "C" void std::exit (int) throw (); using std::exit;
| #endif
| #define HAVE_CURL 1
| #define STDC_HEADERS 1
| #define HAVE_SYS_TYPES_H 1
| #define HAVE_SYS_STAT_H 1
| #define HAVE_STDLIB_H 1
| #define HAVE_STRING_H 1
| #define HAVE_MEMORY_H 1
| #define HAVE_STRINGS_H 1
| #define HAVE_INTTYPES_H 1
| #define HAVE_STDINT_H 1
| #define HAVE_UNISTD_H 1
| #define HAVE_CSTDLIB 1
| #define HAVE_CSTDIO 1
| #define HAVE_CSTRING 1
| #define HAVE_GL_GLX_H 1
| #define HAVE_X11_XLIB_H 1
| #define HAVE_STDINT_H 1
| #define HAVE_SYS_PARAM_H 1
| #define HAVE_UNISTD_H 1
| #define HAVE_VALUES_H 1
| #define HAVE_SOCKLEN_T 1
| #define HAVE_LIBM 1
| #define HAVE_LIBSOCKET 1
| #define HAVE_ACOSF 1
| #define HAVE_ASINF 1
| #define HAVE_ATAN2F 1
| #define HAVE_ATANF 1
| #define HAVE_COSF 1
| #define HAVE_EXPF 1
| #define HAVE_FABSF 1
| #define HAVE_FLOORF 1
| #define HAVE_FMODF 1
| #define HAVE_HYPOTF 1
| #define HAVE_LOGF 1
| #define HAVE_POWF 1
| #define HAVE_SINF 1
| #define HAVE_SQRTF 1
| #define HAVE_TANF 1
| #define HAVE_REGEX_H 1
| #define HAVE_STD_COUNT 1
| #define _USE_BZ_API 1
| #define HAVE_CURSES_H
| #define ROBOT 1
| #define SNAPPING 1
| #define INSTALL_DATA_DIR "/usr/local/share/bzflag"
| #define ETC_INET
| #define SUN_OGL_NO_VERTEX_MACROS
| #define NDEBUG 1
| /* end confdefs.h. */
| /* Define _strnicmp to an innocuous variant, in case <limits.h> declares _strnicmp.
| For example, HP-UX 11i <limits.h> declares gettimeofday. */
| #define _strnicmp innocuous__strnicmp
|
| /* System header to define __stub macros and hopefully few prototypes,
| which can conflict with char _strnicmp (); below.
| Prefer <limits.h> to <assert.h> if __STDC__ is defined, since
| <limits.h> exists even on freestanding compilers. */
|
| #ifdef __STDC__
| # include <limits.h>
| #else
| # include <assert.h>
| #endif
|
| #undef _strnicmp
|
| /* Override any gcc2 internal prototype to avoid an error. */
| #ifdef __cplusplus
| extern "C"
| {
| #endif
| /* We use char because int might match the return type of a gcc2
| builtin and then its argument prototype would still apply. */
| char _strnicmp ();
| /* The GNU C library defines this for functions which it implements
| to always fail with ENOSYS. Some functions are actually named
| something starting with __ and the normal name is an alias. */
| #if defined (__stub__strnicmp) || defined (__stub____strnicmp)
| choke me
| #else
| char (*f) () = _strnicmp;
| #endif
| #ifdef __cplusplus
| }
| #endif
|
| int
| main ()
| {
| return f != _strnicmp;
| ;
| return 0;
| }
configure:10374: result: no
configure:10286: checking for _vsnprintf
configure:10343: g++ -o conftest -g -O2 -DBZ_BUILD_DATE=20050526 -O -L/usr/demo/SOUND/lib conftest.cc -lsocket -lm -lsocket -lnsl -lresolv >&5
Undefined first referenced
symbol in file
_vsnprintf /var/tmp//cc4uVIG8.o
ld: fatal: Symbol referencing errors. No output written to conftest
collect2: ld returned 1 exit status
configure:10349: $? = 1
configure: failed program was:
| /* confdefs.h. */
|
| #define PACKAGE_NAME ""
| #define PACKAGE_TARNAME ""
| #define PACKAGE_VERSION ""
| #define PACKAGE_STRING ""
| #define PACKAGE_BUGREPORT ""
| #define PACKAGE "bzflag"
| #define VERSION "2.0.3.20050526"
| #define BZ_BUILD_OS "solaris2.10"
| #define BZ_BUILD_USER "anonymous"
| #define BUILD_REGEX 1
| #ifdef __cplusplus
| extern "C" void std::exit (int) throw (); using std::exit;
| #endif
| #define HAVE_CURL 1
| #define STDC_HEADERS 1
| #define HAVE_SYS_TYPES_H 1
| #define HAVE_SYS_STAT_H 1
| #define HAVE_STDLIB_H 1
| #define HAVE_STRING_H 1
| #define HAVE_MEMORY_H 1
| #define HAVE_STRINGS_H 1
| #define HAVE_INTTYPES_H 1
| #define HAVE_STDINT_H 1
| #define HAVE_UNISTD_H 1
| #define HAVE_CSTDLIB 1
| #define HAVE_CSTDIO 1
| #define HAVE_CSTRING 1
| #define HAVE_GL_GLX_H 1
| #define HAVE_X11_XLIB_H 1
| #define HAVE_STDINT_H 1
| #define HAVE_SYS_PARAM_H 1
| #define HAVE_UNISTD_H 1
| #define HAVE_VALUES_H 1
| #define HAVE_SOCKLEN_T 1
| #define HAVE_LIBM 1
| #define HAVE_LIBSOCKET 1
| #define HAVE_ACOSF 1
| #define HAVE_ASINF 1
| #define HAVE_ATAN2F 1
| #define HAVE_ATANF 1
| #define HAVE_COSF 1
| #define HAVE_EXPF 1
| #define HAVE_FABSF 1
| #define HAVE_FLOORF 1
| #define HAVE_FMODF 1
| #define HAVE_HYPOTF 1
| #define HAVE_LOGF 1
| #define HAVE_POWF 1
| #define HAVE_SINF 1
| #define HAVE_SQRTF 1
| #define HAVE_TANF 1
| #define HAVE_REGEX_H 1
| #define HAVE_STD_COUNT 1
| #define _USE_BZ_API 1
| #define HAVE_CURSES_H
| #define ROBOT 1
| #define SNAPPING 1
| #define INSTALL_DATA_DIR "/usr/local/share/bzflag"
| #define ETC_INET
| #define SUN_OGL_NO_VERTEX_MACROS
| #define NDEBUG 1
| /* end confdefs.h. */
| /* Define _vsnprintf to an innocuous variant, in case <limits.h> declares _vsnprintf.
| For example, HP-UX 11i <limits.h> declares gettimeofday. */
| #define _vsnprintf innocuous__vsnprintf
|
| /* System header to define __stub macros and hopefully few prototypes,
| which can conflict with char _vsnprintf (); below.
| Prefer <limits.h> to <assert.h> if __STDC__ is defined, since
| <limits.h> exists even on freestanding compilers. */
|
| #ifdef __STDC__
| # include <limits.h>
| #else
| # include <assert.h>
| #endif
|
| #undef _vsnprintf
|
| /* Override any gcc2 internal prototype to avoid an error. */
| #ifdef __cplusplus
| extern "C"
| {
| #endif
| /* We use char because int might match the return type of a gcc2
| builtin and then its argument prototype would still apply. */
| char _vsnprintf ();
| /* The GNU C library defines this for functions which it implements
| to always fail with ENOSYS. Some functions are actually named
| something starting with __ and the normal name is an alias. */
| #if defined (__stub__vsnprintf) || defined (__stub____vsnprintf)
| choke me
| #else
| char (*f) () = _vsnprintf;
| #endif
| #ifdef __cplusplus
| }
| #endif
|
| int
| main ()
| {
| return f != _vsnprintf;
| ;
| return 0;
| }
configure:10374: result: no
configure:10286: checking for atexit
configure:10343: g++ -o conftest -g -O2 -DBZ_BUILD_DATE=20050526 -O -L/usr/demo/SOUND/lib conftest.cc -lsocket -lm -lsocket -lnsl -lresolv >&5
configure:10349: $? = 0
configure:10353: test -z
|| test ! -s conftest.err
configure:10356: $? = 0
configure:10359: test -s conftest
configure:10362: $? = 0
configure:10374: result: yes
configure:10286: checking for getrlimit
configure:10343: g++ -o conftest -g -O2 -DBZ_BUILD_DATE=20050526 -O -L/usr/demo/SOUND/lib conftest.cc -lsocket -lm -lsocket -lnsl -lresolv >&5
configure:10349: $? = 0
configure:10353: test -z
|| test ! -s conftest.err
configure:10356: $? = 0
configure:10359: test -s conftest
configure:10362: $? = 0
configure:10374: result: yes
configure:10286: checking for glXGetCurrentContext
configure:10343: g++ -o conftest -g -O2 -DBZ_BUILD_DATE=20050526 -O -L/usr/demo/SOUND/lib conftest.cc -lsocket -lm -lsocket -lnsl -lresolv >&5
Undefined first referenced
symbol in file
glXGetCurrentContext /var/tmp//ccu8mOrL.o
ld: fatal: Symbol referencing errors. No output written to conftest
collect2: ld returned 1 exit status
configure:10349: $? = 1
configure: failed program was:
| /* confdefs.h. */
|
| #define PACKAGE_NAME ""
| #define PACKAGE_TARNAME ""
| #define PACKAGE_VERSION ""
| #define PACKAGE_STRING ""
| #define PACKAGE_BUGREPORT ""
| #define PACKAGE "bzflag"
| #define VERSION "2.0.3.20050526"
| #define BZ_BUILD_OS "solaris2.10"
| #define BZ_BUILD_USER "anonymous"
| #define BUILD_REGEX 1
| #ifdef __cplusplus
| extern "C" void std::exit (int) throw (); using std::exit;
| #endif
| #define HAVE_CURL 1
| #define STDC_HEADERS 1
| #define HAVE_SYS_TYPES_H 1
| #define HAVE_SYS_STAT_H 1
| #define HAVE_STDLIB_H 1
| #define HAVE_STRING_H 1
| #define HAVE_MEMORY_H 1
| #define HAVE_STRINGS_H 1
| #define HAVE_INTTYPES_H 1
| #define HAVE_STDINT_H 1
| #define HAVE_UNISTD_H 1
| #define HAVE_CSTDLIB 1
| #define HAVE_CSTDIO 1
| #define HAVE_CSTRING 1
| #define HAVE_GL_GLX_H 1
| #define HAVE_X11_XLIB_H 1
| #define HAVE_STDINT_H 1
| #define HAVE_SYS_PARAM_H 1
| #define HAVE_UNISTD_H 1
| #define HAVE_VALUES_H 1
| #define HAVE_SOCKLEN_T 1
| #define HAVE_LIBM 1
| #define HAVE_LIBSOCKET 1
| #define HAVE_ACOSF 1
| #define HAVE_ASINF 1
| #define HAVE_ATAN2F 1
| #define HAVE_ATANF 1
| #define HAVE_COSF 1
| #define HAVE_EXPF 1
| #define HAVE_FABSF 1
| #define HAVE_FLOORF 1
| #define HAVE_FMODF 1
| #define HAVE_HYPOTF 1
| #define HAVE_LOGF 1
| #define HAVE_POWF 1
| #define HAVE_SINF 1
| #define HAVE_SQRTF 1
| #define HAVE_TANF 1
| #define HAVE_REGEX_H 1
| #define HAVE_STD_COUNT 1
| #define _USE_BZ_API 1
| #define HAVE_CURSES_H
| #define ROBOT 1
| #define SNAPPING 1
| #define INSTALL_DATA_DIR "/usr/local/share/bzflag"
| #define ETC_INET
| #define SUN_OGL_NO_VERTEX_MACROS
| #define NDEBUG 1
| #define HAVE_ATEXIT 1
| #define HAVE_GETRLIMIT 1
| /* end confdefs.h. */
| /* Define glXGetCurrentContext to an innocuous variant, in case <limits.h> declares glXGetCurrentContext.
| For example, HP-UX 11i <limits.h> declares gettimeofday. */
| #define glXGetCurrentContext innocuous_glXGetCurrentContext
|
| /* System header to define __stub macros and hopefully few prototypes,
| which can conflict with char glXGetCurrentContext (); below.
| Prefer <limits.h> to <assert.h> if __STDC__ is defined, since
| <limits.h> exists even on freestanding compilers. */
|
| #ifdef __STDC__
| # include <limits.h>
| #else
| # include <assert.h>
| #endif
|
| #undef glXGetCurrentContext
|
| /* Override any gcc2 internal prototype to avoid an error. */
| #ifdef __cplusplus
| extern "C"
| {
| #endif
| /* We use char because int might match the return type of a gcc2
| builtin and then its argument prototype would still apply. */
| char glXGetCurrentContext ();
| /* The GNU C library defines this for functions which it implements
| to always fail with ENOSYS. Some functions are actually named
| something starting with __ and the normal name is an alias. */
| #if defined (__stub_glXGetCurrentContext) || defined (__stub___glXGetCurrentContext)
| choke me
| #else
| char (*f) () = glXGetCurrentContext;
| #endif
| #ifdef __cplusplus
| }
| #endif
|
| int
| main ()
| {
| return f != glXGetCurrentContext;
| ;
| return 0;
| }
configure:10374: result: no
configure:10286: checking for select
configure:10343: g++ -o conftest -g -O2 -DBZ_BUILD_DATE=20050526 -O -L/usr/demo/SOUND/lib conftest.cc -lsocket -lm -lsocket -lnsl -lresolv >&5
configure:10349: $? = 0
configure:10353: test -z
|| test ! -s conftest.err
configure:10356: $? = 0
configure:10359: test -s conftest
configure:10362: $? = 0
configure:10374: result: yes
configure:10286: checking for snooze
configure:10343: g++ -o conftest -g -O2 -DBZ_BUILD_DATE=20050526 -O -L/usr/demo/SOUND/lib conftest.cc -lsocket -lm -lsocket -lnsl -lresolv >&5
Undefined first referenced
symbol in file
snooze /var/tmp//ccmchGCR.o
ld: fatal: Symbol referencing errors. No output written to conftest
collect2: ld returned 1 exit status
configure:10349: $? = 1
configure: failed program was:
| /* confdefs.h. */
|
| #define PACKAGE_NAME ""
| #define PACKAGE_TARNAME ""
| #define PACKAGE_VERSION ""
| #define PACKAGE_STRING ""
| #define PACKAGE_BUGREPORT ""
| #define PACKAGE "bzflag"
| #define VERSION "2.0.3.20050526"
| #define BZ_BUILD_OS "solaris2.10"
| #define BZ_BUILD_USER "anonymous"
| #define BUILD_REGEX 1
| #ifdef __cplusplus
| extern "C" void std::exit (int) throw (); using std::exit;
| #endif
| #define HAVE_CURL 1
| #define STDC_HEADERS 1
| #define HAVE_SYS_TYPES_H 1
| #define HAVE_SYS_STAT_H 1
| #define HAVE_STDLIB_H 1
| #define HAVE_STRING_H 1
| #define HAVE_MEMORY_H 1
| #define HAVE_STRINGS_H 1
| #define HAVE_INTTYPES_H 1
| #define HAVE_STDINT_H 1
| #define HAVE_UNISTD_H 1
| #define HAVE_CSTDLIB 1
| #define HAVE_CSTDIO 1
| #define HAVE_CSTRING 1
| #define HAVE_GL_GLX_H 1
| #define HAVE_X11_XLIB_H 1
| #define HAVE_STDINT_H 1
| #define HAVE_SYS_PARAM_H 1
| #define HAVE_UNISTD_H 1
| #define HAVE_VALUES_H 1
| #define HAVE_SOCKLEN_T 1
| #define HAVE_LIBM 1
| #define HAVE_LIBSOCKET 1
| #define HAVE_ACOSF 1
| #define HAVE_ASINF 1
| #define HAVE_ATAN2F 1
| #define HAVE_ATANF 1
| #define HAVE_COSF 1
| #define HAVE_EXPF 1
| #define HAVE_FABSF 1
| #define HAVE_FLOORF 1
| #define HAVE_FMODF 1
| #define HAVE_HYPOTF 1
| #define HAVE_LOGF 1
| #define HAVE_POWF 1
| #define HAVE_SINF 1
| #define HAVE_SQRTF 1
| #define HAVE_TANF 1
| #define HAVE_REGEX_H 1
| #define HAVE_STD_COUNT 1
| #define _USE_BZ_API 1
| #define HAVE_CURSES_H
| #define ROBOT 1
| #define SNAPPING 1
| #define INSTALL_DATA_DIR "/usr/local/share/bzflag"
| #define ETC_INET
| #define SUN_OGL_NO_VERTEX_MACROS
| #define NDEBUG 1
| #define HAVE_ATEXIT 1
| #define HAVE_GETRLIMIT 1
| #define HAVE_SELECT 1
| /* end confdefs.h. */
| /* Define snooze to an innocuous variant, in case <limits.h> declares snooze.
| For example, HP-UX 11i <limits.h> declares gettimeofday. */
| #define snooze innocuous_snooze
|
| /* System header to define __stub macros and hopefully few prototypes,
| which can conflict with char snooze (); below.
| Prefer <limits.h> to <assert.h> if __STDC__ is defined, since
| <limits.h> exists even on freestanding compilers. */
|
| #ifdef __STDC__
| # include <limits.h>
| #else
| # include <assert.h>
| #endif
|
| #undef snooze
|
| /* Override any gcc2 internal prototype to avoid an error. */
| #ifdef __cplusplus
| extern "C"
| {
| #endif
| /* We use char because int might match the return type of a gcc2
| builtin and then its argument prototype would still apply. */
| char snooze ();
| /* The GNU C library defines this for functions which it implements
| to always fail with ENOSYS. Some functions are actually named
| something starting with __ and the normal name is an alias. */
| #if defined (__stub_snooze) || defined (__stub___snooze)
| choke me
| #else
| char (*f) () = snooze;
| #endif
| #ifdef __cplusplus
| }
| #endif
|
| int
| main ()
| {
| return f != snooze;
| ;
| return 0;
| }
configure:10374: result: no
configure:10286: checking for usleep
configure:10343: g++ -o conftest -g -O2 -DBZ_BUILD_DATE=20050526 -O -L/usr/demo/SOUND/lib conftest.cc -lsocket -lm -lsocket -lnsl -lresolv >&5
configure:10349: $? = 0
configure:10353: test -z
|| test ! -s conftest.err
configure:10356: $? = 0
configure:10359: test -s conftest
configure:10362: $? = 0
configure:10374: result: yes
configure:10286: checking for vsnprintf
configure:10343: g++ -o conftest -g -O2 -DBZ_BUILD_DATE=20050526 -O -L/usr/demo/SOUND/lib conftest.cc -lsocket -lm -lsocket -lnsl -lresolv >&5
configure:10349: $? = 0
configure:10353: test -z
|| test ! -s conftest.err
configure:10356: $? = 0
configure:10359: test -s conftest
configure:10362: $? = 0
configure:10374: result: yes
configure:10286: checking for wglGetCurrentContext
configure:10343: g++ -o conftest -g -O2 -DBZ_BUILD_DATE=20050526 -O -L/usr/demo/SOUND/lib conftest.cc -lsocket -lm -lsocket -lnsl -lresolv >&5
Undefined first referenced
symbol in file
wglGetCurrentContext /var/tmp//ccMnYEBh.o
ld: fatal: Symbol referencing errors. No output written to conftest
collect2: ld returned 1 exit status
configure:10349: $? = 1
configure: failed program was:
| /* confdefs.h. */
|
| #define PACKAGE_NAME ""
| #define PACKAGE_TARNAME ""
| #define PACKAGE_VERSION ""
| #define PACKAGE_STRING ""
| #define PACKAGE_BUGREPORT ""
| #define PACKAGE "bzflag"
| #define VERSION "2.0.3.20050526"
| #define BZ_BUILD_OS "solaris2.10"
| #define BZ_BUILD_USER "anonymous"
| #define BUILD_REGEX 1
| #ifdef __cplusplus
| extern "C" void std::exit (int) throw (); using std::exit;
| #endif
| #define HAVE_CURL 1
| #define STDC_HEADERS 1
| #define HAVE_SYS_TYPES_H 1
| #define HAVE_SYS_STAT_H 1
| #define HAVE_STDLIB_H 1
| #define HAVE_STRING_H 1
| #define HAVE_MEMORY_H 1
| #define HAVE_STRINGS_H 1
| #define HAVE_INTTYPES_H 1
| #define HAVE_STDINT_H 1
| #define HAVE_UNISTD_H 1
| #define HAVE_CSTDLIB 1
| #define HAVE_CSTDIO 1
| #define HAVE_CSTRING 1
| #define HAVE_GL_GLX_H 1
| #define HAVE_X11_XLIB_H 1
| #define HAVE_STDINT_H 1
| #define HAVE_SYS_PARAM_H 1
| #define HAVE_UNISTD_H 1
| #define HAVE_VALUES_H 1
| #define HAVE_SOCKLEN_T 1
| #define HAVE_LIBM 1
| #define HAVE_LIBSOCKET 1
| #define HAVE_ACOSF 1
| #define HAVE_ASINF 1
| #define HAVE_ATAN2F 1
| #define HAVE_ATANF 1
| #define HAVE_COSF 1
| #define HAVE_EXPF 1
| #define HAVE_FABSF 1
| #define HAVE_FLOORF 1
| #define HAVE_FMODF 1
| #define HAVE_HYPOTF 1
| #define HAVE_LOGF 1
| #define HAVE_POWF 1
| #define HAVE_SINF 1
| #define HAVE_SQRTF 1
| #define HAVE_TANF 1
| #define HAVE_REGEX_H 1
| #define HAVE_STD_COUNT 1
| #define _USE_BZ_API 1
| #define HAVE_CURSES_H
| #define ROBOT 1
| #define SNAPPING 1
| #define INSTALL_DATA_DIR "/usr/local/share/bzflag"
| #define ETC_INET
| #define SUN_OGL_NO_VERTEX_MACROS
| #define NDEBUG 1
| #define HAVE_ATEXIT 1
| #define HAVE_GETRLIMIT 1
| #define HAVE_SELECT 1
| #define HAVE_USLEEP 1
| #define HAVE_VSNPRINTF 1
| /* end confdefs.h. */
| /* Define wglGetCurrentContext to an innocuous variant, in case <limits.h> declares wglGetCurrentContext.
| For example, HP-UX 11i <limits.h> declares gettimeofday. */
| #define wglGetCurrentContext innocuous_wglGetCurrentContext
|
| /* System header to define __stub macros and hopefully few prototypes,
| which can conflict with char wglGetCurrentContext (); below.
| Prefer <limits.h> to <assert.h> if __STDC__ is defined, since
| <limits.h> exists even on freestanding compilers. */
|
| #ifdef __STDC__
| # include <limits.h>
| #else
| # include <assert.h>
| #endif
|
| #undef wglGetCurrentContext
|
| /* Override any gcc2 internal prototype to avoid an error. */
| #ifdef __cplusplus
| extern "C"
| {
| #endif
| /* We use char because int might match the return type of a gcc2
| builtin and then its argument prototype would still apply. */
| char wglGetCurrentContext ();
| /* The GNU C library defines this for functions which it implements
| to always fail with ENOSYS. Some functions are actually named
| something starting with __ and the normal name is an alias. */
| #if defined (__stub_wglGetCurrentContext) || defined (__stub___wglGetCurrentContext)
| choke me
| #else
| char (*f) () = wglGetCurrentContext;
| #endif
| #ifdef __cplusplus
| }
| #endif
|
| int
| main ()
| {
| return f != wglGetCurrentContext;
| ;
| return 0;
| }
configure:10374: result: no
configure:10698: creating ./config.status
## ---------------------- ##
## Running config.status. ##
## ---------------------- ##
This file was extended by config.status, which was
generated by GNU Autoconf 2.59. Invocation command line was
CONFIG_FILES =
CONFIG_HEADERS =
CONFIG_LINKS =
CONFIG_COMMANDS =
$ ./config.status
on sun
config.status:835: creating bzflag.info
config.status:835: creating bzflag.lsm
config.status:835: creating BZFlag.xcode/Makefile
config.status:835: creating Dev-C++/Makefile
config.status:835: creating Makefile
config.status:835: creating bzflag.spec
config.status:835: creating data/Makefile
config.status:835: creating data/fonts/Makefile
config.status:835: creating data/l10n/Makefile
config.status:835: creating debian/Makefile
config.status:835: creating doc/Makefile
config.status:835: creating doc/faq/Makefile
config.status:835: creating doc/guide/Makefile
config.status:835: creating doc/guide/Commands/Makefile
config.status:835: creating doc/guide/Flags/Makefile
config.status:835: creating doc/guide/Geometry/Makefile
config.status:835: creating doc/guide/Installation/Makefile
config.status:835: creating doc/guide/Tactics/Makefile
config.status:835: creating doc/howto/Makefile
config.status:835: creating doc/man/Makefile
config.status:835: creating include/Makefile
config.status:835: creating misc/Makefile
config.status:835: creating man/Makefile
config.status:835: creating package/Makefile
config.status:835: creating package/linux/Makefile
config.status:835: creating package/rpm/Makefile
config.status:835: creating package/irix/Makefile
config.status:835: creating package/win32/Makefile
config.status:835: creating package/win32/nsis/Makefile
config.status:835: creating src/Makefile
config.status:835: creating src/bzadmin/Makefile
config.status:835: creating src/bzflag/Makefile
config.status:835: creating src/bzfs/Makefile
config.status:835: creating src/c-ares/Makefile
config.status:835: creating src/common/Makefile
config.status:835: creating src/date/Makefile
config.status:835: creating src/3D/Makefile
config.status:835: creating src/game/Makefile
config.status:835: creating src/geometry/Makefile
config.status:835: creating src/geometry/models/Makefile
config.status:835: creating src/geometry/models/tank/Makefile
config.status:835: creating src/mediafile/Makefile
config.status:835: creating src/net/Makefile
config.status:835: creating src/obstacle/Makefile
config.status:835: creating src/ogl/Makefile
config.status:835: creating src/platform/Makefile
config.status:835: creating src/platform/MacOSX/BZFlag-Info.plist
config.status:835: creating src/platform/MacOSX/Makefile
config.status:835: creating src/regex/Makefile
config.status:835: creating src/scene/Makefile
config.status:835: creating src/zlib/Makefile
config.status:835: creating tools/Makefile
config.status:835: creating tools/TextTool-W32/Makefile
config.status:835: creating tools/TextTool-W32/res/Makefile
config.status:835: creating tools/bzwtransform/Makefile
config.status:835: creating tools/modeltool/Makefile
config.status:835: creating tools/modeltool/vc71/Makefile
config.status:835: creating win32/Makefile
config.status:835: creating win32/VC6/Makefile
config.status:835: creating win32/VC71/Makefile
config.status:939: creating include/config.h
config.status:1155: include/config.h is unchanged
config.status:1335: executing depfiles commands
configure:12143: result:
configure:12145: result: BZFlag-2.0.3.20050526 with the following:
configure:12151: result: curses: -lcurses
configure:12155: result: no SDL!
configure:12165: result: bzadmin
configure:12169: result: no bzflag client binary!
## ---------------- ##
## Cache variables. ##
## ---------------- ##
ac_cv_build=sparc-sun-solaris2.10
ac_cv_build_alias=sparc-sun-solaris2.10
ac_cv_c_compiler_gnu=yes
ac_cv_c_const=yes
ac_cv_cxx_compiler_gnu=yes
ac_cv_env_CC_set=
ac_cv_env_CC_value=
ac_cv_env_CFLAGS_set=
ac_cv_env_CFLAGS_value=
ac_cv_env_CPPFLAGS_set=
ac_cv_env_CPPFLAGS_value=
ac_cv_env_CPP_set=
ac_cv_env_CPP_value=
ac_cv_env_CXXCPP_set=
ac_cv_env_CXXCPP_value=
ac_cv_env_CXXFLAGS_set=
ac_cv_env_CXXFLAGS_value=
ac_cv_env_CXX_set=
ac_cv_env_CXX_value=
ac_cv_env_LDFLAGS_set=
ac_cv_env_LDFLAGS_value=
ac_cv_env_build_alias_set=
ac_cv_env_build_alias_value=
ac_cv_env_host_alias_set=
ac_cv_env_host_alias_value=
ac_cv_env_target_alias_set=
ac_cv_env_target_alias_value=
ac_cv_exeext=
ac_cv_func_CGLGetCurrentContext=no
ac_cv_func_Sleep=no
ac_cv_func_WaitForSingleObject=no
ac_cv_func__stricmp=no
ac_cv_func__strnicmp=no
ac_cv_func__vsnprintf=no
ac_cv_func_atexit=yes
ac_cv_func_connect=no
ac_cv_func_gethostbyname=no
ac_cv_func_getrlimit=yes
ac_cv_func_glXGetCurrentContext=no
ac_cv_func_remove=yes
ac_cv_func_select=yes
ac_cv_func_shmat=yes
ac_cv_func_snooze=no
ac_cv_func_usleep=yes
ac_cv_func_vsnprintf=yes
ac_cv_func_wglGetCurrentContext=no
ac_cv_have_x='have_x=yes ac_x_includes= ac_x_libraries='
ac_cv_header_GL_glx_h=yes
ac_cv_header_SDL_SDL_h=no
ac_cv_header_X11_Xlib_h=yes
ac_cv_header_bstring_h=no
ac_cv_header_cstdio=yes
ac_cv_header_cstdlib=yes
ac_cv_header_cstring=yes
ac_cv_header_dsound_h=no
ac_cv_header_inttypes_h=yes
ac_cv_header_linux_input_h=no
ac_cv_header_memory_h=yes
ac_cv_header_stdc=yes
ac_cv_header_stdint_h=yes
ac_cv_header_stdlib_h=yes
ac_cv_header_string_h=yes
ac_cv_header_strings_h=yes
ac_cv_header_sys_param_h=yes
ac_cv_header_sys_stat_h=yes
ac_cv_header_sys_types_h=yes
ac_cv_header_unistd_h=yes
ac_cv_header_values_h=yes
ac_cv_host=sparc-sun-solaris2.10
ac_cv_host_alias=sparc-sun-solaris2.10
ac_cv_lib_ICE_IceConnectionNumber=yes
ac_cv_lib_Xext_XextAddDisplay=no
ac_cv_lib_bind_gethostent=no
ac_cv_lib_cares_ares_init=no
ac_cv_lib_m_acosf=yes
ac_cv_lib_m_asinf=yes
ac_cv_lib_m_atan2f=yes
ac_cv_lib_m_atanf=yes
ac_cv_lib_m_cosf=yes
ac_cv_lib_m_expf=yes
ac_cv_lib_m_fabsf=yes
ac_cv_lib_m_floorf=yes
ac_cv_lib_m_fmodf=yes
ac_cv_lib_m_hypotf=yes
ac_cv_lib_m_logf=yes
ac_cv_lib_m_powf=yes
ac_cv_lib_m_sinf=yes
ac_cv_lib_m_sqrtf=yes
ac_cv_lib_m_tanf=yes
ac_cv_lib_nsl_gethostbyname=yes
ac_cv_lib_socket_connect=yes
ac_cv_lib_socket_socket=yes
ac_cv_lib_z_compress=yes
ac_cv_objext=o
ac_cv_path_SDL_CONFIG=/usr/local/bin/sdl-config
ac_cv_path_install='/opt/csw/bin/ginstall -c'
ac_cv_prog_AR=ar
ac_cv_prog_AWK=gawk
ac_cv_prog_CPP='gcc -E'
ac_cv_prog_CXXCPP='g++ -E'
ac_cv_prog_HASPOD2MAN=yes
ac_cv_prog_HASWHOAMI=no
ac_cv_prog_ac_ct_CC=gcc
ac_cv_prog_ac_ct_CXX=g++
ac_cv_prog_ac_ct_RANLIB=ranlib
ac_cv_prog_ac_ct_WINDRES=:
ac_cv_prog_cc_g=yes
ac_cv_prog_cc_stdc=
ac_cv_prog_cxx_g=yes
ac_cv_prog_egrep=egrep
ac_cv_prog_make_make_set=yes
ac_cv_search_glBegin=no
ac_cv_search_gluScaleImage=no
ac_cv_target=sparc-sun-solaris2.10
ac_cv_target_alias=sparc-sun-solaris2.10
ac_cv_type_socklen_t=yes
am_cv_CC_dependencies_compiler_type=gcc3
am_cv_CXX_dependencies_compiler_type=gcc3
mp_cv_curses=yes
mp_cv_ncurses=no
my_cv_curl_vers=7.14.0
## ----------------- ##
## Output variables. ##
## ----------------- ##
ACLOCAL='${SHELL} /home/sears/src/bzflag/missing --run aclocal-1.8'
AMDEPBACKSLASH='\'
AMDEP_FALSE='#'
AMDEP_TRUE=''
AMTAR='${SHELL} /home/sears/src/bzflag/missing --run tar'
AR='ar'
AR_FLAGS=''
AUTOCONF='${SHELL} /home/sears/src/bzflag/missing --run autoconf'
AUTOHEADER='${SHELL} /home/sears/src/bzflag/missing --run autoheader'
AUTOMAKE='${SHELL} /home/sears/src/bzflag/missing --run automake-1.8'
AWK='gawk'
BEOS_FALSE=''
BEOS_TRUE='#'
BUGGY_MIPSPRO_FALSE=''
BUGGY_MIPSPRO_TRUE='#'
BUILDCARES_FALSE='#'
BUILDCARES_TRUE=''
BUILDZLIB_FALSE=''
BUILDZLIB_TRUE='#'
BUILD_REGEX_FALSE='#'
BUILD_REGEX_TRUE=''
BZADMIN_INCLUDED_FALSE='#'
BZADMIN_INCLUDED_TRUE=''
BZFLAG_VERSION='2.0.3'
CC='gcc'
CCACHE=''
CCDEPMODE='depmode=gcc3'
CFLAGS='-g -O2 -O'
CLIENT_INCLUDED_FALSE=''
CLIENT_INCLUDED_TRUE='#'
CONFIG=''
CPP='gcc -E'
CPPFLAGS=''
CURL_CFLAGS='-I/opt/csw/include'
CURL_LIBS='-L/opt/csw/lib/sparcv8 -lcurl -L/opt/csw/lib -L/opt/csw/lib -lidn -lssl -lcrypto -ldl -lsocket -lnsl -lz'
CURSES_LIB='-lcurses'
CXX='g++'
CXXCPP='g++ -E'
CXXDEPMODE='depmode=gcc3'
CXXFLAGS='-g -O2 -DBZ_BUILD_DATE=20050526 -O'
CYGPATH_W='echo'
DEBUG_FALSE=''
DEBUG_TRUE='#'
DEFS='-DHAVE_CONFIG_H'
DEPDIR='.deps'
ECHO_C=''
ECHO_N='-n'
ECHO_T=''
EGREP='egrep'
EXEEXT=''
GLIBS=' -lSM -lICE -lX11 -lresolv -laudio '
HASPOD2MAN='yes'
HASPOD2MAN_FALSE='#'
HASPOD2MAN_TRUE=''
HASWHOAMI='no'
HAVE_CURSES_FALSE='#'
HAVE_CURSES_TRUE=''
HAVE_KRB5_FALSE=''
HAVE_KRB5_TRUE='#'
HAVE_SDL_FALSE=''
HAVE_SDL_TRUE='#'
INSTALL_DATA='${INSTALL} -m 644'
INSTALL_DATA_DIR='/usr/local/share/bzflag'
INSTALL_PROGRAM='${INSTALL}'
INSTALL_SCRIPT='${INSTALL}'
INSTALL_STRIP_PROGRAM='${SHELL} $(install_sh) -c -s'
IRIX_FALSE=''
IRIX_TRUE='#'
KRB5_CFLAGS=''
KRB5_CONFIG='no'
KRB5_LIBS=''
LDFLAGS=' -L/usr/demo/SOUND/lib'
LIBDIR='$(top_srcdir)/lib'
LIBOBJS=''
LIBS='-lsocket -lm -lsocket -lnsl -lresolv'
LINUX_FALSE=''
LINUX_TRUE='#'
LN_S='ln -s'
LTLIBOBJS=''
MACOS_FALSE=''
MACOS_TRUE='#'
MAJOR_VERSION='2'
MAKEINFO='${SHELL} /home/sears/src/bzflag/missing --run makeinfo'
MINOR_VERSION='0'
OBJEXT='o'
PACKAGE='bzflag'
PACKAGE_BUGREPORT=''
PACKAGE_NAME=''
PACKAGE_STRING=''
PACKAGE_TARNAME=''
PACKAGE_VERSION=''
PATH_SEPARATOR=':'
PC_FALSE=''
PC_TRUE='#'
PPC_FALSE=''
PPC_TRUE='#'
RANLIB='ranlib'
SDL_CFLAGS=''
SDL_CONFIG='/usr/local/bin/sdl-config'
SDL_LIBS=''
SET_MAKE=''
SHELL='/bin/bash'
SOLARIS_FALSE='#'
SOLARIS_TRUE=''
STRIP=''
VERSION='2.0.3.20050526'
WIN32_FALSE=''
WIN32_TRUE='#'
WINDRES=':'
WINPORT=''
X_CFLAGS=''
X_EXTRA_LIBS='-lsocket -lnsl'
X_LIBS=''
X_PRE_LIBS=' -lSM -lICE'
ac_ct_CC='gcc'
ac_ct_CXX='g++'
ac_ct_RANLIB='ranlib'
ac_ct_STRIP=''
ac_ct_WINDRES=':'
am__fastdepCC_FALSE='#'
am__fastdepCC_TRUE=''
am__fastdepCXX_FALSE='#'
am__fastdepCXX_TRUE=''
am__include='include'
am__leading_dot='.'
am__quote=''
bindir='${exec_prefix}/bin'
build='sparc-sun-solaris2.10'
build_alias=''
build_cpu='sparc'
build_os='solaris2.10'
build_vendor='sun'
datadir='${prefix}/share'
desktopdir='/usr/local/share/applications'
exec_prefix='${prefix}'
host='sparc-sun-solaris2.10'
host_alias=''
host_cpu='sparc'
host_os='solaris2.10'
host_vendor='sun'
includedir='${prefix}/include'
infodir='${prefix}/info'
install_sh='/home/sears/src/bzflag/install-sh'
libdir='${exec_prefix}/lib'
libexecdir='${exec_prefix}/libexec'
localstatedir='${prefix}/var'
mandir='${prefix}/man'
mkdir_p='$(install_sh) -d'
oldincludedir='/usr/include'
prefix='/usr/local'
program_transform_name='s,x,x,'
sbindir='${exec_prefix}/sbin'
sharedstatedir='${prefix}/com'
sysconfdir='${prefix}/etc'
target='sparc-sun-solaris2.10'
target_alias=''
target_cpu='sparc'
target_os='solaris2.10'
target_vendor='sun'
## ----------- ##
## confdefs.h. ##
## ----------- ##
#define BUILD_REGEX 1
#define BZ_BUILD_OS "solaris2.10"
#define BZ_BUILD_USER "anonymous"
#define ETC_INET
#define HAVE_ACOSF 1
#define HAVE_ASINF 1
#define HAVE_ATAN2F 1
#define HAVE_ATANF 1
#define HAVE_ATEXIT 1
#define HAVE_COSF 1
#define HAVE_CSTDIO 1
#define HAVE_CSTDLIB 1
#define HAVE_CSTRING 1
#define HAVE_CURL 1
#define HAVE_CURSES_H
#define HAVE_EXPF 1
#define HAVE_FABSF 1
#define HAVE_FLOORF 1
#define HAVE_FMODF 1
#define HAVE_GETRLIMIT 1
#define HAVE_GL_GLX_H 1
#define HAVE_HYPOTF 1
#define HAVE_INTTYPES_H 1
#define HAVE_LIBM 1
#define HAVE_LIBSOCKET 1
#define HAVE_LOGF 1
#define HAVE_MEMORY_H 1
#define HAVE_POWF 1
#define HAVE_REGEX_H 1
#define HAVE_SELECT 1
#define HAVE_SINF 1
#define HAVE_SOCKLEN_T 1
#define HAVE_SQRTF 1
#define HAVE_STDINT_H 1
#define HAVE_STDINT_H 1
#define HAVE_STDLIB_H 1
#define HAVE_STD_COUNT 1
#define HAVE_STRINGS_H 1
#define HAVE_STRING_H 1
#define HAVE_SYS_PARAM_H 1
#define HAVE_SYS_STAT_H 1
#define HAVE_SYS_TYPES_H 1
#define HAVE_TANF 1
#define HAVE_UNISTD_H 1
#define HAVE_UNISTD_H 1
#define HAVE_USLEEP 1
#define HAVE_VALUES_H 1
#define HAVE_VSNPRINTF 1
#define HAVE_X11_XLIB_H 1
#define INSTALL_DATA_DIR "/usr/local/share/bzflag"
#define NDEBUG 1
#define PACKAGE "bzflag"
#define PACKAGE_BUGREPORT ""
#define PACKAGE_NAME ""
#define PACKAGE_STRING ""
#define PACKAGE_TARNAME ""
#define PACKAGE_VERSION ""
#define ROBOT 1
#define SNAPPING 1
#define STDC_HEADERS 1
#define SUN_OGL_NO_VERTEX_MACROS
#define VERSION "2.0.3.20050526"
#define _USE_BZ_API 1
#endif
#ifdef __cplusplus
extern "C" void std::exit (int) throw (); using std::exit;
configure: exit 0
sun$