All pastes #126745 Raw Edit

Miscellany

public text v1 · immutable
·published 2006-08-11 19:23 UTC
rendered paste body
g++ -o TestXPTCInvoke.o -c  -DOSTYPE=\"Linux2.6.17.6-1.x86.i686\" -DOSARCH=\"Linux\" -DBUILD_ID=0000000000  -I../../../../dist/include/xpcom -I../../../../dist/include/TestXPTC -I../../../../dist/include -I../../../../dist/include/nspr    -I../../../../dist/sdk/include    -fPIC   -fno-rtti -fno-exceptions -Wall -Wconversion -Wpointer-arith -Wcast-align -Woverloaded-virtual -Wsynth -Wno-ctor-dtor-privacy -Wno-non-virtual-dtor -Wno-long-long -pedantic -O2 -march=i686 -g -fshort-wchar -pthread -pipe  -DNDEBUG -DTRIMMED -O   -DMOZILLA_CLIENT -include ../../../../mozilla-config.h -Wp,-MD,.deps/TestXPTCInvoke.pp TestXPTCInvoke.cpp
TestXPTCInvoke.cpp: In function `int main()':
TestXPTCInvoke.cpp:902: warning: char format, void arg (arg 2)
TestXPTCInvoke.cpp: In function `void DoMultipleInheritenceTest()':
TestXPTCInvoke.cpp:1103: warning: void format, FooBarImpl arg (arg 2)
TestXPTCInvoke.cpp:1104: warning: void format, nsIFoo arg (arg 2)
TestXPTCInvoke.cpp:1105: warning: void format, nsIBar arg (arg 2)
TestXPTCInvoke.cpp: In function `void DoMultipleInheritenceTest2()':
TestXPTCInvoke.cpp:1273: warning: void format, FooBarImpl2 arg (arg 2)
TestXPTCInvoke.cpp:1274: warning: void format, nsIFoo2 arg (arg 2)
TestXPTCInvoke.cpp:1275: warning: void format, nsIBar2 arg (arg 2)
TestXPTCInvoke.cpp: At global scope:
TestXPTCInvoke.cpp:1320: warning: 'void DoSpeedTest()' defined but not used
g++   -fno-rtti -fno-exceptions -Wall -Wconversion -Wpointer-arith -Wcast-align -Woverloaded-virtual -Wsynth -Wno-ctor-dtor-privacy -Wno-non-virtual-dtor -Wno-long-long -pedantic -O2 -march=i686 -g -fshort-wchar -pthread -pipe  -DNDEBUG -DTRIMMED -O -o TestXPTCInvoke TestXPTCInvoke.o  -g   -L../../../../dist/bin -L../../../../dist/lib -L../../../../dist/bin -Wl,-rpath-link,../../../../dist/bin -lxpcom -lxul  -L../../../../dist/lib -lplds4 -lplc4 -lnspr4 -lpthread -ldl  -ldl -lm
../../../../dist/bin/libxul.so: undefined reference to `pango_xft_get_font_map'
collect2: ld returned 1 exit status
make[3]: *** [TestXPTCInvoke] Error 1
make[3]: Leaving directory `/home/ken/conary/build/xulrunner/mozilla/xpcom/reflect/xptcall/tests'
make[3]: Entering directory `/home/ken/conary/build/xulrunner/mozilla/xpcom/proxy/tests'
proxytests.cpp
g++ -o proxytests.o -c  -DMOZILLA_INTERNAL_API -DOSTYPE=\"Linux2.6.17.6-1.x86.i686\" -DOSARCH=\"Linux\" -DBUILD_ID=0000000000  -I../../../dist/include/xpcom -I../../../dist/include/xpcom_tests -I../../../dist/include -I../../../dist/include/nspr       -fPIC   -fno-rtti -fno-exceptions -Wall -Wconversion -Wpointer-arith -Wcast-align -Woverloaded-virtual -Wsynth -Wno-ctor-dtor-privacy -Wno-non-virtual-dtor -Wno-long-long -pedantic -O2 -march=i686 -g -fshort-wchar -pthread -pipe  -DNDEBUG -DTRIMMED -O   -DMOZILLA_CLIENT -include ../../../mozilla-config.h -Wp,-MD,.deps/proxytests.pp proxytests.cpp
g++   -fno-rtti -fno-exceptions -Wall -Wconversion -Wpointer-arith -Wcast-align -Woverloaded-virtual -Wsynth -Wno-ctor-dtor-privacy -Wno-non-virtual-dtor -Wno-long-long -pedantic -O2 -march=i686 -g -fshort-wchar -pthread -pipe  -DNDEBUG -DTRIMMED -O -o proxytests proxytests.o  -g   -L../../../dist/bin -L../../../dist/lib -L../../../dist/bin -Wl,-rpath-link,../../../dist/bin -lxpcom -lxul  -L../../../dist/lib -lplds4 -lplc4 -lnspr4 -lpthread -ldl  -ldl -lm
../../../dist/bin/libxul.so: undefined reference to `pango_xft_get_font_map'
collect2: ld returned 1 exit status
make[3]: *** [proxytests] Error 1
make[3]: Leaving directory `/home/ken/conary/build/xulrunner/mozilla/xpcom/proxy/tests'
make[2]: *** [tools] Error 2
make[2]: Leaving directory `/home/ken/conary/build/xulrunner/mozilla/xpcom'
make[1]: *** [tier_50] Error 2
make[1]: Leaving directory `/home/ken/conary/build/xulrunner/mozilla'
make: *** [default] Error 2
error: Shell command "cd /home/ken/conary/build/xulrunner/mozilla/; CFLAGS="-O2 -march=i686 -g" CXXFLAGS="-O2 -march=i686 -g " CPPFLAGS="" CLASSPATH=""  LDFLAGS="-g" CC=gcc CXX=g++  make    " exited with exit code 2
/var/tmp/temp-xulrunner-5fRuxn.recipe:26: RuntimeError: Shell command "cd /home/ken/conary/build/xulrunner/mozilla/; CFLAGS="-O2 -march=i686 -g" CXXFLAGS="-O2 -march=i686 -g " CPPFLAGS="" CLASSPATH=""  LDFLAGS="-g" CC=gcc CXX=g++  make    " exited with exit code 2