All pastes #1258908 Raw Edit

Someone

public text v1 · immutable
#1258908 ·published 2008-11-17 05:58 UTC
rendered paste body
 * Determining the location of the kernel source code
 * Found kernel source directory:
 *     /usr/src/linux
 * Found kernel object directory:
 *     /lib/modules/2.6.27-gentoo-r2/build
 * Found sources for kernel version:
 *     2.6.27-gentoo-r2
>>> Unpacking source...
Warning: target directory exists /var/tmp/portage/x11-drivers/ati-drivers-8.542/work
Verifying archive integrity... All good.
Uncompressing ATI Proprietary Linux Driver-8.542...........................................................................................................................................................................................................................................................................................................................................................................................................................................................................................................................................................................................................................................................................................................................................................................................................................................
 * Applying ati-powermode-opt-path-2.patch ...
  [ ok ]
 * Applying ati-drivers-2.6.27.patch ...
  [ ok ]
 * Converting 2.6.x/Makefile to use M= instead of SUBDIRS= ...
  [ ok ]
>>> Unpacking ./../common/usr/src/ati/fglrx_sample_source.tgz to /var/tmp/portage/x11-drivers/ati-drivers-8.542/work/extra
>>> Source unpacked.
>>> Compiling source in /var/tmp/portage/x11-drivers/ati-drivers-8.542/work ...
 * Preparing fglrx module
make -C /usr/src/linux M=/var/tmp/portage/x11-drivers/ati-drivers-8.542/work/common/lib/modules/fglrx/build_mod/2.6.x modules
make[1]: Entering directory `/usr/src/linux-2.6.27-gentoo-r2'
  CC [M]  /var/tmp/portage/x11-drivers/ati-drivers-8.542/work/common/lib/modules/fglrx/build_mod/2.6.x/firegl_public.o
  CC [M]  /var/tmp/portage/x11-drivers/ati-drivers-8.542/work/common/lib/modules/fglrx/build_mod/2.6.x/kcl_io.o
  CC [M]  /var/tmp/portage/x11-drivers/ati-drivers-8.542/work/common/lib/modules/fglrx/build_mod/2.6.x/kcl_pci.o
/var/tmp/portage/x11-drivers/ati-drivers-8.542/work/common/lib/modules/fglrx/build_mod/2.6.x/firegl_public.c: In function ‘__ke_vm_phys_addr_str’:
/var/tmp/portage/x11-drivers/ati-drivers-8.542/work/common/lib/modules/fglrx/build_mod/2.6.x/firegl_public.c:3528: warning: return makes pointer from integer without a cast
/var/tmp/portage/x11-drivers/ati-drivers-8.542/work/common/lib/modules/fglrx/build_mod/2.6.x/firegl_public.c:3529: warning: return makes pointer from integer without a cast
/var/tmp/portage/x11-drivers/ati-drivers-8.542/work/common/lib/modules/fglrx/build_mod/2.6.x/firegl_public.c:3530: warning: return makes pointer from integer without a cast
/var/tmp/portage/x11-drivers/ati-drivers-8.542/work/common/lib/modules/fglrx/build_mod/2.6.x/firegl_public.c:3532: warning: return makes pointer from integer without a cast
/var/tmp/portage/x11-drivers/ati-drivers-8.542/work/common/lib/modules/fglrx/build_mod/2.6.x/firegl_public.c: At top level:
/var/tmp/portage/x11-drivers/ati-drivers-8.542/work/common/lib/modules/fglrx/build_mod/2.6.x/firegl_public.c:5780: warning: initialization from incompatible pointer type
/var/tmp/portage/x11-drivers/ati-drivers-8.542/work/common/lib/modules/fglrx/build_mod/2.6.x/firegl_public.c:5806: warning: initialization from incompatible pointer type
  CC [M]  /var/tmp/portage/x11-drivers/ati-drivers-8.542/work/common/lib/modules/fglrx/build_mod/2.6.x/kcl_agp.o
  LD [M]  /var/tmp/portage/x11-drivers/ati-drivers-8.542/work/common/lib/modules/fglrx/build_mod/2.6.x/fglrx.o
  Building modules, stage 2.
  MODPOST 1 modules
WARNING: modpost: module fglrx.ko uses symbol 'init_mm' marked UNUSED
  CC      /var/tmp/portage/x11-drivers/ati-drivers-8.542/work/common/lib/modules/fglrx/build_mod/2.6.x/fglrx.mod.o
  LD [M]  /var/tmp/portage/x11-drivers/ati-drivers-8.542/work/common/lib/modules/fglrx/build_mod/2.6.x/fglrx.ko
make[1]: Leaving directory `/usr/src/linux-2.6.27-gentoo-r2'
 * Building fgl_glxgears
In file included from fgl_glxgears.c:59:
/usr/include/GL/glu.h:37:19: error: GL/gl.h: No such file or directory
In file included from fgl_glxgears.c:59:
/usr/include/GL/glu.h:280: error: expected ‘=’, ‘,’, ‘;’, ‘asm’ or ‘__attribute__’ before ‘gluBuild1DMipmapLevels’
/usr/include/GL/glu.h:281: error: expected ‘=’, ‘,’, ‘;’, ‘asm’ or ‘__attribute__’ before ‘gluBuild1DMipmaps’
/usr/include/GL/glu.h:282: error: expected ‘=’, ‘,’, ‘;’, ‘asm’ or ‘__attribute__’ before ‘gluBuild2DMipmapLevels’
/usr/include/GL/glu.h:283: error: expected ‘=’, ‘,’, ‘;’, ‘asm’ or ‘__attribute__’ before ‘gluBuild2DMipmaps’
/usr/include/GL/glu.h:284: error: expected ‘=’, ‘,’, ‘;’, ‘asm’ or ‘__attribute__’ before ‘gluBuild3DMipmapLevels’
/usr/include/GL/glu.h:285: error: expected ‘=’, ‘,’, ‘;’, ‘asm’ or ‘__attribute__’ before ‘gluBuild3DMipmaps’
/usr/include/GL/glu.h:286: error: expected ‘=’, ‘,’, ‘;’, ‘asm’ or ‘__attribute__’ before ‘gluCheckExtension’
/usr/include/GL/glu.h:287: error: expected declaration specifiers or ‘...’ before ‘GLdouble’
/usr/include/GL/glu.h:287: error: expected declaration specifiers or ‘...’ before ‘GLdouble’
/usr/include/GL/glu.h:287: error: expected declaration specifiers or ‘...’ before ‘GLdouble’
/usr/include/GL/glu.h:287: error: expected declaration specifiers or ‘...’ before ‘GLint’
/usr/include/GL/glu.h:287: error: expected declaration specifiers or ‘...’ before ‘GLint’
/usr/include/GL/glu.h:291: error: expected declaration specifiers or ‘...’ before ‘GLdouble’
/usr/include/GL/glu.h:291: error: expected declaration specifiers or ‘...’ before ‘GLdouble’
/usr/include/GL/glu.h:291: error: expected declaration specifiers or ‘...’ before ‘GLint’
/usr/include/GL/glu.h:291: error: expected declaration specifiers or ‘...’ before ‘GLint’
/usr/include/GL/glu.h:296: error: expected ‘=’, ‘,’, ‘;’, ‘asm’ or ‘__attribute__’ before ‘*’ token
/usr/include/GL/glu.h:297: error: expected declaration specifiers or ‘...’ before ‘GLenum’
/usr/include/GL/glu.h:297: error: expected declaration specifiers or ‘...’ before ‘GLfloat’
/usr/include/GL/glu.h:298: error: expected ‘=’, ‘,’, ‘;’, ‘asm’ or ‘__attribute__’ before ‘*’ token
/usr/include/GL/glu.h:299: error: expected declaration specifiers or ‘...’ before ‘GLenum’
/usr/include/GL/glu.h:299: error: expected declaration specifiers or ‘...’ before ‘GLdouble’
/usr/include/GL/glu.h:300: error: expected ‘;’, ‘,’ or ‘)’ before ‘*’ token
/usr/include/GL/glu.h:301: error: expected ‘)’ before ‘eyeX’
/usr/include/GL/glu.h:305: error: expected declaration specifiers or ‘...’ before ‘GLenum’
/usr/include/GL/glu.h:306: error: expected declaration specifiers or ‘...’ before ‘GLenum’
/usr/include/GL/glu.h:307: error: expected declaration specifiers or ‘...’ before ‘GLvoid’
/usr/include/GL/glu.h:308: error: expected declaration specifiers or ‘...’ before ‘GLvoid’
/usr/include/GL/glu.h:309: error: expected declaration specifiers or ‘...’ before ‘GLint’
/usr/include/GL/glu.h:309: error: expected declaration specifiers or ‘...’ before ‘GLfloat’
/usr/include/GL/glu.h:309: error: expected declaration specifiers or ‘...’ before ‘GLint’
/usr/include/GL/glu.h:309: error: expected declaration specifiers or ‘...’ before ‘GLfloat’
/usr/include/GL/glu.h:309: error: expected declaration specifiers or ‘...’ before ‘GLint’
/usr/include/GL/glu.h:309: error: expected declaration specifiers or ‘...’ before ‘GLenum’
/usr/include/GL/glu.h:310: error: expected declaration specifiers or ‘...’ before ‘GLenum’
/usr/include/GL/glu.h:310: error: expected declaration specifiers or ‘...’ before ‘GLfloat’
/usr/include/GL/glu.h:311: error: expected declaration specifiers or ‘...’ before ‘GLint’
/usr/include/GL/glu.h:311: error: expected declaration specifiers or ‘...’ before ‘GLfloat’
/usr/include/GL/glu.h:311: error: expected declaration specifiers or ‘...’ before ‘GLint’
/usr/include/GL/glu.h:311: error: expected declaration specifiers or ‘...’ before ‘GLfloat’
/usr/include/GL/glu.h:311: error: expected declaration specifiers or ‘...’ before ‘GLint’
/usr/include/GL/glu.h:311: error: expected declaration specifiers or ‘...’ before ‘GLint’
/usr/include/GL/glu.h:311: error: expected declaration specifiers or ‘...’ before ‘GLfloat’
/usr/include/GL/glu.h:311: error: expected declaration specifiers or ‘...’ before ‘GLint’
/usr/include/GL/glu.h:311: error: expected declaration specifiers or ‘...’ before ‘GLint’
/usr/include/GL/glu.h:311: error: expected declaration specifiers or ‘...’ before ‘GLenum’
/usr/include/GL/glu.h:312: error: expected ‘)’ before ‘left’
/usr/include/GL/glu.h:313: error: expected declaration specifiers or ‘...’ before ‘GLdouble’
/usr/include/GL/glu.h:313: error: expected declaration specifiers or ‘...’ before ‘GLdouble’
/usr/include/GL/glu.h:313: error: expected declaration specifiers or ‘...’ before ‘GLint’
/usr/include/GL/glu.h:313: error: expected declaration specifiers or ‘...’ before ‘GLint’
/usr/include/GL/glu.h:313: error: expected declaration specifiers or ‘...’ before ‘GLdouble’
/usr/include/GL/glu.h:313: error: expected declaration specifiers or ‘...’ before ‘GLdouble’
/usr/include/GL/glu.h:314: error: expected ‘)’ before ‘fovy’
/usr/include/GL/glu.h:315: error: expected ‘)’ before ‘x’
/usr/include/GL/glu.h:316: error: expected ‘=’, ‘,’, ‘;’, ‘asm’ or ‘__attribute__’ before ‘gluProject’
/usr/include/GL/glu.h:317: error: expected declaration specifiers or ‘...’ before ‘GLint’
/usr/include/GL/glu.h:317: error: expected declaration specifiers or ‘...’ before ‘GLfloat’
/usr/include/GL/glu.h:317: error: expected declaration specifiers or ‘...’ before ‘GLint’
/usr/include/GL/glu.h:317: error: expected declaration specifiers or ‘...’ before ‘GLenum’
/usr/include/GL/glu.h:318: error: expected declaration specifiers or ‘...’ before ‘GLenum’
/usr/include/GL/glu.h:319: error: expected declaration specifiers or ‘...’ before ‘GLenum’
/usr/include/GL/glu.h:320: error: expected declaration specifiers or ‘...’ before ‘GLenum’
/usr/include/GL/glu.h:321: error: expected declaration specifiers or ‘...’ before ‘GLenum’
/usr/include/GL/glu.h:322: error: expected declaration specifiers or ‘...’ before ‘GLboolean’
/usr/include/GL/glu.h:323: error: expected ‘=’, ‘,’, ‘;’, ‘asm’ or ‘__attribute__’ before ‘gluScaleImage’
/usr/include/GL/glu.h:324: error: expected declaration specifiers or ‘...’ before ‘GLdouble’
/usr/include/GL/glu.h:324: error: expected declaration specifiers or ‘...’ before ‘GLint’
/usr/include/GL/glu.h:324: error: expected declaration specifiers or ‘...’ before ‘GLint’
/usr/include/GL/glu.h:326: error: expected declaration specifiers or ‘...’ before ‘GLvoid’
/usr/include/GL/glu.h:327: error: expected declaration specifiers or ‘...’ before ‘GLenum’
/usr/include/GL/glu.h:330: error: expected declaration specifiers or ‘...’ before ‘GLdouble’
/usr/include/GL/glu.h:330: error: expected declaration specifiers or ‘...’ before ‘GLdouble’
/usr/include/GL/glu.h:330: error: expected declaration specifiers or ‘...’ before ‘GLdouble’
/usr/include/GL/glu.h:331: error: expected declaration specifiers or ‘...’ before ‘GLenum’
/usr/include/GL/glu.h:331: error: expected declaration specifiers or ‘...’ before ‘GLdouble’
/usr/include/GL/glu.h:332: error: expected declaration specifiers or ‘...’ before ‘GLdouble’
/usr/include/GL/glu.h:332: error: expected declaration specifiers or ‘...’ before ‘GLvoid’
/usr/include/GL/glu.h:333: error: expected ‘=’, ‘,’, ‘;’, ‘asm’ or ‘__attribute__’ before ‘gluUnProject’
/usr/include/GL/glu.h:334: error: expected ‘=’, ‘,’, ‘;’, ‘asm’ or ‘__attribute__’ before ‘gluUnProject4’
fgl_glxgears.c:64: error: expected ‘;’, ‘,’ or ‘)’ before ‘*’ token
fgl_glxgears.c:67:20: error: GL/glx.h: No such file or directory
In file included from fgl_glxgears.c:70:
/var/tmp/portage/x11-drivers/ati-drivers-8.542/work/common/usr/include/GL/glATI.h:65: error: expected ‘)’ before ‘*’ token
/var/tmp/portage/x11-drivers/ati-drivers-8.542/work/common/usr/include/GL/glATI.h:68: error: expected ‘)’ before ‘*’ token
/var/tmp/portage/x11-drivers/ati-drivers-8.542/work/common/usr/include/GL/glATI.h:72: error: expected ‘)’ before ‘*’ token
/var/tmp/portage/x11-drivers/ati-drivers-8.542/work/common/usr/include/GL/glATI.h:130: error: expected ‘)’ before ‘*’ token
/var/tmp/portage/x11-drivers/ati-drivers-8.542/work/common/usr/include/GL/glATI.h:157: error: expected ‘)’ before ‘*’ token
/var/tmp/portage/x11-drivers/ati-drivers-8.542/work/common/usr/include/GL/glATI.h:161: error: expected ‘)’ before ‘*’ token
/var/tmp/portage/x11-drivers/ati-drivers-8.542/work/common/usr/include/GL/glATI.h:165: error: expected ‘)’ before ‘*’ token
/var/tmp/portage/x11-drivers/ati-drivers-8.542/work/common/usr/include/GL/glATI.h:170: error: expected ‘)’ before ‘*’ token
/var/tmp/portage/x11-drivers/ati-drivers-8.542/work/common/usr/include/GL/glATI.h:174: error: expected ‘)’ before ‘*’ token
/var/tmp/portage/x11-drivers/ati-drivers-8.542/work/common/usr/include/GL/glATI.h:179: error: expected ‘)’ before ‘*’ token
/var/tmp/portage/x11-drivers/ati-drivers-8.542/work/common/usr/include/GL/glATI.h:185: error: expected ‘)’ before ‘*’ token
/var/tmp/portage/x11-drivers/ati-drivers-8.542/work/common/usr/include/GL/glATI.h:217: error: expected ‘)’ before ‘*’ token
/var/tmp/portage/x11-drivers/ati-drivers-8.542/work/common/usr/include/GL/glATI.h:258: error: expected ‘)’ before ‘*’ token
/var/tmp/portage/x11-drivers/ati-drivers-8.542/work/common/usr/include/GL/glATI.h:259: error: expected ‘)’ before ‘*’ token
/var/tmp/portage/x11-drivers/ati-drivers-8.542/work/common/usr/include/GL/glATI.h:260: error: expected ‘)’ before ‘*’ token
/var/tmp/portage/x11-drivers/ati-drivers-8.542/work/common/usr/include/GL/glATI.h:261: error: expected ‘)’ before ‘*’ token
/var/tmp/portage/x11-drivers/ati-drivers-8.542/work/common/usr/include/GL/glATI.h:262: error: expected ‘)’ before ‘*’ token
/var/tmp/portage/x11-drivers/ati-drivers-8.542/work/common/usr/include/GL/glATI.h:263: error: expected ‘)’ before ‘*’ token
/var/tmp/portage/x11-drivers/ati-drivers-8.542/work/common/usr/include/GL/glATI.h:264: error: expected ‘)’ before ‘*’ token
/var/tmp/portage/x11-drivers/ati-drivers-8.542/work/common/usr/include/GL/glATI.h:265: error: expected ‘)’ before ‘*’ token
/var/tmp/portage/x11-drivers/ati-drivers-8.542/work/common/usr/include/GL/glATI.h:266: error: expected ‘)’ before ‘*’ token
/var/tmp/portage/x11-drivers/ati-drivers-8.542/work/common/usr/include/GL/glATI.h:267: error: expected ‘)’ before ‘*’ token
/var/tmp/portage/x11-drivers/ati-drivers-8.542/work/common/usr/include/GL/glATI.h:268: error: expected ‘)’ before ‘*’ token
/var/tmp/portage/x11-drivers/ati-drivers-8.542/work/common/usr/include/GL/glATI.h:269: error: expected ‘)’ before ‘*’ token
/var/tmp/portage/x11-drivers/ati-drivers-8.542/work/common/usr/include/GL/glATI.h:270: error: expected ‘)’ before ‘*’ token
/var/tmp/portage/x11-drivers/ati-drivers-8.542/work/common/usr/include/GL/glATI.h:271: error: expected ‘)’ before ‘*’ token
/var/tmp/portage/x11-drivers/ati-drivers-8.542/work/common/usr/include/GL/glATI.h:272: error: expected ‘)’ before ‘*’ token
/var/tmp/portage/x11-drivers/ati-drivers-8.542/work/common/usr/include/GL/glATI.h:273: error: expected ‘)’ before ‘*’ token
/var/tmp/portage/x11-drivers/ati-drivers-8.542/work/common/usr/include/GL/glATI.h:274: error: expected ‘)’ before ‘*’ token
/var/tmp/portage/x11-drivers/ati-drivers-8.542/work/common/usr/include/GL/glATI.h:275: error: expected ‘)’ before ‘*’ token
/var/tmp/portage/x11-drivers/ati-drivers-8.542/work/common/usr/include/GL/glATI.h:276: error: expected ‘)’ before ‘*’ token
/var/tmp/portage/x11-drivers/ati-drivers-8.542/work/common/usr/include/GL/glATI.h:277: error: expected ‘)’ before ‘*’ token
/var/tmp/portage/x11-drivers/ati-drivers-8.542/work/common/usr/include/GL/glATI.h:278: error: expected ‘)’ before ‘*’ token
/var/tmp/portage/x11-drivers/ati-drivers-8.542/work/common/usr/include/GL/glATI.h:279: error: expected ‘)’ before ‘*’ token
/var/tmp/portage/x11-drivers/ati-drivers-8.542/work/common/usr/include/GL/glATI.h:280: error: expected ‘)’ before ‘*’ token
/var/tmp/portage/x11-drivers/ati-drivers-8.542/work/common/usr/include/GL/glATI.h:281: error: expected ‘)’ before ‘*’ token
/var/tmp/portage/x11-drivers/ati-drivers-8.542/work/common/usr/include/GL/glATI.h:282: error: expected ‘)’ before ‘*’ token
/var/tmp/portage/x11-drivers/ati-drivers-8.542/work/common/usr/include/GL/glATI.h:283: error: expected ‘)’ before ‘*’ token
/var/tmp/portage/x11-drivers/ati-drivers-8.542/work/common/usr/include/GL/glATI.h:284: error: expected ‘)’ before ‘*’ token
/var/tmp/portage/x11-drivers/ati-drivers-8.542/work/common/usr/include/GL/glATI.h:285: error: expected ‘)’ before ‘*’ token
/var/tmp/portage/x11-drivers/ati-drivers-8.542/work/common/usr/include/GL/glATI.h:286: error: expected ‘)’ before ‘*’ token
/var/tmp/portage/x11-drivers/ati-drivers-8.542/work/common/usr/include/GL/glATI.h:287: error: expected ‘)’ before ‘*’ token
/var/tmp/portage/x11-drivers/ati-drivers-8.542/work/common/usr/include/GL/glATI.h:288: error: expected ‘)’ before ‘*’ token
/var/tmp/portage/x11-drivers/ati-drivers-8.542/work/common/usr/include/GL/glATI.h:289: error: expected ‘)’ before ‘*’ token
/var/tmp/portage/x11-drivers/ati-drivers-8.542/work/common/usr/include/GL/glATI.h:290: error: expected ‘)’ before ‘*’ token
/var/tmp/portage/x11-drivers/ati-drivers-8.542/work/common/usr/include/GL/glATI.h:291: error: expected ‘)’ before ‘*’ token
/var/tmp/portage/x11-drivers/ati-drivers-8.542/work/common/usr/include/GL/glATI.h:338: error: expected ‘)’ before ‘*’ token
/var/tmp/portage/x11-drivers/ati-drivers-8.542/work/common/usr/include/GL/glATI.h:339: error: expected ‘)’ before ‘*’ token
/var/tmp/portage/x11-drivers/ati-drivers-8.542/work/common/usr/include/GL/glATI.h:340: error: expected ‘)’ before ‘*’ token
/var/tmp/portage/x11-drivers/ati-drivers-8.542/work/common/usr/include/GL/glATI.h:341: error: expected ‘)’ before ‘*’ token
/var/tmp/portage/x11-drivers/ati-drivers-8.542/work/common/usr/include/GL/glATI.h:367: error: expected ‘)’ before ‘*’ token
/var/tmp/portage/x11-drivers/ati-drivers-8.542/work/common/usr/include/GL/glATI.h:368: error: expected ‘)’ before ‘*’ token
/var/tmp/portage/x11-drivers/ati-drivers-8.542/work/common/usr/include/GL/glATI.h:394: error: expected ‘)’ before ‘*’ token
/var/tmp/portage/x11-drivers/ati-drivers-8.542/work/common/usr/include/GL/glATI.h:395: error: expected ‘)’ before ‘*’ token
/var/tmp/portage/x11-drivers/ati-drivers-8.542/work/common/usr/include/GL/glATI.h:396: error: expected ‘)’ before ‘*’ token
/var/tmp/portage/x11-drivers/ati-drivers-8.542/work/common/usr/include/GL/glATI.h:397: error: expected ‘)’ before ‘*’ token
/var/tmp/portage/x11-drivers/ati-drivers-8.542/work/common/usr/include/GL/glATI.h:398: error: expected ‘)’ before ‘*’ token
/var/tmp/portage/x11-drivers/ati-drivers-8.542/work/common/usr/include/GL/glATI.h:403: error: expected ‘)’ before ‘*’ token
/var/tmp/portage/x11-drivers/ati-drivers-8.542/work/common/usr/include/GL/glATI.h:404: error: expected ‘)’ before ‘*’ token
/var/tmp/portage/x11-drivers/ati-drivers-8.542/work/common/usr/include/GL/glATI.h:414: error: expected ‘)’ before ‘*’ token
/var/tmp/portage/x11-drivers/ati-drivers-8.542/work/common/usr/include/GL/glATI.h:415: error: expected ‘)’ before ‘*’ token
/var/tmp/portage/x11-drivers/ati-drivers-8.542/work/common/usr/include/GL/glATI.h:416: error: expected ‘)’ before ‘*’ token
/var/tmp/portage/x11-drivers/ati-drivers-8.542/work/common/usr/include/GL/glATI.h:417: error: expected ‘)’ before ‘*’ token
/var/tmp/portage/x11-drivers/ati-drivers-8.542/work/common/usr/include/GL/glATI.h:430: error: expected ‘)’ before ‘*’ token
/var/tmp/portage/x11-drivers/ati-drivers-8.542/work/common/usr/include/GL/glATI.h:431: error: expected ‘)’ before ‘*’ token
/var/tmp/portage/x11-drivers/ati-drivers-8.542/work/common/usr/include/GL/glATI.h:432: error: expected ‘)’ before ‘*’ token
/var/tmp/portage/x11-drivers/ati-drivers-8.542/work/common/usr/include/GL/glATI.h:433: error: expected ‘)’ before ‘*’ token
/var/tmp/portage/x11-drivers/ati-drivers-8.542/work/common/usr/include/GL/glATI.h:434: error: expected ‘)’ before ‘*’ token
/var/tmp/portage/x11-drivers/ati-drivers-8.542/work/common/usr/include/GL/glATI.h:435: error: expected ‘)’ before ‘*’ token
/var/tmp/portage/x11-drivers/ati-drivers-8.542/work/common/usr/include/GL/glATI.h:436: error: expected ‘)’ before ‘*’ token
/var/tmp/portage/x11-drivers/ati-drivers-8.542/work/common/usr/include/GL/glATI.h:437: error: expected ‘)’ before ‘*’ token
/var/tmp/portage/x11-drivers/ati-drivers-8.542/work/common/usr/include/GL/glATI.h:438: error: expected ‘)’ before ‘*’ token
/var/tmp/portage/x11-drivers/ati-drivers-8.542/work/common/usr/include/GL/glATI.h:439: error: expected ‘)’ before ‘*’ token
/var/tmp/portage/x11-drivers/ati-drivers-8.542/work/common/usr/include/GL/glATI.h:440: error: expected ‘)’ before ‘*’ token
/var/tmp/portage/x11-drivers/ati-drivers-8.542/work/common/usr/include/GL/glATI.h:441: error: expected ‘)’ before ‘*’ token
/var/tmp/portage/x11-drivers/ati-drivers-8.542/work/common/usr/include/GL/glATI.h:442: error: expected ‘)’ before ‘*’ token
/var/tmp/portage/x11-drivers/ati-drivers-8.542/work/common/usr/include/GL/glATI.h:443: error: expected ‘)’ before ‘*’ token
/var/tmp/portage/x11-drivers/ati-drivers-8.542/work/common/usr/include/GL/glATI.h:444: error: expected ‘)’ before ‘*’ token
/var/tmp/portage/x11-drivers/ati-drivers-8.542/work/common/usr/include/GL/glATI.h:445: error: expected ‘)’ before ‘*’ token
/var/tmp/portage/x11-drivers/ati-drivers-8.542/work/common/usr/include/GL/glATI.h:446: error: expected ‘)’ before ‘*’ token
/var/tmp/portage/x11-drivers/ati-drivers-8.542/work/common/usr/include/GL/glATI.h:456: error: expected ‘)’ before ‘*’ token
/var/tmp/portage/x11-drivers/ati-drivers-8.542/work/common/usr/include/GL/glATI.h:479: error: expected ‘)’ before ‘*’ token
/var/tmp/portage/x11-drivers/ati-drivers-8.542/work/common/usr/include/GL/glATI.h:480: error: expected ‘)’ before ‘*’ token
/var/tmp/portage/x11-drivers/ati-drivers-8.542/work/common/usr/include/GL/glATI.h:481: error: expected ‘)’ before ‘*’ token
/var/tmp/portage/x11-drivers/ati-drivers-8.542/work/common/usr/include/GL/glATI.h:482: error: expected ‘)’ before ‘*’ token
/var/tmp/portage/x11-drivers/ati-drivers-8.542/work/common/usr/include/GL/glATI.h:483: error: expected ‘)’ before ‘*’ token
/var/tmp/portage/x11-drivers/ati-drivers-8.542/work/common/usr/include/GL/glATI.h:484: error: expected ‘)’ before ‘*’ token
/var/tmp/portage/x11-drivers/ati-drivers-8.542/work/common/usr/include/GL/glATI.h:485: error: expected ‘)’ before ‘*’ token
/var/tmp/portage/x11-drivers/ati-drivers-8.542/work/common/usr/include/GL/glATI.h:486: error: expected ‘)’ before ‘*’ token
/var/tmp/portage/x11-drivers/ati-drivers-8.542/work/common/usr/include/GL/glATI.h:487: error: expected ‘)’ before ‘*’ token
/var/tmp/portage/x11-drivers/ati-drivers-8.542/work/common/usr/include/GL/glATI.h:488: error: expected ‘)’ before ‘*’ token
/var/tmp/portage/x11-drivers/ati-drivers-8.542/work/common/usr/include/GL/glATI.h:489: error: expected ‘)’ before ‘*’ token
/var/tmp/portage/x11-drivers/ati-drivers-8.542/work/common/usr/include/GL/glATI.h:490: error: expected ‘)’ before ‘*’ token
/var/tmp/portage/x11-drivers/ati-drivers-8.542/work/common/usr/include/GL/glATI.h:491: error: expected ‘)’ before ‘*’ token
/var/tmp/portage/x11-drivers/ati-drivers-8.542/work/common/usr/include/GL/glATI.h:492: error: expected ‘)’ before ‘*’ token
/var/tmp/portage/x11-drivers/ati-drivers-8.542/work/common/usr/include/GL/glATI.h:493: error: expected ‘)’ before ‘*’ token
/var/tmp/portage/x11-drivers/ati-drivers-8.542/work/common/usr/include/GL/glATI.h:494: error: expected ‘)’ before ‘*’ token
/var/tmp/portage/x11-drivers/ati-drivers-8.542/work/common/usr/include/GL/glATI.h:616: error: expected ‘)’ before ‘*’ token
/var/tmp/portage/x11-drivers/ati-drivers-8.542/work/common/usr/include/GL/glATI.h:617: error: expected ‘)’ before ‘*’ token
/var/tmp/portage/x11-drivers/ati-drivers-8.542/work/common/usr/include/GL/glATI.h:618: error: expected ‘)’ before ‘*’ token
/var/tmp/portage/x11-drivers/ati-drivers-8.542/work/common/usr/include/GL/glATI.h:619: error: expected ‘)’ before ‘*’ token
/var/tmp/portage/x11-drivers/ati-drivers-8.542/work/common/usr/include/GL/glATI.h:620: error: expected ‘)’ before ‘*’ token
/var/tmp/portage/x11-drivers/ati-drivers-8.542/work/common/usr/include/GL/glATI.h:621: error: expected ‘)’ before ‘*’ token
/var/tmp/portage/x11-drivers/ati-drivers-8.542/work/common/usr/include/GL/glATI.h:622: error: expected ‘)’ before ‘*’ token
/var/tmp/portage/x11-drivers/ati-drivers-8.542/work/common/usr/include/GL/glATI.h:623: error: expected ‘)’ before ‘*’ token
/var/tmp/portage/x11-drivers/ati-drivers-8.542/work/common/usr/include/GL/glATI.h:624: error: expected ‘)’ before ‘*’ token
/var/tmp/portage/x11-drivers/ati-drivers-8.542/work/common/usr/include/GL/glATI.h:625: error: expected ‘=’, ‘,’, ‘;’, ‘asm’ or ‘__attribute__’ before ‘*’ token
/var/tmp/portage/x11-drivers/ati-drivers-8.542/work/common/usr/include/GL/glATI.h:626: error: expected ‘=’, ‘,’, ‘;’, ‘asm’ or ‘__attribute__’ before ‘*’ token
/var/tmp/portage/x11-drivers/ati-drivers-8.542/work/common/usr/include/GL/glATI.h:627: error: expected ‘)’ before ‘*’ token
/var/tmp/portage/x11-drivers/ati-drivers-8.542/work/common/usr/include/GL/glATI.h:628: error: expected ‘)’ before ‘*’ token
/var/tmp/portage/x11-drivers/ati-drivers-8.542/work/common/usr/include/GL/glATI.h:639: error: expected ‘)’ before ‘*’ token
/var/tmp/portage/x11-drivers/ati-drivers-8.542/work/common/usr/include/GL/glATI.h:640: error: expected ‘)’ before ‘*’ token
/var/tmp/portage/x11-drivers/ati-drivers-8.542/work/common/usr/include/GL/glATI.h:641: error: expected ‘)’ before ‘*’ token
/var/tmp/portage/x11-drivers/ati-drivers-8.542/work/common/usr/include/GL/glATI.h:642: error: expected ‘)’ before ‘*’ token
/var/tmp/portage/x11-drivers/ati-drivers-8.542/work/common/usr/include/GL/glATI.h:643: error: expected ‘)’ before ‘*’ token
/var/tmp/portage/x11-drivers/ati-drivers-8.542/work/common/usr/include/GL/glATI.h:644: error: expected ‘)’ before ‘*’ token
/var/tmp/portage/x11-drivers/ati-drivers-8.542/work/common/usr/include/GL/glATI.h:645: error: expected ‘)’ before ‘*’ token
/var/tmp/portage/x11-drivers/ati-drivers-8.542/work/common/usr/include/GL/glATI.h:646: error: expected ‘)’ before ‘*’ token
/var/tmp/portage/x11-drivers/ati-drivers-8.542/work/common/usr/include/GL/glATI.h:649: error: expected ‘)’ before ‘*’ token
/var/tmp/portage/x11-drivers/ati-drivers-8.542/work/common/usr/include/GL/glATI.h:650: error: expected ‘)’ before ‘*’ token
/var/tmp/portage/x11-drivers/ati-drivers-8.542/work/common/usr/include/GL/glATI.h:755: error: expected ‘)’ before ‘*’ token
/var/tmp/portage/x11-drivers/ati-drivers-8.542/work/common/usr/include/GL/glATI.h:756: error: expected ‘)’ before ‘*’ token
/var/tmp/portage/x11-drivers/ati-drivers-8.542/work/common/usr/include/GL/glATI.h:757: error: expected ‘)’ before ‘*’ token
/var/tmp/portage/x11-drivers/ati-drivers-8.542/work/common/usr/include/GL/glATI.h:759: error: expected ‘)’ before ‘*’ token
/var/tmp/portage/x11-drivers/ati-drivers-8.542/work/common/usr/include/GL/glATI.h:760: error: expected ‘)’ before ‘*’ token
/var/tmp/portage/x11-drivers/ati-drivers-8.542/work/common/usr/include/GL/glATI.h:761: error: expected ‘)’ before ‘*’ token
/var/tmp/portage/x11-drivers/ati-drivers-8.542/work/common/usr/include/GL/glATI.h:762: error: expected ‘)’ before ‘*’ token
/var/tmp/portage/x11-drivers/ati-drivers-8.542/work/common/usr/include/GL/glATI.h:763: error: expected ‘)’ before ‘*’ token
/var/tmp/portage/x11-drivers/ati-drivers-8.542/work/common/usr/include/GL/glATI.h:764: error: expected ‘)’ before ‘*’ token
/var/tmp/portage/x11-drivers/ati-drivers-8.542/work/common/usr/include/GL/glATI.h:766: error: expected ‘)’ before ‘*’ token
/var/tmp/portage/x11-drivers/ati-drivers-8.542/work/common/usr/include/GL/glATI.h:767: error: expected ‘)’ before ‘*’ token
/var/tmp/portage/x11-drivers/ati-drivers-8.542/work/common/usr/include/GL/glATI.h:768: error: expected ‘)’ before ‘*’ token
/var/tmp/portage/x11-drivers/ati-drivers-8.542/work/common/usr/include/GL/glATI.h:769: error: expected ‘)’ before ‘*’ token
/var/tmp/portage/x11-drivers/ati-drivers-8.542/work/common/usr/include/GL/glATI.h:770: error: expected ‘)’ before ‘*’ token
/var/tmp/portage/x11-drivers/ati-drivers-8.542/work/common/usr/include/GL/glATI.h:771: error: expected ‘)’ before ‘*’ token
/var/tmp/portage/x11-drivers/ati-drivers-8.542/work/common/usr/include/GL/glATI.h:772: error: expected ‘)’ before ‘*’ token
/var/tmp/portage/x11-drivers/ati-drivers-8.542/work/common/usr/include/GL/glATI.h:773: error: expected ‘)’ before ‘*’ token
/var/tmp/portage/x11-drivers/ati-drivers-8.542/work/common/usr/include/GL/glATI.h:774: error: expected ‘)’ before ‘*’ token
/var/tmp/portage/x11-drivers/ati-drivers-8.542/work/common/usr/include/GL/glATI.h:775: error: expected ‘)’ before ‘*’ token
/var/tmp/portage/x11-drivers/ati-drivers-8.542/work/common/usr/include/GL/glATI.h:776: error: expected ‘)’ before ‘*’ token
/var/tmp/portage/x11-drivers/ati-drivers-8.542/work/common/usr/include/GL/glATI.h:777: error: expected ‘)’ before ‘*’ token
/var/tmp/portage/x11-drivers/ati-drivers-8.542/work/common/usr/include/GL/glATI.h:778: error: expected ‘)’ before ‘*’ token
/var/tmp/portage/x11-drivers/ati-drivers-8.542/work/common/usr/include/GL/glATI.h:779: error: expected ‘)’ before ‘*’ token
/var/tmp/portage/x11-drivers/ati-drivers-8.542/work/common/usr/include/GL/glATI.h:780: error: expected ‘)’ before ‘*’ token
/var/tmp/portage/x11-drivers/ati-drivers-8.542/work/common/usr/include/GL/glATI.h:781: error: expected ‘)’ before ‘*’ token
/var/tmp/portage/x11-drivers/ati-drivers-8.542/work/common/usr/include/GL/glATI.h:782: error: expected ‘)’ before ‘*’ token
/var/tmp/portage/x11-drivers/ati-drivers-8.542/work/common/usr/include/GL/glATI.h:784: error: expected ‘)’ before ‘*’ token
/var/tmp/portage/x11-drivers/ati-drivers-8.542/work/common/usr/include/GL/glATI.h:786: error: expected ‘)’ before ‘*’ token
/var/tmp/portage/x11-drivers/ati-drivers-8.542/work/common/usr/include/GL/glATI.h:789: error: expected ‘)’ before ‘*’ token
/var/tmp/portage/x11-drivers/ati-drivers-8.542/work/common/usr/include/GL/glATI.h:791: error: expected ‘)’ before ‘*’ token
/var/tmp/portage/x11-drivers/ati-drivers-8.542/work/common/usr/include/GL/glATI.h:792: error: expected ‘)’ before ‘*’ token
/var/tmp/portage/x11-drivers/ati-drivers-8.542/work/common/usr/include/GL/glATI.h:795: error: expected ‘)’ before ‘*’ token
/var/tmp/portage/x11-drivers/ati-drivers-8.542/work/common/usr/include/GL/glATI.h:796: error: expected ‘)’ before ‘*’ token
/var/tmp/portage/x11-drivers/ati-drivers-8.542/work/common/usr/include/GL/glATI.h:797: error: expected ‘)’ before ‘*’ token
/var/tmp/portage/x11-drivers/ati-drivers-8.542/work/common/usr/include/GL/glATI.h:800: error: expected ‘)’ before ‘*’ token
/var/tmp/portage/x11-drivers/ati-drivers-8.542/work/common/usr/include/GL/glATI.h:801: error: expected ‘)’ before ‘*’ token
/var/tmp/portage/x11-drivers/ati-drivers-8.542/work/common/usr/include/GL/glATI.h:802: error: expected ‘)’ before ‘*’ token
/var/tmp/portage/x11-drivers/ati-drivers-8.542/work/common/usr/include/GL/glATI.h:803: error: expected ‘)’ before ‘*’ token
/var/tmp/portage/x11-drivers/ati-drivers-8.542/work/common/usr/include/GL/glATI.h:804: error: expected ‘)’ before ‘*’ token
/var/tmp/portage/x11-drivers/ati-drivers-8.542/work/common/usr/include/GL/glATI.h:805: error: expected ‘)’ before ‘*’ token
/var/tmp/portage/x11-drivers/ati-drivers-8.542/work/common/usr/include/GL/glATI.h:806: error: expected ‘)’ before ‘*’ token
/var/tmp/portage/x11-drivers/ati-drivers-8.542/work/common/usr/include/GL/glATI.h:807: error: expected ‘)’ before ‘*’ token
/var/tmp/portage/x11-drivers/ati-drivers-8.542/work/common/usr/include/GL/glATI.h:808: error: expected ‘)’ before ‘*’ token
/var/tmp/portage/x11-drivers/ati-drivers-8.542/work/common/usr/include/GL/glATI.h:809: error: expected ‘)’ before ‘*’ token
/var/tmp/portage/x11-drivers/ati-drivers-8.542/work/common/usr/include/GL/glATI.h:810: error: expected ‘)’ before ‘*’ token
/var/tmp/portage/x11-drivers/ati-drivers-8.542/work/common/usr/include/GL/glATI.h:811: error: expected ‘)’ before ‘*’ token
/var/tmp/portage/x11-drivers/ati-drivers-8.542/work/common/usr/include/GL/glATI.h:812: error: expected ‘)’ before ‘*’ token
/var/tmp/portage/x11-drivers/ati-drivers-8.542/work/common/usr/include/GL/glATI.h:813: error: expected ‘)’ before ‘*’ token
/var/tmp/portage/x11-drivers/ati-drivers-8.542/work/common/usr/include/GL/glATI.h:814: error: expected ‘)’ before ‘*’ token
/var/tmp/portage/x11-drivers/ati-drivers-8.542/work/common/usr/include/GL/glATI.h:815: error: expected ‘)’ before ‘*’ token
/var/tmp/portage/x11-drivers/ati-drivers-8.542/work/common/usr/include/GL/glATI.h:816: error: expected ‘)’ before ‘*’ token
/var/tmp/portage/x11-drivers/ati-drivers-8.542/work/common/usr/include/GL/glATI.h:817: error: expected ‘)’ before ‘*’ token
/var/tmp/portage/x11-drivers/ati-drivers-8.542/work/common/usr/include/GL/glATI.h:818: error: expected ‘)’ before ‘*’ token
/var/tmp/portage/x11-drivers/ati-drivers-8.542/work/common/usr/include/GL/glATI.h:819: error: expected ‘)’ before ‘*’ token
/var/tmp/portage/x11-drivers/ati-drivers-8.542/work/common/usr/include/GL/glATI.h:820: error: expected ‘)’ before ‘*’ token
/var/tmp/portage/x11-drivers/ati-drivers-8.542/work/common/usr/include/GL/glATI.h:821: error: expected ‘)’ before ‘*’ token
/var/tmp/portage/x11-drivers/ati-drivers-8.542/work/common/usr/include/GL/glATI.h:822: error: expected ‘)’ before ‘*’ token
/var/tmp/portage/x11-drivers/ati-drivers-8.542/work/common/usr/include/GL/glATI.h:823: error: expected ‘)’ before ‘*’ token
/var/tmp/portage/x11-drivers/ati-drivers-8.542/work/common/usr/include/GL/glATI.h:824: error: expected ‘)’ before ‘*’ token
/var/tmp/portage/x11-drivers/ati-drivers-8.542/work/common/usr/include/GL/glATI.h:825: error: expected ‘)’ before ‘*’ token
/var/tmp/portage/x11-drivers/ati-drivers-8.542/work/common/usr/include/GL/glATI.h:826: error: expected ‘)’ before ‘*’ token
/var/tmp/portage/x11-drivers/ati-drivers-8.542/work/common/usr/include/GL/glATI.h:827: error: expected ‘)’ before ‘*’ token
/var/tmp/portage/x11-drivers/ati-drivers-8.542/work/common/usr/include/GL/glATI.h:828: error: expected ‘)’ before ‘*’ token
/var/tmp/portage/x11-drivers/ati-drivers-8.542/work/common/usr/include/GL/glATI.h:829: error: expected ‘)’ before ‘*’ token
/var/tmp/portage/x11-drivers/ati-drivers-8.542/work/common/usr/include/GL/glATI.h:830: error: expected ‘)’ before ‘*’ token
/var/tmp/portage/x11-drivers/ati-drivers-8.542/work/common/usr/include/GL/glATI.h:831: error: expected ‘)’ before ‘*’ token
/var/tmp/portage/x11-drivers/ati-drivers-8.542/work/common/usr/include/GL/glATI.h:832: error: expected ‘)’ before ‘*’ token
/var/tmp/portage/x11-drivers/ati-drivers-8.542/work/common/usr/include/GL/glATI.h:833: error: expected ‘)’ before ‘*’ token
/var/tmp/portage/x11-drivers/ati-drivers-8.542/work/common/usr/include/GL/glATI.h:834: error: expected ‘)’ before ‘*’ token
/var/tmp/portage/x11-drivers/ati-drivers-8.542/work/common/usr/include/GL/glATI.h:835: error: expected ‘)’ before ‘*’ token
/var/tmp/portage/x11-drivers/ati-drivers-8.542/work/common/usr/include/GL/glATI.h:837: error: expected ‘)’ before ‘*’ token
/var/tmp/portage/x11-drivers/ati-drivers-8.542/work/common/usr/include/GL/glATI.h:841: error: expected ‘)’ before ‘*’ token
/var/tmp/portage/x11-drivers/ati-drivers-8.542/work/common/usr/include/GL/glATI.h:842: error: expected ‘)’ before ‘*’ token
/var/tmp/portage/x11-drivers/ati-drivers-8.542/work/common/usr/include/GL/glATI.h:844: error: expected ‘)’ before ‘*’ token
/var/tmp/portage/x11-drivers/ati-drivers-8.542/work/common/usr/include/GL/glATI.h:846: error: expected ‘)’ before ‘*’ token
/var/tmp/portage/x11-drivers/ati-drivers-8.542/work/common/usr/include/GL/glATI.h:849: error: expected ‘)’ before ‘*’ token
/var/tmp/portage/x11-drivers/ati-drivers-8.542/work/common/usr/include/GL/glATI.h:851: error: expected ‘)’ before ‘*’ token
/var/tmp/portage/x11-drivers/ati-drivers-8.542/work/common/usr/include/GL/glATI.h:852: error: expected ‘)’ before ‘*’ token
/var/tmp/portage/x11-drivers/ati-drivers-8.542/work/common/usr/include/GL/glATI.h:853: error: expected ‘)’ before ‘*’ token
/var/tmp/portage/x11-drivers/ati-drivers-8.542/work/common/usr/include/GL/glATI.h:854: error: expected ‘)’ before ‘*’ token
/var/tmp/portage/x11-drivers/ati-drivers-8.542/work/common/usr/include/GL/glATI.h:856: error: expected ‘)’ before ‘*’ token
/var/tmp/portage/x11-drivers/ati-drivers-8.542/work/common/usr/include/GL/glATI.h:857: error: expected ‘)’ before ‘*’ token
/var/tmp/portage/x11-drivers/ati-drivers-8.542/work/common/usr/include/GL/glATI.h:858: error: expected ‘)’ before ‘*’ token
/var/tmp/portage/x11-drivers/ati-drivers-8.542/work/common/usr/include/GL/glATI.h:859: error: expected ‘)’ before ‘*’ token
/var/tmp/portage/x11-drivers/ati-drivers-8.542/work/common/usr/include/GL/glATI.h:862: error: expected ‘)’ before ‘*’ token
/var/tmp/portage/x11-drivers/ati-drivers-8.542/work/common/usr/include/GL/glATI.h:863: error: expected ‘)’ before ‘*’ token
/var/tmp/portage/x11-drivers/ati-drivers-8.542/work/common/usr/include/GL/glATI.h:864: error: expected ‘)’ before ‘*’ token
/var/tmp/portage/x11-drivers/ati-drivers-8.542/work/common/usr/include/GL/glATI.h:865: error: expected ‘)’ before ‘*’ token
/var/tmp/portage/x11-drivers/ati-drivers-8.542/work/common/usr/include/GL/glATI.h:889: error: expected ‘)’ before ‘*’ token
/var/tmp/portage/x11-drivers/ati-drivers-8.542/work/common/usr/include/GL/glATI.h:913: error: expected ‘)’ before ‘*’ token
/var/tmp/portage/x11-drivers/ati-drivers-8.542/work/common/usr/include/GL/glATI.h:914: error: expected ‘)’ before ‘*’ token
/var/tmp/portage/x11-drivers/ati-drivers-8.542/work/common/usr/include/GL/glATI.h:915: error: expected ‘)’ before ‘*’ token
/var/tmp/portage/x11-drivers/ati-drivers-8.542/work/common/usr/include/GL/glATI.h:923: error: expected ‘)’ before ‘*’ token
/var/tmp/portage/x11-drivers/ati-drivers-8.542/work/common/usr/include/GL/glATI.h:953: error: expected ‘)’ before ‘*’ token
/var/tmp/portage/x11-drivers/ati-drivers-8.542/work/common/usr/include/GL/glATI.h:1041: error: expected ‘)’ before ‘*’ token
/var/tmp/portage/x11-drivers/ati-drivers-8.542/work/common/usr/include/GL/glATI.h:1206: error: expected ‘)’ before ‘*’ token
/var/tmp/portage/x11-drivers/ati-drivers-8.542/work/common/usr/include/GL/glATI.h:1207: error: expected ‘)’ before ‘*’ token
/var/tmp/portage/x11-drivers/ati-drivers-8.542/work/common/usr/include/GL/glATI.h:1208: error: expected ‘)’ before ‘*’ token
/var/tmp/portage/x11-drivers/ati-drivers-8.542/work/common/usr/include/GL/glATI.h:1209: error: expected ‘)’ before ‘*’ token
/var/tmp/portage/x11-drivers/ati-drivers-8.542/work/common/usr/include/GL/glATI.h:1210: error: expected ‘)’ before ‘*’ token
/var/tmp/portage/x11-drivers/ati-drivers-8.542/work/common/usr/include/GL/glATI.h:1211: error: expected ‘)’ before ‘*’ token
/var/tmp/portage/x11-drivers/ati-drivers-8.542/work/common/usr/include/GL/glATI.h:1212: error: expected ‘)’ before ‘*’ token
/var/tmp/portage/x11-drivers/ati-drivers-8.542/work/common/usr/include/GL/glATI.h:1213: error: expected ‘)’ before ‘*’ token
/var/tmp/portage/x11-drivers/ati-drivers-8.542/work/common/usr/include/GL/glATI.h:1214: error: expected ‘)’ before ‘*’ token
/var/tmp/portage/x11-drivers/ati-drivers-8.542/work/common/usr/include/GL/glATI.h:1215: error: expected ‘)’ before ‘*’ token
/var/tmp/portage/x11-drivers/ati-drivers-8.542/work/common/usr/include/GL/glATI.h:1216: error: expected ‘)’ before ‘*’ token
/var/tmp/portage/x11-drivers/ati-drivers-8.542/work/common/usr/include/GL/glATI.h:1217: error: expected ‘)’ before ‘*’ token
/var/tmp/portage/x11-drivers/ati-drivers-8.542/work/common/usr/include/GL/glATI.h:1218: error: expected ‘)’ before ‘*’ token
/var/tmp/portage/x11-drivers/ati-drivers-8.542/work/common/usr/include/GL/glATI.h:1219: error: expected ‘)’ before ‘*’ token
/var/tmp/portage/x11-drivers/ati-drivers-8.542/work/common/usr/include/GL/glATI.h:1220: error: expected ‘)’ before ‘*’ token
/var/tmp/portage/x11-drivers/ati-drivers-8.542/work/common/usr/include/GL/glATI.h:1221: error: expected ‘)’ before ‘*’ token
/var/tmp/portage/x11-drivers/ati-drivers-8.542/work/common/usr/include/GL/glATI.h:1222: error: expected ‘)’ before ‘*’ token
/var/tmp/portage/x11-drivers/ati-drivers-8.542/work/common/usr/include/GL/glATI.h:1223: error: expected ‘)’ before ‘*’ token
/var/tmp/portage/x11-drivers/ati-drivers-8.542/work/common/usr/include/GL/glATI.h:1224: error: expected ‘)’ before ‘*’ token
/var/tmp/portage/x11-drivers/ati-drivers-8.542/work/common/usr/include/GL/glATI.h:1225: error: expected ‘)’ before ‘*’ token
/var/tmp/portage/x11-drivers/ati-drivers-8.542/work/common/usr/include/GL/glATI.h:1226: error: expected ‘)’ before ‘*’ token
/var/tmp/portage/x11-drivers/ati-drivers-8.542/work/common/usr/include/GL/glATI.h:1227: error: expected ‘)’ before ‘*’ token
/var/tmp/portage/x11-drivers/ati-drivers-8.542/work/common/usr/include/GL/glATI.h:1228: error: expected ‘)’ before ‘*’ token
/var/tmp/portage/x11-drivers/ati-drivers-8.542/work/common/usr/include/GL/glATI.h:1229: error: expected ‘)’ before ‘*’ token
/var/tmp/portage/x11-drivers/ati-drivers-8.542/work/common/usr/include/GL/glATI.h:1230: error: expected ‘)’ before ‘*’ token
/var/tmp/portage/x11-drivers/ati-drivers-8.542/work/common/usr/include/GL/glATI.h:1231: error: expected ‘)’ before ‘*’ token
/var/tmp/portage/x11-drivers/ati-drivers-8.542/work/common/usr/include/GL/glATI.h:1232: error: expected ‘)’ before ‘*’ token
/var/tmp/portage/x11-drivers/ati-drivers-8.542/work/common/usr/include/GL/glATI.h:1233: error: expected ‘)’ before ‘*’ token
/var/tmp/portage/x11-drivers/ati-drivers-8.542/work/common/usr/include/GL/glATI.h:1234: error: expected ‘)’ before ‘*’ token
/var/tmp/portage/x11-drivers/ati-drivers-8.542/work/common/usr/include/GL/glATI.h:1235: error: expected ‘)’ before ‘*’ token
/var/tmp/portage/x11-drivers/ati-drivers-8.542/work/common/usr/include/GL/glATI.h:1236: error: expected ‘)’ before ‘*’ token
/var/tmp/portage/x11-drivers/ati-drivers-8.542/work/common/usr/include/GL/glATI.h:1237: error: expected ‘)’ before ‘*’ token
/var/tmp/portage/x11-drivers/ati-drivers-8.542/work/common/usr/include/GL/glATI.h:1268: error: expected ‘)’ before ‘*’ token
/var/tmp/portage/x11-drivers/ati-drivers-8.542/work/common/usr/include/GL/glATI.h:1269: error: expected ‘)’ before ‘*’ token
/var/tmp/portage/x11-drivers/ati-drivers-8.542/work/common/usr/include/GL/glATI.h:1270: error: expected ‘)’ before ‘*’ token
/var/tmp/portage/x11-drivers/ati-drivers-8.542/work/common/usr/include/GL/glATI.h:1271: error: expected ‘)’ before ‘*’ token
/var/tmp/portage/x11-drivers/ati-drivers-8.542/work/common/usr/include/GL/glATI.h:1272: error: expected ‘)’ before ‘*’ token
/var/tmp/portage/x11-drivers/ati-drivers-8.542/work/common/usr/include/GL/glATI.h:1280: error: expected ‘)’ before ‘*’ token
/var/tmp/portage/x11-drivers/ati-drivers-8.542/work/common/usr/include/GL/glATI.h:1281: error: expected ‘)’ before ‘*’ token
/var/tmp/portage/x11-drivers/ati-drivers-8.542/work/common/usr/include/GL/glATI.h:1282: error: expected ‘)’ before ‘*’ token
/var/tmp/portage/x11-drivers/ati-drivers-8.542/work/common/usr/include/GL/glATI.h:1283: error: expected ‘)’ before ‘*’ token
/var/tmp/portage/x11-drivers/ati-drivers-8.542/work/common/usr/include/GL/glATI.h:1284: error: expected ‘)’ before ‘*’ token
/var/tmp/portage/x11-drivers/ati-drivers-8.542/work/common/usr/include/GL/glATI.h:1285: error: expected ‘)’ before ‘*’ token
/var/tmp/portage/x11-drivers/ati-drivers-8.542/work/common/usr/include/GL/glATI.h:1299: error: expected ‘)’ before ‘*’ token
/var/tmp/portage/x11-drivers/ati-drivers-8.542/work/common/usr/include/GL/glATI.h:1300: error: expected ‘)’ before ‘*’ token
/var/tmp/portage/x11-drivers/ati-drivers-8.542/work/common/usr/include/GL/glATI.h:1301: error: expected ‘)’ before ‘*’ token
/var/tmp/portage/x11-drivers/ati-drivers-8.542/work/common/usr/include/GL/glATI.h:1302: error: expected ‘)’ before ‘*’ token
/var/tmp/portage/x11-drivers/ati-drivers-8.542/work/common/usr/include/GL/glATI.h:1303: error: expected ‘)’ before ‘*’ token
/var/tmp/portage/x11-drivers/ati-drivers-8.542/work/common/usr/include/GL/glATI.h:1304: error: expected ‘)’ before ‘*’ token
/var/tmp/portage/x11-drivers/ati-drivers-8.542/work/common/usr/include/GL/glATI.h:1305: error: expected ‘)’ before ‘*’ token
/var/tmp/portage/x11-drivers/ati-drivers-8.542/work/common/usr/include/GL/glATI.h:1306: error: expected ‘)’ before ‘*’ token
/var/tmp/portage/x11-drivers/ati-drivers-8.542/work/common/usr/include/GL/glATI.h:1307: error: expected ‘)’ before ‘*’ token
/var/tmp/portage/x11-drivers/ati-drivers-8.542/work/common/usr/include/GL/glATI.h:1308: error: expected ‘)’ before ‘*’ token
/var/tmp/portage/x11-drivers/ati-drivers-8.542/work/common/usr/include/GL/glATI.h:1309: error: expected ‘)’ before ‘*’ token
/var/tmp/portage/x11-drivers/ati-drivers-8.542/work/common/usr/include/GL/glATI.h:1310: error: expected ‘)’ before ‘*’ token
/var/tmp/portage/x11-drivers/ati-drivers-8.542/work/common/usr/include/GL/glATI.h:1311: error: expected ‘)’ before ‘*’ token
/var/tmp/portage/x11-drivers/ati-drivers-8.542/work/common/usr/include/GL/glATI.h:1312: error: expected ‘)’ before ‘*’ token
/var/tmp/portage/x11-drivers/ati-drivers-8.542/work/common/usr/include/GL/glATI.h:1313: error: expected ‘)’ before ‘*’ token
/var/tmp/portage/x11-drivers/ati-drivers-8.542/work/common/usr/include/GL/glATI.h:1314: error: expected ‘)’ before ‘*’ token
/var/tmp/portage/x11-drivers/ati-drivers-8.542/work/common/usr/include/GL/glATI.h:1315: error: expected ‘)’ before ‘*’ token
/var/tmp/portage/x11-drivers/ati-drivers-8.542/work/common/usr/include/GL/glATI.h:1316: error: expected ‘)’ before ‘*’ token
/var/tmp/portage/x11-drivers/ati-drivers-8.542/work/common/usr/include/GL/glATI.h:1317: error: expected ‘)’ before ‘*’ token
/var/tmp/portage/x11-drivers/ati-drivers-8.542/work/common/usr/include/GL/glATI.h:1318: error: expected ‘)’ before ‘*’ token
/var/tmp/portage/x11-drivers/ati-drivers-8.542/work/common/usr/include/GL/glATI.h:1319: error: expected ‘)’ before ‘*’ token
/var/tmp/portage/x11-drivers/ati-drivers-8.542/work/common/usr/include/GL/glATI.h:1320: error: expected ‘)’ before ‘*’ token
/var/tmp/portage/x11-drivers/ati-drivers-8.542/work/common/usr/include/GL/glATI.h:1321: error: expected ‘)’ before ‘*’ token
/var/tmp/portage/x11-drivers/ati-drivers-8.542/work/common/usr/include/GL/glATI.h:1322: error: expected ‘)’ before ‘*’ token
/var/tmp/portage/x11-drivers/ati-drivers-8.542/work/common/usr/include/GL/glATI.h:1323: error: expected ‘)’ before ‘*’ token
/var/tmp/portage/x11-drivers/ati-drivers-8.542/work/common/usr/include/GL/glATI.h:1324: error: expected ‘)’ before ‘*’ token
/var/tmp/portage/x11-drivers/ati-drivers-8.542/work/common/usr/include/GL/glATI.h:1325: error: expected ‘)’ before ‘*’ token
/var/tmp/portage/x11-drivers/ati-drivers-8.542/work/common/usr/include/GL/glATI.h:1326: error: expected ‘)’ before ‘*’ token
/var/tmp/portage/x11-drivers/ati-drivers-8.542/work/common/usr/include/GL/glATI.h:1327: error: expected ‘)’ before ‘*’ token
/var/tmp/portage/x11-drivers/ati-drivers-8.542/work/common/usr/include/GL/glATI.h:1328: error: expected ‘)’ before ‘*’ token
/var/tmp/portage/x11-drivers/ati-drivers-8.542/work/common/usr/include/GL/glATI.h:1329: error: expected ‘)’ before ‘*’ token
/var/tmp/portage/x11-drivers/ati-drivers-8.542/work/common/usr/include/GL/glATI.h:1330: error: expected ‘)’ before ‘*’ token
/var/tmp/portage/x11-drivers/ati-drivers-8.542/work/common/usr/include/GL/glATI.h:1331: error: expected ‘)’ before ‘*’ token
/var/tmp/portage/x11-drivers/ati-drivers-8.542/work/common/usr/include/GL/glATI.h:1332: error: expected ‘)’ before ‘*’ token
/var/tmp/portage/x11-drivers/ati-drivers-8.542/work/common/usr/include/GL/glATI.h:1333: error: expected ‘)’ before ‘*’ token
/var/tmp/portage/x11-drivers/ati-drivers-8.542/work/common/usr/include/GL/glATI.h:1334: error: expected ‘)’ before ‘*’ token
/var/tmp/portage/x11-drivers/ati-drivers-8.542/work/common/usr/include/GL/glATI.h:1335: error: expected ‘)’ before ‘*’ token
/var/tmp/portage/x11-drivers/ati-drivers-8.542/work/common/usr/include/GL/glATI.h:1336: error: expected ‘)’ before ‘*’ token
/var/tmp/portage/x11-drivers/ati-drivers-8.542/work/common/usr/include/GL/glATI.h:1337: error: expected ‘)’ before ‘*’ token
/var/tmp/portage/x11-drivers/ati-drivers-8.542/work/common/usr/include/GL/glATI.h:1339: error: expected ‘)’ before ‘*’ token
/var/tmp/portage/x11-drivers/ati-drivers-8.542/work/common/usr/include/GL/glATI.h:1368: error: expected ‘)’ before ‘*’ token
/var/tmp/portage/x11-drivers/ati-drivers-8.542/work/common/usr/include/GL/glATI.h:1423: error: expected ‘)’ before ‘*’ token
/var/tmp/portage/x11-drivers/ati-drivers-8.542/work/common/usr/include/GL/glATI.h:1424: error: expected ‘)’ before ‘*’ token
/var/tmp/portage/x11-drivers/ati-drivers-8.542/work/common/usr/include/GL/glATI.h:1425: error: expected ‘)’ before ‘*’ token
/var/tmp/portage/x11-drivers/ati-drivers-8.542/work/common/usr/include/GL/glATI.h:1426: error: expected ‘)’ before ‘*’ token
/var/tmp/portage/x11-drivers/ati-drivers-8.542/work/common/usr/include/GL/glATI.h:1427: error: expected ‘)’ before ‘*’ token
/var/tmp/portage/x11-drivers/ati-drivers-8.542/work/common/usr/include/GL/glATI.h:1428: error: expected ‘)’ before ‘*’ token
/var/tmp/portage/x11-drivers/ati-drivers-8.542/work/common/usr/include/GL/glATI.h:1429: error: expected ‘)’ before ‘*’ token
/var/tmp/portage/x11-drivers/ati-drivers-8.542/work/common/usr/include/GL/glATI.h:1430: error: expected ‘)’ before ‘*’ token
/var/tmp/portage/x11-drivers/ati-drivers-8.542/work/common/usr/include/GL/glATI.h:1431: error: expected ‘)’ before ‘*’ token
/var/tmp/portage/x11-drivers/ati-drivers-8.542/work/common/usr/include/GL/glATI.h:1432: error: expected ‘)’ before ‘*’ token
/var/tmp/portage/x11-drivers/ati-drivers-8.542/work/common/usr/include/GL/glATI.h:1433: error: expected ‘)’ before ‘*’ token
/var/tmp/portage/x11-drivers/ati-drivers-8.542/work/common/usr/include/GL/glATI.h:1434: error: expected ‘)’ before ‘*’ token
/var/tmp/portage/x11-drivers/ati-drivers-8.542/work/common/usr/include/GL/glATI.h:1435: error: expected ‘)’ before ‘*’ token
/var/tmp/portage/x11-drivers/ati-drivers-8.542/work/common/usr/include/GL/glATI.h:1436: error: expected ‘)’ before ‘*’ token
/var/tmp/portage/x11-drivers/ati-drivers-8.542/work/common/usr/include/GL/glATI.h:1437: error: expected ‘)’ before ‘*’ token
/var/tmp/portage/x11-drivers/ati-drivers-8.542/work/common/usr/include/GL/glATI.h:1438: error: expected ‘)’ before ‘*’ token
/var/tmp/portage/x11-drivers/ati-drivers-8.542/work/common/usr/include/GL/glATI.h:1439: error: expected ‘)’ before ‘*’ token
/var/tmp/portage/x11-drivers/ati-drivers-8.542/work/common/usr/include/GL/glATI.h:1440: error: expected ‘)’ before ‘*’ token
/var/tmp/portage/x11-drivers/ati-drivers-8.542/work/common/usr/include/GL/glATI.h:1441: error: expected ‘)’ before ‘*’ token
/var/tmp/portage/x11-drivers/ati-drivers-8.542/work/common/usr/include/GL/glATI.h:1442: error: expected ‘)’ before ‘*’ token
/var/tmp/portage/x11-drivers/ati-drivers-8.542/work/common/usr/include/GL/glATI.h:1443: error: expected ‘)’ before ‘*’ token
/var/tmp/portage/x11-drivers/ati-drivers-8.542/work/common/usr/include/GL/glATI.h:1444: error: expected ‘)’ before ‘*’ token
/var/tmp/portage/x11-drivers/ati-drivers-8.542/work/common/usr/include/GL/glATI.h:1445: error: expected ‘)’ before ‘*’ token
/var/tmp/portage/x11-drivers/ati-drivers-8.542/work/common/usr/include/GL/glATI.h:1446: error: expected ‘)’ before ‘*’ token
/var/tmp/portage/x11-drivers/ati-drivers-8.542/work/common/usr/include/GL/glATI.h:1447: error: expected ‘)’ before ‘*’ token
/var/tmp/portage/x11-drivers/ati-drivers-8.542/work/common/usr/include/GL/glATI.h:1448: error: expected ‘)’ before ‘*’ token
/var/tmp/portage/x11-drivers/ati-drivers-8.542/work/common/usr/include/GL/glATI.h:1449: error: expected ‘)’ before ‘*’ token
/var/tmp/portage/x11-drivers/ati-drivers-8.542/work/common/usr/include/GL/glATI.h:1450: error: expected ‘)’ before ‘*’ token
/var/tmp/portage/x11-drivers/ati-drivers-8.542/work/common/usr/include/GL/glATI.h:1451: error: expected ‘)’ before ‘*’ token
/var/tmp/portage/x11-drivers/ati-drivers-8.542/work/common/usr/include/GL/glATI.h:1452: error: expected ‘)’ before ‘*’ token
/var/tmp/portage/x11-drivers/ati-drivers-8.542/work/common/usr/include/GL/glATI.h:1453: error: expected ‘)’ before ‘*’ token
/var/tmp/portage/x11-drivers/ati-drivers-8.542/work/common/usr/include/GL/glATI.h:1454: error: expected ‘)’ before ‘*’ token
/var/tmp/portage/x11-drivers/ati-drivers-8.542/work/common/usr/include/GL/glATI.h:1455: error: expected ‘)’ before ‘*’ token
/var/tmp/portage/x11-drivers/ati-drivers-8.542/work/common/usr/include/GL/glATI.h:1456: error: expected ‘)’ before ‘*’ token
/var/tmp/portage/x11-drivers/ati-drivers-8.542/work/common/usr/include/GL/glATI.h:1481: error: expected ‘)’ before ‘*’ token
/var/tmp/portage/x11-drivers/ati-drivers-8.542/work/common/usr/include/GL/glATI.h:1482: error: expected ‘)’ before ‘*’ token
/var/tmp/portage/x11-drivers/ati-drivers-8.542/work/common/usr/include/GL/glATI.h:1483: error: expected ‘)’ before ‘*’ token
/var/tmp/portage/x11-drivers/ati-drivers-8.542/work/common/usr/include/GL/glATI.h:1484: error: expected ‘)’ before ‘*’ token
/var/tmp/portage/x11-drivers/ati-drivers-8.542/work/common/usr/include/GL/glATI.h:1485: error: expected ‘)’ before ‘*’ token
/var/tmp/portage/x11-drivers/ati-drivers-8.542/work/common/usr/include/GL/glATI.h:1486: error: expected ‘)’ before ‘*’ token
/var/tmp/portage/x11-drivers/ati-drivers-8.542/work/common/usr/include/GL/glATI.h:1487: error: expected ‘)’ before ‘*’ token
/var/tmp/portage/x11-drivers/ati-drivers-8.542/work/common/usr/include/GL/glATI.h:1488: error: expected ‘)’ before ‘*’ token
/var/tmp/portage/x11-drivers/ati-drivers-8.542/work/common/usr/include/GL/glATI.h:1535: error: expected ‘)’ before ‘*’ token
/var/tmp/portage/x11-drivers/ati-drivers-8.542/work/common/usr/include/GL/glATI.h:1536: error: expected ‘)’ before ‘*’ token
/var/tmp/portage/x11-drivers/ati-drivers-8.542/work/common/usr/include/GL/glATI.h:1623: error: expected ‘)’ before ‘*’ token
/var/tmp/portage/x11-drivers/ati-drivers-8.542/work/common/usr/include/GL/glATI.h:1624: error: expected ‘)’ before ‘*’ token
/var/tmp/portage/x11-drivers/ati-drivers-8.542/work/common/usr/include/GL/glATI.h:1625: error: expected ‘)’ before ‘*’ token
/var/tmp/portage/x11-drivers/ati-drivers-8.542/work/common/usr/include/GL/glATI.h:1627: error: expected ‘)’ before ‘*’ token
/var/tmp/portage/x11-drivers/ati-drivers-8.542/work/common/usr/include/GL/glATI.h:1628: error: expected ‘)’ before ‘*’ token
/var/tmp/portage/x11-drivers/ati-drivers-8.542/work/common/usr/include/GL/glATI.h:1632: error: expected ‘)’ before ‘*’ token
/var/tmp/portage/x11-drivers/ati-drivers-8.542/work/common/usr/include/GL/glATI.h:1633: error: expected ‘)’ before ‘*’ token
/var/tmp/portage/x11-drivers/ati-drivers-8.542/work/common/usr/include/GL/glATI.h:1634: error: expected ‘)’ before ‘*’ token
/var/tmp/portage/x11-drivers/ati-drivers-8.542/work/common/usr/include/GL/glATI.h:1636: error: expected ‘)’ before ‘*’ token
/var/tmp/portage/x11-drivers/ati-drivers-8.542/work/common/usr/include/GL/glATI.h:1637: error: expected ‘)’ before ‘*’ token
/var/tmp/portage/x11-drivers/ati-drivers-8.542/work/common/usr/include/GL/glATI.h:1638: error: expected ‘)’ before ‘*’ token
/var/tmp/portage/x11-drivers/ati-drivers-8.542/work/common/usr/include/GL/glATI.h:1639: error: expected ‘)’ before ‘*’ token
/var/tmp/portage/x11-drivers/ati-drivers-8.542/work/common/usr/include/GL/glATI.h:1641: error: expected ‘)’ before ‘*’ token
/var/tmp/portage/x11-drivers/ati-drivers-8.542/work/common/usr/include/GL/glATI.h:1644: error: expected ‘)’ before ‘*’ token
/var/tmp/portage/x11-drivers/ati-drivers-8.542/work/common/usr/include/GL/glATI.h:1648: error: expected ‘)’ before ‘*’ token
/var/tmp/portage/x11-drivers/ati-drivers-8.542/work/common/usr/include/GL/glATI.h:1653: error: expected ‘)’ before ‘*’ token
/var/tmp/portage/x11-drivers/ati-drivers-8.542/work/common/usr/include/GL/glATI.h:1655: error: expected ‘)’ before ‘*’ token
/var/tmp/portage/x11-drivers/ati-drivers-8.542/work/common/usr/include/GL/glATI.h:1658: error: expected ‘)’ before ‘*’ token
/var/tmp/portage/x11-drivers/ati-drivers-8.542/work/common/usr/include/GL/glATI.h:1662: error: expected ‘)’ before ‘*’ token
/var/tmp/portage/x11-drivers/ati-drivers-8.542/work/common/usr/include/GL/glATI.h:1667: error: expected ‘)’ before ‘*’ token
/var/tmp/portage/x11-drivers/ati-drivers-8.542/work/common/usr/include/GL/glATI.h:1670: error: expected ‘)’ before ‘*’ token
/var/tmp/portage/x11-drivers/ati-drivers-8.542/work/common/usr/include/GL/glATI.h:1673: error: expected ‘)’ before ‘*’ token
/var/tmp/portage/x11-drivers/ati-drivers-8.542/work/common/usr/include/GL/glATI.h:1676: error: expected ‘)’ before ‘*’ token
/var/tmp/portage/x11-drivers/ati-drivers-8.542/work/common/usr/include/GL/glATI.h:1679: error: expected ‘)’ before ‘*’ token
/var/tmp/portage/x11-drivers/ati-drivers-8.542/work/common/usr/include/GL/glATI.h:1682: error: expected ‘)’ before ‘*’ token
/var/tmp/portage/x11-drivers/ati-drivers-8.542/work/common/usr/include/GL/glATI.h:1685: error: expected ‘)’ before ‘*’ token
/var/tmp/portage/x11-drivers/ati-drivers-8.542/work/common/usr/include/GL/glATI.h:1688: error: expected ‘)’ before ‘*’ token
/var/tmp/portage/x11-drivers/ati-drivers-8.542/work/common/usr/include/GL/glATI.h:1691: error: expected ‘)’ before ‘*’ token
/var/tmp/portage/x11-drivers/ati-drivers-8.542/work/common/usr/include/GL/glATI.h:1695: error: expected ‘)’ before ‘*’ token
/var/tmp/portage/x11-drivers/ati-drivers-8.542/work/common/usr/include/GL/glATI.h:1699: error: expected ‘)’ before ‘*’ token
/var/tmp/portage/x11-drivers/ati-drivers-8.542/work/common/usr/include/GL/glATI.h:1703: error: expected ‘)’ before ‘*’ token
/var/tmp/portage/x11-drivers/ati-drivers-8.542/work/common/usr/include/GL/glATI.h:1706: error: expected ‘)’ before ‘*’ token
/var/tmp/portage/x11-drivers/ati-drivers-8.542/work/common/usr/include/GL/glATI.h:1709: error: expected ‘)’ before ‘*’ token
/var/tmp/portage/x11-drivers/ati-drivers-8.542/work/common/usr/include/GL/glATI.h:1713: error: expected ‘)’ before ‘*’ token
/var/tmp/portage/x11-drivers/ati-drivers-8.542/work/common/usr/include/GL/glATI.h:1717: error: expected ‘)’ before ‘*’ token
/var/tmp/portage/x11-drivers/ati-drivers-8.542/work/common/usr/include/GL/glATI.h:1719: error: expected ‘)’ before ‘*’ token
/var/tmp/portage/x11-drivers/ati-drivers-8.542/work/common/usr/include/GL/glATI.h:1726: error: expected ‘)’ before ‘*’ token
/var/tmp/portage/x11-drivers/ati-drivers-8.542/work/common/usr/include/GL/glATI.h:1729: error: expected ‘)’ before ‘*’ token
/var/tmp/portage/x11-drivers/ati-drivers-8.542/work/common/usr/include/GL/glATI.h:1732: error: expected ‘)’ before ‘*’ token
/var/tmp/portage/x11-drivers/ati-drivers-8.542/work/common/usr/include/GL/glATI.h:1858: error: expected ‘)’ before ‘*’ token
/var/tmp/portage/x11-drivers/ati-drivers-8.542/work/common/usr/include/GL/glATI.h:1863: error: expected ‘)’ before ‘*’ token
/var/tmp/portage/x11-drivers/ati-drivers-8.542/work/common/usr/include/GL/glATI.h:1867: error: expected ‘)’ before ‘*’ token
/var/tmp/portage/x11-drivers/ati-drivers-8.542/work/common/usr/include/GL/glATI.h:1871: error: expected ‘)’ before ‘*’ token
/var/tmp/portage/x11-drivers/ati-drivers-8.542/work/common/usr/include/GL/glATI.h:1877: error: expected ‘)’ before ‘*’ token
/var/tmp/portage/x11-drivers/ati-drivers-8.542/work/common/usr/include/GL/glATI.h:1882: error: expected ‘)’ before ‘*’ token
/var/tmp/portage/x11-drivers/ati-drivers-8.542/work/common/usr/include/GL/glATI.h:1886: error: expected ‘)’ before ‘*’ token
/var/tmp/portage/x11-drivers/ati-drivers-8.542/work/common/usr/include/GL/glATI.h:2135: error: expected ‘)’ before ‘*’ token
/var/tmp/portage/x11-drivers/ati-drivers-8.542/work/common/usr/include/GL/glATI.h:2136: error: expected ‘)’ before ‘*’ token
/var/tmp/portage/x11-drivers/ati-drivers-8.542/work/common/usr/include/GL/glATI.h:2137: error: expected ‘)’ before ‘*’ token
/var/tmp/portage/x11-drivers/ati-drivers-8.542/work/common/usr/include/GL/glATI.h:2138: error: expected ‘)’ before ‘*’ token
/var/tmp/portage/x11-drivers/ati-drivers-8.542/work/common/usr/include/GL/glATI.h:2200: error: expected ‘)’ before ‘*’ token
/var/tmp/portage/x11-drivers/ati-drivers-8.542/work/common/usr/include/GL/glATI.h:2201: error: expected ‘)’ before ‘*’ token
/var/tmp/portage/x11-drivers/ati-drivers-8.542/work/common/usr/include/GL/glATI.h:2202: error: expected ‘)’ before ‘*’ token
/var/tmp/portage/x11-drivers/ati-drivers-8.542/work/common/usr/include/GL/glATI.h:2203: error: expected ‘)’ before ‘*’ token
/var/tmp/portage/x11-drivers/ati-drivers-8.542/work/common/usr/include/GL/glATI.h:2204: error: expected ‘)’ before ‘*’ token
/var/tmp/portage/x11-drivers/ati-drivers-8.542/work/common/usr/include/GL/glATI.h:2205: error: expected ‘)’ before ‘*’ token
/var/tmp/portage/x11-drivers/ati-drivers-8.542/work/common/usr/include/GL/glATI.h:2206: error: expected ‘)’ before ‘*’ token
/var/tmp/portage/x11-drivers/ati-drivers-8.542/work/common/usr/include/GL/glATI.h:2207: error: expected ‘)’ before ‘*’ token
/var/tmp/portage/x11-drivers/ati-drivers-8.542/work/common/usr/include/GL/glATI.h:2208: error: expected ‘)’ before ‘*’ token
/var/tmp/portage/x11-drivers/ati-drivers-8.542/work/common/usr/include/GL/glATI.h:2209: error: expected ‘)’ before ‘*’ token
/var/tmp/portage/x11-drivers/ati-drivers-8.542/work/common/usr/include/GL/glATI.h:2263: error: expected ‘)’ before ‘*’ token
/var/tmp/portage/x11-drivers/ati-drivers-8.542/work/common/usr/include/GL/glATI.h:2264: error: expected ‘)’ before ‘*’ token
/var/tmp/portage/x11-drivers/ati-drivers-8.542/work/common/usr/include/GL/glATI.h:2265: error: expected ‘)’ before ‘*’ token
/var/tmp/portage/x11-drivers/ati-drivers-8.542/work/common/usr/include/GL/glATI.h:2266: error: expected ‘)’ before ‘*’ token
/var/tmp/portage/x11-drivers/ati-drivers-8.542/work/common/usr/include/GL/glATI.h:2267: error: expected ‘)’ before ‘*’ token
/var/tmp/portage/x11-drivers/ati-drivers-8.542/work/common/usr/include/GL/glATI.h:2268: error: expected ‘)’ before ‘*’ token
/var/tmp/portage/x11-drivers/ati-drivers-8.542/work/common/usr/include/GL/glATI.h:2269: error: expected ‘)’ before ‘*’ token
/var/tmp/portage/x11-drivers/ati-drivers-8.542/work/common/usr/include/GL/glATI.h:2270: error: expected ‘=’, ‘,’, ‘;’, ‘asm’ or ‘__attribute__’ before ‘*’ token
/var/tmp/portage/x11-drivers/ati-drivers-8.542/work/common/usr/include/GL/glATI.h:2271: error: expected ‘)’ before ‘*’ token
/var/tmp/portage/x11-drivers/ati-drivers-8.542/work/common/usr/include/GL/glATI.h:2272: error: expected ‘)’ before ‘*’ token
/var/tmp/portage/x11-drivers/ati-drivers-8.542/work/common/usr/include/GL/glATI.h:2273: error: expected ‘)’ before ‘*’ token
/var/tmp/portage/x11-drivers/ati-drivers-8.542/work/common/usr/include/GL/glATI.h:2372: error: expected ‘)’ before ‘*’ token
/var/tmp/portage/x11-drivers/ati-drivers-8.542/work/common/usr/include/GL/glATI.h:2373: error: expected ‘)’ before ‘*’ token
/var/tmp/portage/x11-drivers/ati-drivers-8.542/work/common/usr/include/GL/glATI.h:2374: error: expected ‘)’ before ‘*’ token
/var/tmp/portage/x11-drivers/ati-drivers-8.542/work/common/usr/include/GL/glATI.h:2375: error: expected ‘)’ before ‘*’ token
/var/tmp/portage/x11-drivers/ati-drivers-8.542/work/common/usr/include/GL/glATI.h:2376: error: expected ‘)’ before ‘*’ token
/var/tmp/portage/x11-drivers/ati-drivers-8.542/work/common/usr/include/GL/glATI.h:2377: error: expected ‘)’ before ‘*’ token
/var/tmp/portage/x11-drivers/ati-drivers-8.542/work/common/usr/include/GL/glATI.h:2378: error: expected ‘)’ before ‘*’ token
/var/tmp/portage/x11-drivers/ati-drivers-8.542/work/common/usr/include/GL/glATI.h:2379: error: expected ‘)’ before ‘*’ token
/var/tmp/portage/x11-drivers/ati-drivers-8.542/work/common/usr/include/GL/glATI.h:2380: error: expected ‘)’ before ‘*’ token
/var/tmp/portage/x11-drivers/ati-drivers-8.542/work/common/usr/include/GL/glATI.h:2381: error: expected ‘)’ before ‘*’ token
/var/tmp/portage/x11-drivers/ati-drivers-8.542/work/common/usr/include/GL/glATI.h:2382: error: expected ‘)’ before ‘*’ token
/var/tmp/portage/x11-drivers/ati-drivers-8.542/work/common/usr/include/GL/glATI.h:2383: error: expected ‘)’ before ‘*’ token
/var/tmp/portage/x11-drivers/ati-drivers-8.542/work/common/usr/include/GL/glATI.h:2384: error: expected ‘)’ before ‘*’ token
/var/tmp/portage/x11-drivers/ati-drivers-8.542/work/common/usr/include/GL/glATI.h:2385: error: expected ‘)’ before ‘*’ token
/var/tmp/portage/x11-drivers/ati-drivers-8.542/work/common/usr/include/GL/glATI.h:2386: error: expected ‘)’ before ‘*’ token
/var/tmp/portage/x11-drivers/ati-drivers-8.542/work/common/usr/include/GL/glATI.h:2387: error: expected ‘)’ before ‘*’ token
/var/tmp/portage/x11-drivers/ati-drivers-8.542/work/common/usr/include/GL/glATI.h:2388: error: expected ‘)’ before ‘*’ token
/var/tmp/portage/x11-drivers/ati-drivers-8.542/work/common/usr/include/GL/glATI.h:2389: error: expected ‘)’ before ‘*’ token
/var/tmp/portage/x11-drivers/ati-drivers-8.542/work/common/usr/include/GL/glATI.h:2390: error: expected ‘)’ before ‘*’ token
/var/tmp/portage/x11-drivers/ati-drivers-8.542/work/common/usr/include/GL/glATI.h:2391: error: expected ‘)’ before ‘*’ token
/var/tmp/portage/x11-drivers/ati-drivers-8.542/work/common/usr/include/GL/glATI.h:2392: error: expected ‘)’ before ‘*’ token
/var/tmp/portage/x11-drivers/ati-drivers-8.542/work/common/usr/include/GL/glATI.h:2393: error: expected ‘)’ before ‘*’ token
/var/tmp/portage/x11-drivers/ati-drivers-8.542/work/common/usr/include/GL/glATI.h:2394: error: expected ‘)’ before ‘*’ token
/var/tmp/portage/x11-drivers/ati-drivers-8.542/work/common/usr/include/GL/glATI.h:2395: error: expected ‘)’ before ‘*’ token
/var/tmp/portage/x11-drivers/ati-drivers-8.542/work/common/usr/include/GL/glATI.h:2396: error: expected ‘)’ before ‘*’ token
/var/tmp/portage/x11-drivers/ati-drivers-8.542/work/common/usr/include/GL/glATI.h:2397: error: expected ‘)’ before ‘*’ token
/var/tmp/portage/x11-drivers/ati-drivers-8.542/work/common/usr/include/GL/glATI.h:2398: error: expected ‘)’ before ‘*’ token
/var/tmp/portage/x11-drivers/ati-drivers-8.542/work/common/usr/include/GL/glATI.h:2399: error: expected ‘)’ before ‘*’ token
/var/tmp/portage/x11-drivers/ati-drivers-8.542/work/common/usr/include/GL/glATI.h:2400: error: expected ‘)’ before ‘*’ token
/var/tmp/portage/x11-drivers/ati-drivers-8.542/work/common/usr/include/GL/glATI.h:2401: error: expected ‘)’ before ‘*’ token
/var/tmp/portage/x11-drivers/ati-drivers-8.542/work/common/usr/include/GL/glATI.h:2402: error: expected ‘)’ before ‘*’ token
/var/tmp/portage/x11-drivers/ati-drivers-8.542/work/common/usr/include/GL/glATI.h:2403: error: expected ‘)’ before ‘*’ token
/var/tmp/portage/x11-drivers/ati-drivers-8.542/work/common/usr/include/GL/glATI.h:2404: error: expected ‘)’ before ‘*’ token
/var/tmp/portage/x11-drivers/ati-drivers-8.542/work/common/usr/include/GL/glATI.h:2405: error: expected ‘)’ before ‘*’ token
/var/tmp/portage/x11-drivers/ati-drivers-8.542/work/common/usr/include/GL/glATI.h:2406: error: expected ‘)’ before ‘*’ token
/var/tmp/portage/x11-drivers/ati-drivers-8.542/work/common/usr/include/GL/glATI.h:2407: error: expected ‘)’ before ‘*’ token
/var/tmp/portage/x11-drivers/ati-drivers-8.542/work/common/usr/include/GL/glATI.h:2408: error: expected ‘)’ before ‘*’ token
/var/tmp/portage/x11-drivers/ati-drivers-8.542/work/common/usr/include/GL/glATI.h:2411: error: expected ‘)’ before ‘*’ token
/var/tmp/portage/x11-drivers/ati-drivers-8.542/work/common/usr/include/GL/glATI.h:2412: error: expected ‘)’ before ‘*’ token
/var/tmp/portage/x11-drivers/ati-drivers-8.542/work/common/usr/include/GL/glATI.h:2413: error: expected ‘)’ before ‘*’ token
/var/tmp/portage/x11-drivers/ati-drivers-8.542/work/common/usr/include/GL/glATI.h:2414: error: expected ‘)’ before ‘*’ token
/var/tmp/portage/x11-drivers/ati-drivers-8.542/work/common/usr/include/GL/glATI.h:2415: error: expected ‘)’ before ‘*’ token
/var/tmp/portage/x11-drivers/ati-drivers-8.542/work/common/usr/include/GL/glATI.h:2416: error: expected ‘)’ before ‘*’ token
/var/tmp/portage/x11-drivers/ati-drivers-8.542/work/common/usr/include/GL/glATI.h:2417: error: expected ‘)’ before ‘*’ token
/var/tmp/portage/x11-drivers/ati-drivers-8.542/work/common/usr/include/GL/glATI.h:2418: error: expected ‘)’ before ‘*’ token
/var/tmp/portage/x11-drivers/ati-drivers-8.542/work/common/usr/include/GL/glATI.h:2419: error: expected ‘)’ before ‘*’ token
/var/tmp/portage/x11-drivers/ati-drivers-8.542/work/common/usr/include/GL/glATI.h:2420: error: expected ‘)’ before ‘*’ token
/var/tmp/portage/x11-drivers/ati-drivers-8.542/work/common/usr/include/GL/glATI.h:2421: error: expected ‘)’ before ‘*’ token
/var/tmp/portage/x11-drivers/ati-drivers-8.542/work/common/usr/include/GL/glATI.h:2422: error: expected ‘)’ before ‘*’ token
/var/tmp/portage/x11-drivers/ati-drivers-8.542/work/common/usr/include/GL/glATI.h:2423: error: expected ‘)’ before ‘*’ token
/var/tmp/portage/x11-drivers/ati-drivers-8.542/work/common/usr/include/GL/glATI.h:2424: error: expected ‘)’ before ‘*’ token
/var/tmp/portage/x11-drivers/ati-drivers-8.542/work/common/usr/include/GL/glATI.h:2425: error: expected ‘)’ before ‘*’ token
/var/tmp/portage/x11-drivers/ati-drivers-8.542/work/common/usr/include/GL/glATI.h:2426: error: expected ‘)’ before ‘*’ token
/var/tmp/portage/x11-drivers/ati-drivers-8.542/work/common/usr/include/GL/glATI.h:2427: error: expected ‘)’ before ‘*’ token
/var/tmp/portage/x11-drivers/ati-drivers-8.542/work/common/usr/include/GL/glATI.h:2428: error: expected ‘)’ before ‘*’ token
/var/tmp/portage/x11-drivers/ati-drivers-8.542/work/common/usr/include/GL/glATI.h:2429: error: expected ‘)’ before ‘*’ token
/var/tmp/portage/x11-drivers/ati-drivers-8.542/work/common/usr/include/GL/glATI.h:2430: error: expected ‘)’ before ‘*’ token
/var/tmp/portage/x11-drivers/ati-drivers-8.542/work/common/usr/include/GL/glATI.h:2431: error: expected ‘)’ before ‘*’ token
/var/tmp/portage/x11-drivers/ati-drivers-8.542/work/common/usr/include/GL/glATI.h:2432: error: expected ‘)’ before ‘*’ token
/var/tmp/portage/x11-drivers/ati-drivers-8.542/work/common/usr/include/GL/glATI.h:2433: error: expected ‘)’ before ‘*’ token
/var/tmp/portage/x11-drivers/ati-drivers-8.542/work/common/usr/include/GL/glATI.h:2434: error: expected ‘)’ before ‘*’ token
/var/tmp/portage/x11-drivers/ati-drivers-8.542/work/common/usr/include/GL/glATI.h:2435: error: expected ‘)’ before ‘*’ token
/var/tmp/portage/x11-drivers/ati-drivers-8.542/work/common/usr/include/GL/glATI.h:2466: error: expected ‘)’ before ‘*’ token
/var/tmp/portage/x11-drivers/ati-drivers-8.542/work/common/usr/include/GL/glATI.h:2469: error: expected ‘)’ before ‘*’ token
/var/tmp/portage/x11-drivers/ati-drivers-8.542/work/common/usr/include/GL/glATI.h:2476: error: expected ‘)’ before ‘*’ token
/var/tmp/portage/x11-drivers/ati-drivers-8.542/work/common/usr/include/GL/glATI.h:2496: error: expected ‘)’ before ‘*’ token
/var/tmp/portage/x11-drivers/ati-drivers-8.542/work/common/usr/include/GL/glATI.h:2497: error: expected ‘)’ before ‘*’ token
/var/tmp/portage/x11-drivers/ati-drivers-8.542/work/common/usr/include/GL/glATI.h:2498: error: expected ‘)’ before ‘*’ token
/var/tmp/portage/x11-drivers/ati-drivers-8.542/work/common/usr/include/GL/glATI.h:2499: error: expected ‘)’ before ‘*’ token
/var/tmp/portage/x11-drivers/ati-drivers-8.542/work/common/usr/include/GL/glATI.h:2500: error: expected ‘)’ before ‘*’ token
/var/tmp/portage/x11-drivers/ati-drivers-8.542/work/common/usr/include/GL/glATI.h:2501: error: expected ‘)’ before ‘*’ token
/var/tmp/portage/x11-drivers/ati-drivers-8.542/work/common/usr/include/GL/glATI.h:2502: error: expected ‘)’ before ‘*’ token
/var/tmp/portage/x11-drivers/ati-drivers-8.542/work/common/usr/include/GL/glATI.h:2503: error: expected ‘)’ before ‘*’ token
/var/tmp/portage/x11-drivers/ati-drivers-8.542/work/common/usr/include/GL/glATI.h:2504: error: expected ‘)’ before ‘*’ token
/var/tmp/portage/x11-drivers/ati-drivers-8.542/work/common/usr/include/GL/glATI.h:2505: error: expected ‘)’ before ‘*’ token
/var/tmp/portage/x11-drivers/ati-drivers-8.542/work/common/usr/include/GL/glATI.h:2506: error: expected ‘)’ before ‘*’ token
/var/tmp/portage/x11-drivers/ati-drivers-8.542/work/common/usr/include/GL/glATI.h:2507: error: expected ‘)’ before ‘*’ token
/var/tmp/portage/x11-drivers/ati-drivers-8.542/work/common/usr/include/GL/glATI.h:2508: error: expected ‘)’ before ‘*’ token
/var/tmp/portage/x11-drivers/ati-drivers-8.542/work/common/usr/include/GL/glATI.h:2509: error: expected ‘)’ before ‘*’ token
/var/tmp/portage/x11-drivers/ati-drivers-8.542/work/common/usr/include/GL/glATI.h:2510: error: expected ‘)’ before ‘*’ token
/var/tmp/portage/x11-drivers/ati-drivers-8.542/work/common/usr/include/GL/glATI.h:2511: error: expected ‘)’ before ‘*’ token
/var/tmp/portage/x11-drivers/ati-drivers-8.542/work/common/usr/include/GL/glATI.h:2533: error: expected ‘)’ before ‘*’ token
/var/tmp/portage/x11-drivers/ati-drivers-8.542/work/common/usr/include/GL/glATI.h:2534: error: expected ‘)’ before ‘*’ token
/var/tmp/portage/x11-drivers/ati-drivers-8.542/work/common/usr/include/GL/glATI.h:2558: error: expected ‘)’ before ‘*’ token
/var/tmp/portage/x11-drivers/ati-drivers-8.542/work/common/usr/include/GL/glATI.h:2599: error: expected ‘)’ before ‘*’ token
/var/tmp/portage/x11-drivers/ati-drivers-8.542/work/common/usr/include/GL/glATI.h:2622: error: expected ‘)’ before ‘*’ token
/var/tmp/portage/x11-drivers/ati-drivers-8.542/work/common/usr/include/GL/glATI.h:2623: error: expected ‘)’ before ‘*’ token
/var/tmp/portage/x11-drivers/ati-drivers-8.542/work/common/usr/include/GL/glATI.h:2624: error: expected ‘)’ before ‘*’ token
/var/tmp/portage/x11-drivers/ati-drivers-8.542/work/common/usr/include/GL/glATI.h:2652: error: expected ‘)’ before ‘*’ token
/var/tmp/portage/x11-drivers/ati-drivers-8.542/work/common/usr/include/GL/glATI.h:2653: error: expected ‘)’ before ‘*’ token
/var/tmp/portage/x11-drivers/ati-drivers-8.542/work/common/usr/include/GL/glATI.h:2654: error: expected ‘)’ before ‘*’ token
/var/tmp/portage/x11-drivers/ati-drivers-8.542/work/common/usr/include/GL/glATI.h:2655: error: expected ‘)’ before ‘*’ token
/var/tmp/portage/x11-drivers/ati-drivers-8.542/work/common/usr/include/GL/glATI.h:2779: error: expected ‘)’ before ‘*’ token
/var/tmp/portage/x11-drivers/ati-drivers-8.542/work/common/usr/include/GL/glATI.h:2780: error: expected ‘)’ before ‘*’ token
/var/tmp/portage/x11-drivers/ati-drivers-8.542/work/common/usr/include/GL/glATI.h:2781: error: expected ‘)’ before ‘*’ token
/var/tmp/portage/x11-drivers/ati-drivers-8.542/work/common/usr/include/GL/glATI.h:2782: error: expected ‘)’ before ‘*’ token
/var/tmp/portage/x11-drivers/ati-drivers-8.542/work/common/usr/include/GL/glATI.h:2783: error: expected ‘)’ before ‘*’ token
/var/tmp/portage/x11-drivers/ati-drivers-8.542/work/common/usr/include/GL/glATI.h:2784: error: expected ‘)’ before ‘*’ token
/var/tmp/portage/x11-drivers/ati-drivers-8.542/work/common/usr/include/GL/glATI.h:2785: error: expected ‘)’ before ‘*’ token
/var/tmp/portage/x11-drivers/ati-drivers-8.542/work/common/usr/include/GL/glATI.h:2786: error: expected ‘)’ before ‘*’ token
/var/tmp/portage/x11-drivers/ati-drivers-8.542/work/common/usr/include/GL/glATI.h:2789: error: expected ‘)’ before ‘*’ token
/var/tmp/portage/x11-drivers/ati-drivers-8.542/work/common/usr/include/GL/glATI.h:2793: error: expected ‘)’ before ‘*’ token
/var/tmp/portage/x11-drivers/ati-drivers-8.542/work/common/usr/include/GL/glATI.h:2798: error: expected ‘)’ before ‘*’ token
/var/tmp/portage/x11-drivers/ati-drivers-8.542/work/common/usr/include/GL/glATI.h:2800: error: expected ‘)’ before ‘*’ token
/var/tmp/portage/x11-drivers/ati-drivers-8.542/work/common/usr/include/GL/glATI.h:2803: error: expected ‘)’ before ‘*’ token
/var/tmp/portage/x11-drivers/ati-drivers-8.542/work/common/usr/include/GL/glATI.h:2807: error: expected ‘)’ before ‘*’ token
/var/tmp/portage/x11-drivers/ati-drivers-8.542/work/common/usr/include/GL/glATI.h:2826: error: expected ‘=’, ‘,’, ‘;’, ‘asm’ or ‘__attribute__’ before ‘*’ token
/var/tmp/portage/x11-drivers/ati-drivers-8.542/work/common/usr/include/GL/glATI.h:2827: error: expected ‘)’ before ‘*’ token
/var/tmp/portage/x11-drivers/ati-drivers-8.542/work/common/usr/include/GL/glATI.h:2856: error: expected ‘)’ before ‘*’ token
/var/tmp/portage/x11-drivers/ati-drivers-8.542/work/common/usr/include/GL/glATI.h:2857: error: expected ‘)’ before ‘*’ token
/var/tmp/portage/x11-drivers/ati-drivers-8.542/work/common/usr/include/GL/glATI.h:2881: error: expected ‘)’ before ‘*’ token
/var/tmp/portage/x11-drivers/ati-drivers-8.542/work/common/usr/include/GL/glATI.h:2882: error: expected ‘)’ before ‘*’ token
/var/tmp/portage/x11-drivers/ati-drivers-8.542/work/common/usr/include/GL/glATI.h:2996: error: expected ‘)’ before ‘*’ token
/var/tmp/portage/x11-drivers/ati-drivers-8.542/work/common/usr/include/GL/glATI.h:2997: error: expected ‘)’ before ‘*’ token
/var/tmp/portage/x11-drivers/ati-drivers-8.542/work/common/usr/include/GL/glATI.h:2998: error: expected ‘)’ before ‘*’ token
/var/tmp/portage/x11-drivers/ati-drivers-8.542/work/common/usr/include/GL/glATI.h:3000: error: expected ‘)’ before ‘*’ token
/var/tmp/portage/x11-drivers/ati-drivers-8.542/work/common/usr/include/GL/glATI.h:3001: error: expected ‘)’ before ‘*’ token
/var/tmp/portage/x11-drivers/ati-drivers-8.542/work/common/usr/include/GL/glATI.h:3002: error: expected ‘)’ before ‘*’ token
/var/tmp/portage/x11-drivers/ati-drivers-8.542/work/common/usr/include/GL/glATI.h:3003: error: expected ‘)’ before ‘*’ token
/var/tmp/portage/x11-drivers/ati-drivers-8.542/work/common/usr/include/GL/glATI.h:3005: error: expected ‘)’ before ‘*’ token
/var/tmp/portage/x11-drivers/ati-drivers-8.542/work/common/usr/include/GL/glATI.h:3006: error: expected ‘)’ before ‘*’ token
/var/tmp/portage/x11-drivers/ati-drivers-8.542/work/common/usr/include/GL/glATI.h:3007: error: expected ‘)’ before ‘*’ token
/var/tmp/portage/x11-drivers/ati-drivers-8.542/work/common/usr/include/GL/glATI.h:3009: error: expected ‘)’ before ‘*’ token
/var/tmp/portage/x11-drivers/ati-drivers-8.542/work/common/usr/include/GL/glATI.h:3010: error: expected ‘)’ before ‘*’ token
/var/tmp/portage/x11-drivers/ati-drivers-8.542/work/common/usr/include/GL/glATI.h:3028: error: expected ‘)’ before ‘*’ token
/var/tmp/portage/x11-drivers/ati-drivers-8.542/work/common/usr/include/GL/glATI.h:3031: error: expected ‘)’ before ‘*’ token
/var/tmp/portage/x11-drivers/ati-drivers-8.542/work/common/usr/include/GL/glATI.h:3033: error: expected ‘)’ before ‘*’ token
/var/tmp/portage/x11-drivers/ati-drivers-8.542/work/common/usr/include/GL/glATI.h:3064: error: expected ‘)’ before ‘*’ token
/var/tmp/portage/x11-drivers/ati-drivers-8.542/work/common/usr/include/GL/glATI.h:3065: error: expected ‘)’ before ‘*’ token
/var/tmp/portage/x11-drivers/ati-drivers-8.542/work/common/usr/include/GL/glATI.h:3066: error: expected ‘)’ before ‘*’ token
/var/tmp/portage/x11-drivers/ati-drivers-8.542/work/common/usr/include/GL/glATI.h:3067: error: expected ‘)’ before ‘*’ token
/var/tmp/portage/x11-drivers/ati-drivers-8.542/work/common/usr/include/GL/glATI.h:3068: error: expected ‘)’ before ‘*’ token
/var/tmp/portage/x11-drivers/ati-drivers-8.542/work/common/usr/include/GL/glATI.h:3069: error: expected ‘)’ before ‘*’ token
/var/tmp/portage/x11-drivers/ati-drivers-8.542/work/common/usr/include/GL/glATI.h:3070: error: expected ‘)’ before ‘*’ token
/var/tmp/portage/x11-drivers/ati-drivers-8.542/work/common/usr/include/GL/glATI.h:3071: error: expected ‘)’ before ‘*’ token
/var/tmp/portage/x11-drivers/ati-drivers-8.542/work/common/usr/include/GL/glATI.h:3072: error: expected ‘)’ before ‘*’ token
/var/tmp/portage/x11-drivers/ati-drivers-8.542/work/common/usr/include/GL/glATI.h:3073: error: expected ‘)’ before ‘*’ token
/var/tmp/portage/x11-drivers/ati-drivers-8.542/work/common/usr/include/GL/glATI.h:3074: error: expected ‘)’ before ‘*’ token
/var/tmp/portage/x11-drivers/ati-drivers-8.542/work/common/usr/include/GL/glATI.h:3075: error: expected ‘)’ before ‘*’ token
/var/tmp/portage/x11-drivers/ati-drivers-8.542/work/common/usr/include/GL/glATI.h:3076: error: expected ‘)’ before ‘*’ token
/var/tmp/portage/x11-drivers/ati-drivers-8.542/work/common/usr/include/GL/glATI.h:3077: error: expected ‘)’ before ‘*’ token
/var/tmp/portage/x11-drivers/ati-drivers-8.542/work/common/usr/include/GL/glATI.h:3078: error: expected ‘)’ before ‘*’ token
/var/tmp/portage/x11-drivers/ati-drivers-8.542/work/common/usr/include/GL/glATI.h:3079: error: expected ‘)’ before ‘*’ token
/var/tmp/portage/x11-drivers/ati-drivers-8.542/work/common/usr/include/GL/glATI.h:3080: error: expected ‘)’ before ‘*’ token
/var/tmp/portage/x11-drivers/ati-drivers-8.542/work/common/usr/include/GL/glATI.h:3081: error: expected ‘)’ before ‘*’ token
/var/tmp/portage/x11-drivers/ati-drivers-8.542/work/common/usr/include/GL/glATI.h:3082: error: expected ‘)’ before ‘*’ token
/var/tmp/portage/x11-drivers/ati-drivers-8.542/work/common/usr/include/GL/glATI.h:3083: error: expected ‘)’ before ‘*’ token
/var/tmp/portage/x11-drivers/ati-drivers-8.542/work/common/usr/include/GL/glATI.h:3084: error: expected ‘)’ before ‘*’ token
/var/tmp/portage/x11-drivers/ati-drivers-8.542/work/common/usr/include/GL/glATI.h:3085: error: expected ‘)’ before ‘*’ token
/var/tmp/portage/x11-drivers/ati-drivers-8.542/work/common/usr/include/GL/glATI.h:3086: error: expected ‘)’ before ‘*’ token
/var/tmp/portage/x11-drivers/ati-drivers-8.542/work/common/usr/include/GL/glATI.h:3087: error: expected ‘)’ before ‘*’ token
/var/tmp/portage/x11-drivers/ati-drivers-8.542/work/common/usr/include/GL/glATI.h:3088: error: expected ‘)’ before ‘*’ token
/var/tmp/portage/x11-drivers/ati-drivers-8.542/work/common/usr/include/GL/glATI.h:3089: error: expected ‘)’ before ‘*’ token
/var/tmp/portage/x11-drivers/ati-drivers-8.542/work/common/usr/include/GL/glATI.h:3090: error: expected ‘)’ before ‘*’ token
/var/tmp/portage/x11-drivers/ati-drivers-8.542/work/common/usr/include/GL/glATI.h:3091: error: expected ‘)’ before ‘*’ token
/var/tmp/portage/x11-drivers/ati-drivers-8.542/work/common/usr/include/GL/glATI.h:3092: error: expected ‘)’ before ‘*’ token
/var/tmp/portage/x11-drivers/ati-drivers-8.542/work/common/usr/include/GL/glATI.h:3093: error: expected ‘)’ before ‘*’ token
/var/tmp/portage/x11-drivers/ati-drivers-8.542/work/common/usr/include/GL/glATI.h:3094: error: expected ‘)’ before ‘*’ token
/var/tmp/portage/x11-drivers/ati-drivers-8.542/work/common/usr/include/GL/glATI.h:3095: error: expected ‘)’ before ‘*’ token
/var/tmp/portage/x11-drivers/ati-drivers-8.542/work/common/usr/include/GL/glATI.h:3096: error: expected ‘)’ before ‘*’ token
/var/tmp/portage/x11-drivers/ati-drivers-8.542/work/common/usr/include/GL/glATI.h:3097: error: expected ‘)’ before ‘*’ token
/var/tmp/portage/x11-drivers/ati-drivers-8.542/work/common/usr/include/GL/glATI.h:3098: error: expected ‘)’ before ‘*’ token
/var/tmp/portage/x11-drivers/ati-drivers-8.542/work/common/usr/include/GL/glATI.h:3099: error: expected ‘)’ before ‘*’ token
/var/tmp/portage/x11-drivers/ati-drivers-8.542/work/common/usr/include/GL/glATI.h:3100: error: expected ‘)’ before ‘*’ token
/var/tmp/portage/x11-drivers/ati-drivers-8.542/work/common/usr/include/GL/glATI.h:3121: error: expected ‘)’ before ‘*’ token
/var/tmp/portage/x11-drivers/ati-drivers-8.542/work/common/usr/include/GL/glATI.h:3122: error: expected ‘)’ before ‘*’ token
/var/tmp/portage/x11-drivers/ati-drivers-8.542/work/common/usr/include/GL/glATI.h:3123: error: expected ‘)’ before ‘*’ token
/var/tmp/portage/x11-drivers/ati-drivers-8.542/work/common/usr/include/GL/glATI.h:3124: error: expected ‘)’ before ‘*’ token
/var/tmp/portage/x11-drivers/ati-drivers-8.542/work/common/usr/include/GL/glATI.h:3125: error: expected ‘)’ before ‘*’ token
/var/tmp/portage/x11-drivers/ati-drivers-8.542/work/common/usr/include/GL/glATI.h:3126: error: expected ‘)’ before ‘*’ token
/var/tmp/portage/x11-drivers/ati-drivers-8.542/work/common/usr/include/GL/glATI.h:3264: error: expected ‘)’ before ‘*’ token
/var/tmp/portage/x11-drivers/ati-drivers-8.542/work/common/usr/include/GL/glATI.h:3289: error: expected ‘)’ before ‘*’ token
/var/tmp/portage/x11-drivers/ati-drivers-8.542/work/common/usr/include/GL/glATI.h:3312: error: expected ‘)’ before ‘*’ token
/var/tmp/portage/x11-drivers/ati-drivers-8.542/work/common/usr/include/GL/glATI.h:3373: error: expected ‘)’ before ‘*’ token
/var/tmp/portage/x11-drivers/ati-drivers-8.542/work/common/usr/include/GL/glATI.h:3374: error: expected ‘)’ before ‘*’ token
/var/tmp/portage/x11-drivers/ati-drivers-8.542/work/common/usr/include/GL/glATI.h:3396: error: expected ‘)’ before ‘*’ token
/var/tmp/portage/x11-drivers/ati-drivers-8.542/work/common/usr/include/GL/glATI.h:3426: error: expected ‘)’ before ‘*’ token
/var/tmp/portage/x11-drivers/ati-drivers-8.542/work/common/usr/include/GL/glATI.h:3427: error: expected ‘)’ before ‘*’ token
/var/tmp/portage/x11-drivers/ati-drivers-8.542/work/common/usr/include/GL/glATI.h:3428: error: expected ‘)’ before ‘*’ token
/var/tmp/portage/x11-drivers/ati-drivers-8.542/work/common/usr/include/GL/glATI.h:3429: error: expected ‘)’ before ‘*’ token
/var/tmp/portage/x11-drivers/ati-drivers-8.542/work/common/usr/include/GL/glATI.h:3430: error: expected ‘)’ before ‘*’ token
/var/tmp/portage/x11-drivers/ati-drivers-8.542/work/common/usr/include/GL/glATI.h:3503: error: expected ‘)’ before ‘*’ token
/var/tmp/portage/x11-drivers/ati-drivers-8.542/work/common/usr/include/GL/glATI.h:3504: error: expected ‘)’ before ‘*’ token
/var/tmp/portage/x11-drivers/ati-drivers-8.542/work/common/usr/include/GL/glATI.h:3505: error: expected ‘)’ before ‘*’ token
/var/tmp/portage/x11-drivers/ati-drivers-8.542/work/common/usr/include/GL/glATI.h:3506: error: expected ‘)’ before ‘*’ token
/var/tmp/portage/x11-drivers/ati-drivers-8.542/work/common/usr/include/GL/glATI.h:3507: error: expected ‘)’ before ‘*’ token
/var/tmp/portage/x11-drivers/ati-drivers-8.542/work/common/usr/include/GL/glATI.h:3509: error: expected ‘)’ before ‘*’ token
/var/tmp/portage/x11-drivers/ati-drivers-8.542/work/common/usr/include/GL/glATI.h:3510: error: expected ‘)’ before ‘*’ token
/var/tmp/portage/x11-drivers/ati-drivers-8.542/work/common/usr/include/GL/glATI.h:3511: error: expected ‘)’ before ‘*’ token
/var/tmp/portage/x11-drivers/ati-drivers-8.542/work/common/usr/include/GL/glATI.h:3512: error: expected ‘)’ before ‘*’ token
/var/tmp/portage/x11-drivers/ati-drivers-8.542/work/common/usr/include/GL/glATI.h:3513: error: expected ‘)’ before ‘*’ token
/var/tmp/portage/x11-drivers/ati-drivers-8.542/work/common/usr/include/GL/glATI.h:3514: error: expected ‘)’ before ‘*’ token
/var/tmp/portage/x11-drivers/ati-drivers-8.542/work/common/usr/include/GL/glATI.h:3515: error: expected ‘)’ before ‘*’ token
/var/tmp/portage/x11-drivers/ati-drivers-8.542/work/common/usr/include/GL/glATI.h:3517: error: expected ‘)’ before ‘*’ token
/var/tmp/portage/x11-drivers/ati-drivers-8.542/work/common/usr/include/GL/glATI.h:3519: error: expected ‘)’ before ‘*’ token
/var/tmp/portage/x11-drivers/ati-drivers-8.542/work/common/usr/include/GL/glATI.h:3522: error: expected ‘)’ before ‘*’ token
/var/tmp/portage/x11-drivers/ati-drivers-8.542/work/common/usr/include/GL/glATI.h:3524: error: expected ‘)’ before ‘*’ token
/var/tmp/portage/x11-drivers/ati-drivers-8.542/work/common/usr/include/GL/glATI.h:3526: error: expected ‘)’ before ‘*’ token
/var/tmp/portage/x11-drivers/ati-drivers-8.542/work/common/usr/include/GL/glATI.h:3596: error: expected ‘)’ before ‘*’ token
/var/tmp/portage/x11-drivers/ati-drivers-8.542/work/common/usr/include/GL/glATI.h:3597: error: expected ‘)’ before ‘*’ token
/var/tmp/portage/x11-drivers/ati-drivers-8.542/work/common/usr/include/GL/glATI.h:3598: error: expected ‘)’ before ‘*’ token
/var/tmp/portage/x11-drivers/ati-drivers-8.542/work/common/usr/include/GL/glATI.h:3599: error: expected ‘)’ before ‘*’ token
/var/tmp/portage/x11-drivers/ati-drivers-8.542/work/common/usr/include/GL/glATI.h:3600: error: expected ‘)’ before ‘*’ token
/var/tmp/portage/x11-drivers/ati-drivers-8.542/work/common/usr/include/GL/glATI.h:3601: error: expected ‘)’ before ‘*’ token
/var/tmp/portage/x11-drivers/ati-drivers-8.542/work/common/usr/include/GL/glATI.h:3602: error: expected ‘)’ before ‘*’ token
/var/tmp/portage/x11-drivers/ati-drivers-8.542/work/common/usr/include/GL/glATI.h:3603: error: expected ‘)’ before ‘*’ token
/var/tmp/portage/x11-drivers/ati-drivers-8.542/work/common/usr/include/GL/glATI.h:3604: error: expected ‘)’ before ‘*’ token
/var/tmp/portage/x11-drivers/ati-drivers-8.542/work/common/usr/include/GL/glATI.h:3605: error: expected ‘)’ before ‘*’ token
/var/tmp/portage/x11-drivers/ati-drivers-8.542/work/common/usr/include/GL/glATI.h:3606: error: expected ‘)’ before ‘*’ token
/var/tmp/portage/x11-drivers/ati-drivers-8.542/work/common/usr/include/GL/glATI.h:3607: error: expected ‘)’ before ‘*’ token
/var/tmp/portage/x11-drivers/ati-drivers-8.542/work/common/usr/include/GL/glATI.h:3608: error: expected ‘)’ before ‘*’ token
/var/tmp/portage/x11-drivers/ati-drivers-8.542/work/common/usr/include/GL/glATI.h:3609: error: expected ‘)’ before ‘*’ token
/var/tmp/portage/x11-drivers/ati-drivers-8.542/work/common/usr/include/GL/glATI.h:3610: error: expected ‘)’ before ‘*’ token
/var/tmp/portage/x11-drivers/ati-drivers-8.542/work/common/usr/include/GL/glATI.h:3611: error: expected ‘)’ before ‘*’ token
/var/tmp/portage/x11-drivers/ati-drivers-8.542/work/common/usr/include/GL/glATI.h:3612: error: expected ‘)’ before ‘*’ token
/var/tmp/portage/x11-drivers/ati-drivers-8.542/work/common/usr/include/GL/glATI.h:3613: error: expected ‘)’ before ‘*’ token
/var/tmp/portage/x11-drivers/ati-drivers-8.542/work/common/usr/include/GL/glATI.h:3614: error: expected ‘)’ before ‘*’ token
/var/tmp/portage/x11-drivers/ati-drivers-8.542/work/common/usr/include/GL/glATI.h:3615: error: expected ‘)’ before ‘*’ token
/var/tmp/portage/x11-drivers/ati-drivers-8.542/work/common/usr/include/GL/glATI.h:3616: error: expected ‘)’ before ‘*’ token
/var/tmp/portage/x11-drivers/ati-drivers-8.542/work/common/usr/include/GL/glATI.h:3617: error: expected ‘)’ before ‘*’ token
/var/tmp/portage/x11-drivers/ati-drivers-8.542/work/common/usr/include/GL/glATI.h:3618: error: expected ‘)’ before ‘*’ token
/var/tmp/portage/x11-drivers/ati-drivers-8.542/work/common/usr/include/GL/glATI.h:3619: error: expected ‘)’ before ‘*’ token
/var/tmp/portage/x11-drivers/ati-drivers-8.542/work/common/usr/include/GL/glATI.h:3620: error: expected ‘)’ before ‘*’ token
/var/tmp/portage/x11-drivers/ati-drivers-8.542/work/common/usr/include/GL/glATI.h:3621: error: expected ‘)’ before ‘*’ token
/var/tmp/portage/x11-drivers/ati-drivers-8.542/work/common/usr/include/GL/glATI.h:3622: error: expected ‘)’ before ‘*’ token
/var/tmp/portage/x11-drivers/ati-drivers-8.542/work/common/usr/include/GL/glATI.h:3623: error: expected ‘)’ before ‘*’ token
/var/tmp/portage/x11-drivers/ati-drivers-8.542/work/common/usr/include/GL/glATI.h:3624: error: expected ‘)’ before ‘*’ token
/var/tmp/portage/x11-drivers/ati-drivers-8.542/work/common/usr/include/GL/glATI.h:3625: error: expected ‘)’ before ‘*’ token
/var/tmp/portage/x11-drivers/ati-drivers-8.542/work/common/usr/include/GL/glATI.h:3626: error: expected ‘)’ before ‘*’ token
/var/tmp/portage/x11-drivers/ati-drivers-8.542/work/common/usr/include/GL/glATI.h:3627: error: expected ‘)’ before ‘*’ token
/var/tmp/portage/x11-drivers/ati-drivers-8.542/work/common/usr/include/GL/glATI.h:3628: error: expected ‘)’ before ‘*’ token
/var/tmp/portage/x11-drivers/ati-drivers-8.542/work/common/usr/include/GL/glATI.h:3629: error: expected ‘)’ before ‘*’ token
/var/tmp/portage/x11-drivers/ati-drivers-8.542/work/common/usr/include/GL/glATI.h:3648: error: expected ‘)’ before ‘*’ token
/var/tmp/portage/x11-drivers/ati-drivers-8.542/work/common/usr/include/GL/glATI.h:3649: error: expected ‘)’ before ‘*’ token
/var/tmp/portage/x11-drivers/ati-drivers-8.542/work/common/usr/include/GL/glATI.h:3696: error: expected ‘)’ before ‘*’ token
/var/tmp/portage/x11-drivers/ati-drivers-8.542/work/common/usr/include/GL/glATI.h:3697: error: expected ‘)’ before ‘*’ token
/var/tmp/portage/x11-drivers/ati-drivers-8.542/work/common/usr/include/GL/glATI.h:3764: error: expected ‘)’ before ‘*’ token
/var/tmp/portage/x11-drivers/ati-drivers-8.542/work/common/usr/include/GL/glATI.h:3765: error: expected ‘)’ before ‘*’ token
/var/tmp/portage/x11-drivers/ati-drivers-8.542/work/common/usr/include/GL/glATI.h:3766: error: expected ‘)’ before ‘*’ token
/var/tmp/portage/x11-drivers/ati-drivers-8.542/work/common/usr/include/GL/glATI.h:3767: error: expected ‘)’ before ‘*’ token
/var/tmp/portage/x11-drivers/ati-drivers-8.542/work/common/usr/include/GL/glATI.h:3768: error: expected ‘)’ before ‘*’ token
/var/tmp/portage/x11-drivers/ati-drivers-8.542/work/common/usr/include/GL/glATI.h:3769: error: expected ‘)’ before ‘*’ token
/var/tmp/portage/x11-drivers/ati-drivers-8.542/work/common/usr/include/GL/glATI.h:3770: error: expected ‘)’ before ‘*’ token
/var/tmp/portage/x11-drivers/ati-drivers-8.542/work/common/usr/include/GL/glATI.h:3771: error: expected ‘)’ before ‘*’ token
/var/tmp/portage/x11-drivers/ati-drivers-8.542/work/common/usr/include/GL/glATI.h:3773: error: expected ‘)’ before ‘*’ token
/var/tmp/portage/x11-drivers/ati-drivers-8.542/work/common/usr/include/GL/glATI.h:3774: error: expected ‘)’ before ‘*’ token
/var/tmp/portage/x11-drivers/ati-drivers-8.542/work/common/usr/include/GL/glATI.h:3775: error: expected ‘)’ before ‘*’ token
/var/tmp/portage/x11-drivers/ati-drivers-8.542/work/common/usr/include/GL/glATI.h:3776: error: expected ‘)’ before ‘*’ token
/var/tmp/portage/x11-drivers/ati-drivers-8.542/work/common/usr/include/GL/glATI.h:3777: error: expected ‘)’ before ‘*’ token
/var/tmp/portage/x11-drivers/ati-drivers-8.542/work/common/usr/include/GL/glATI.h:3778: error: expected ‘)’ before ‘*’ token
/var/tmp/portage/x11-drivers/ati-drivers-8.542/work/common/usr/include/GL/glATI.h:3779: error: expected ‘)’ before ‘*’ token
/var/tmp/portage/x11-drivers/ati-drivers-8.542/work/common/usr/include/GL/glATI.h:3780: error: expected ‘)’ before ‘*’ token
/var/tmp/portage/x11-drivers/ati-drivers-8.542/work/common/usr/include/GL/glATI.h:3782: error: expected ‘)’ before ‘*’ token
/var/tmp/portage/x11-drivers/ati-drivers-8.542/work/common/usr/include/GL/glATI.h:3889: error: expected ‘)’ before ‘*’ token
/var/tmp/portage/x11-drivers/ati-drivers-8.542/work/common/usr/include/GL/glATI.h:4125: error: expected ‘)’ before ‘*’ token
/var/tmp/portage/x11-drivers/ati-drivers-8.542/work/common/usr/include/GL/glATI.h:4126: error: expected ‘)’ before ‘*’ token
/var/tmp/portage/x11-drivers/ati-drivers-8.542/work/common/usr/include/GL/glATI.h:4127: error: expected ‘)’ before ‘*’ token
/var/tmp/portage/x11-drivers/ati-drivers-8.542/work/common/usr/include/GL/glATI.h:4128: error: expected ‘)’ before ‘*’ token
/var/tmp/portage/x11-drivers/ati-drivers-8.542/work/common/usr/include/GL/glATI.h:4129: error: expected ‘)’ before ‘*’ token
/var/tmp/portage/x11-drivers/ati-drivers-8.542/work/common/usr/include/GL/glATI.h:4130: error: expected ‘)’ before ‘*’ token
/var/tmp/portage/x11-drivers/ati-drivers-8.542/work/common/usr/include/GL/glATI.h:4207: error: expected ‘)’ before ‘*’ token
/var/tmp/portage/x11-drivers/ati-drivers-8.542/work/common/usr/include/GL/glATI.h:4208: error: expected ‘)’ before ‘*’ token
/var/tmp/portage/x11-drivers/ati-drivers-8.542/work/common/usr/include/GL/glATI.h:4209: error: expected ‘)’ before ‘*’ token
/var/tmp/portage/x11-drivers/ati-drivers-8.542/work/common/usr/include/GL/glATI.h:4210: error: expected ‘)’ before ‘*’ token
/var/tmp/portage/x11-drivers/ati-drivers-8.542/work/common/usr/include/GL/glATI.h:4211: error: expected ‘)’ before ‘*’ token
/var/tmp/portage/x11-drivers/ati-drivers-8.542/work/common/usr/include/GL/glATI.h:4212: error: expected ‘)’ before ‘*’ token
/var/tmp/portage/x11-drivers/ati-drivers-8.542/work/common/usr/include/GL/glATI.h:4213: error: expected ‘)’ before ‘*’ token
/var/tmp/portage/x11-drivers/ati-drivers-8.542/work/common/usr/include/GL/glATI.h:4214: error: expected ‘)’ before ‘*’ token
/var/tmp/portage/x11-drivers/ati-drivers-8.542/work/common/usr/include/GL/glATI.h:4215: error: expected ‘)’ before ‘*’ token
/var/tmp/portage/x11-drivers/ati-drivers-8.542/work/common/usr/include/GL/glATI.h:4345: error: expected ‘)’ before ‘*’ token
/var/tmp/portage/x11-drivers/ati-drivers-8.542/work/common/usr/include/GL/glATI.h:4346: error: expected ‘)’ before ‘*’ token
/var/tmp/portage/x11-drivers/ati-drivers-8.542/work/common/usr/include/GL/glATI.h:4347: error: expected ‘)’ before ‘*’ token
/var/tmp/portage/x11-drivers/ati-drivers-8.542/work/common/usr/include/GL/glATI.h:4348: error: expected ‘)’ before ‘*’ token
/var/tmp/portage/x11-drivers/ati-drivers-8.542/work/common/usr/include/GL/glATI.h:4349: error: expected ‘)’ before ‘*’ token
/var/tmp/portage/x11-drivers/ati-drivers-8.542/work/common/usr/include/GL/glATI.h:4350: error: expected ‘)’ before ‘*’ token
/var/tmp/portage/x11-drivers/ati-drivers-8.542/work/common/usr/include/GL/glATI.h:4351: error: expected ‘)’ before ‘*’ token
/var/tmp/portage/x11-drivers/ati-drivers-8.542/work/common/usr/include/GL/glATI.h:4353: error: expected ‘)’ before ‘*’ token
/var/tmp/portage/x11-drivers/ati-drivers-8.542/work/common/usr/include/GL/glATI.h:4355: error: expected ‘)’ before ‘*’ token
/var/tmp/portage/x11-drivers/ati-drivers-8.542/work/common/usr/include/GL/glATI.h:4357: error: expected ‘)’ before ‘*’ token
/var/tmp/portage/x11-drivers/ati-drivers-8.542/work/common/usr/include/GL/glATI.h:4359: error: expected ‘)’ before ‘*’ token
/var/tmp/portage/x11-drivers/ati-drivers-8.542/work/common/usr/include/GL/glATI.h:4360: error: expected ‘)’ before ‘*’ token
/var/tmp/portage/x11-drivers/ati-drivers-8.542/work/common/usr/include/GL/glATI.h:4361: error: expected ‘)’ before ‘*’ token
/var/tmp/portage/x11-drivers/ati-drivers-8.542/work/common/usr/include/GL/glATI.h:4363: error: expected ‘)’ before ‘*’ token
/var/tmp/portage/x11-drivers/ati-drivers-8.542/work/common/usr/include/GL/glATI.h:4364: error: expected ‘)’ before ‘*’ token
/var/tmp/portage/x11-drivers/ati-drivers-8.542/work/common/usr/include/GL/glATI.h:4365: error: expected ‘)’ before ‘*’ token
/var/tmp/portage/x11-drivers/ati-drivers-8.542/work/common/usr/include/GL/glATI.h:4366: error: expected ‘)’ before ‘*’ token
/var/tmp/portage/x11-drivers/ati-drivers-8.542/work/common/usr/include/GL/glATI.h:4367: error: expected ‘)’ before ‘*’ token
/var/tmp/portage/x11-drivers/ati-drivers-8.542/work/common/usr/include/GL/glATI.h:4368: error: expected ‘)’ before ‘*’ token
/var/tmp/portage/x11-drivers/ati-drivers-8.542/work/common/usr/include/GL/glATI.h:4369: error: expected ‘)’ before ‘*’ token
/var/tmp/portage/x11-drivers/ati-drivers-8.542/work/common/usr/include/GL/glATI.h:4370: error: expected ‘)’ before ‘*’ token
/var/tmp/portage/x11-drivers/ati-drivers-8.542/work/common/usr/include/GL/glATI.h:4371: error: expected ‘)’ before ‘*’ token
/var/tmp/portage/x11-drivers/ati-drivers-8.542/work/common/usr/include/GL/glATI.h:4372: error: expected ‘)’ before ‘*’ token
/var/tmp/portage/x11-drivers/ati-drivers-8.542/work/common/usr/include/GL/glATI.h:4373: error: expected ‘)’ before ‘*’ token
/var/tmp/portage/x11-drivers/ati-drivers-8.542/work/common/usr/include/GL/glATI.h:4375: error: expected ‘)’ before ‘*’ token
/var/tmp/portage/x11-drivers/ati-drivers-8.542/work/common/usr/include/GL/glATI.h:4376: error: expected ‘)’ before ‘*’ token
/var/tmp/portage/x11-drivers/ati-drivers-8.542/work/common/usr/include/GL/glATI.h:4377: error: expected ‘)’ before ‘*’ token
/var/tmp/portage/x11-drivers/ati-drivers-8.542/work/common/usr/include/GL/glATI.h:4378: error: expected ‘)’ before ‘*’ token
/var/tmp/portage/x11-drivers/ati-drivers-8.542/work/common/usr/include/GL/glATI.h:4379: error: expected ‘)’ before ‘*’ token
/var/tmp/portage/x11-drivers/ati-drivers-8.542/work/common/usr/include/GL/glATI.h:4381: error: expected ‘)’ before ‘*’ token
/var/tmp/portage/x11-drivers/ati-drivers-8.542/work/common/usr/include/GL/glATI.h:4382: error: expected ‘)’ before ‘*’ token
/var/tmp/portage/x11-drivers/ati-drivers-8.542/work/common/usr/include/GL/glATI.h:4383: error: expected ‘)’ before ‘*’ token
/var/tmp/portage/x11-drivers/ati-drivers-8.542/work/common/usr/include/GL/glATI.h:4384: error: expected ‘)’ before ‘*’ token
/var/tmp/portage/x11-drivers/ati-drivers-8.542/work/common/usr/include/GL/glATI.h:4386: error: expected ‘)’ before ‘*’ token
/var/tmp/portage/x11-drivers/ati-drivers-8.542/work/common/usr/include/GL/glATI.h:4388: error: expected ‘)’ before ‘*’ token
/var/tmp/portage/x11-drivers/ati-drivers-8.542/work/common/usr/include/GL/glATI.h:4390: error: expected ‘)’ before ‘*’ token
/var/tmp/portage/x11-drivers/ati-drivers-8.542/work/common/usr/include/GL/glATI.h:4392: error: expected ‘)’ before ‘*’ token
/var/tmp/portage/x11-drivers/ati-drivers-8.542/work/common/usr/include/GL/glATI.h:4394: error: expected ‘)’ before ‘*’ token
/var/tmp/portage/x11-drivers/ati-drivers-8.542/work/common/usr/include/GL/glATI.h:4396: error: expected ‘)’ before ‘*’ token
/var/tmp/portage/x11-drivers/ati-drivers-8.542/work/common/usr/include/GL/glATI.h:4398: error: expected ‘)’ before ‘*’ token
/var/tmp/portage/x11-drivers/ati-drivers-8.542/work/common/usr/include/GL/glATI.h:4400: error: expected ‘)’ before ‘*’ token
/var/tmp/portage/x11-drivers/ati-drivers-8.542/work/common/usr/include/GL/glATI.h:4402: error: expected ‘)’ before ‘*’ token
/var/tmp/portage/x11-drivers/ati-drivers-8.542/work/common/usr/include/GL/glATI.h:4469: error: expected ‘)’ before ‘*’ token
/var/tmp/portage/x11-drivers/ati-drivers-8.542/work/common/usr/include/GL/glATI.h:4470: error: expected ‘)’ before ‘*’ token
/var/tmp/portage/x11-drivers/ati-drivers-8.542/work/common/usr/include/GL/glATI.h:4471: error: expected ‘)’ before ‘*’ token
/var/tmp/portage/x11-drivers/ati-drivers-8.542/work/common/usr/include/GL/glATI.h:4472: error: expected ‘)’ before ‘*’ token
/var/tmp/portage/x11-drivers/ati-drivers-8.542/work/common/usr/include/GL/glATI.h:4473: error: expected ‘)’ before ‘*’ token
/var/tmp/portage/x11-drivers/ati-drivers-8.542/work/common/usr/include/GL/glATI.h:4474: error: expected ‘)’ before ‘*’ token
/var/tmp/portage/x11-drivers/ati-drivers-8.542/work/common/usr/include/GL/glATI.h:4475: error: expected ‘)’ before ‘*’ token
/var/tmp/portage/x11-drivers/ati-drivers-8.542/work/common/usr/include/GL/glATI.h:4626: error: expected ‘)’ before ‘*’ token
/var/tmp/portage/x11-drivers/ati-drivers-8.542/work/common/usr/include/GL/glATI.h:4627: error: expected ‘)’ before ‘*’ token
/var/tmp/portage/x11-drivers/ati-drivers-8.542/work/common/usr/include/GL/glATI.h:4628: error: expected ‘)’ before ‘*’ token
/var/tmp/portage/x11-drivers/ati-drivers-8.542/work/common/usr/include/GL/glATI.h:4629: error: expected ‘)’ before ‘*’ token
/var/tmp/portage/x11-drivers/ati-drivers-8.542/work/common/usr/include/GL/glATI.h:4630: error: expected ‘)’ before ‘*’ token
/var/tmp/portage/x11-drivers/ati-drivers-8.542/work/common/usr/include/GL/glATI.h:4631: error: expected ‘)’ before ‘*’ token
/var/tmp/portage/x11-drivers/ati-drivers-8.542/work/common/usr/include/GL/glATI.h:4632: error: expected ‘)’ before ‘*’ token
/var/tmp/portage/x11-drivers/ati-drivers-8.542/work/common/usr/include/GL/glATI.h:4633: error: expected ‘)’ before ‘*’ token
/var/tmp/portage/x11-drivers/ati-drivers-8.542/work/common/usr/include/GL/glATI.h:4634: error: expected ‘)’ before ‘*’ token
/var/tmp/portage/x11-drivers/ati-drivers-8.542/work/common/usr/include/GL/glATI.h:4635: error: expected ‘)’ before ‘*’ token
/var/tmp/portage/x11-drivers/ati-drivers-8.542/work/common/usr/include/GL/glATI.h:4636: error: expected ‘)’ before ‘*’ token
/var/tmp/portage/x11-drivers/ati-drivers-8.542/work/common/usr/include/GL/glATI.h:4637: error: expected ‘)’ before ‘*’ token
/var/tmp/portage/x11-drivers/ati-drivers-8.542/work/common/usr/include/GL/glATI.h:4638: error: expected ‘)’ before ‘*’ token
/var/tmp/portage/x11-drivers/ati-drivers-8.542/work/common/usr/include/GL/glATI.h:4639: error: expected ‘)’ before ‘*’ token
/var/tmp/portage/x11-drivers/ati-drivers-8.542/work/common/usr/include/GL/glATI.h:4640: error: expected ‘)’ before ‘*’ token
/var/tmp/portage/x11-drivers/ati-drivers-8.542/work/common/usr/include/GL/glATI.h:4641: error: expected ‘)’ before ‘*’ token
/var/tmp/portage/x11-drivers/ati-drivers-8.542/work/common/usr/include/GL/glATI.h:4642: error: expected ‘)’ before ‘*’ token
/var/tmp/portage/x11-drivers/ati-drivers-8.542/work/common/usr/include/GL/glATI.h:4643: error: expected ‘)’ before ‘*’ token
/var/tmp/portage/x11-drivers/ati-drivers-8.542/work/common/usr/include/GL/glATI.h:4644: error: expected ‘)’ before ‘*’ token
/var/tmp/portage/x11-drivers/ati-drivers-8.542/work/common/usr/include/GL/glATI.h:4645: error: expected ‘)’ before ‘*’ token
/var/tmp/portage/x11-drivers/ati-drivers-8.542/work/common/usr/include/GL/glATI.h:4646: error: expected ‘)’ before ‘*’ token
/var/tmp/portage/x11-drivers/ati-drivers-8.542/work/common/usr/include/GL/glATI.h:4647: error: expected ‘)’ before ‘*’ token
/var/tmp/portage/x11-drivers/ati-drivers-8.542/work/common/usr/include/GL/glATI.h:4648: error: expected ‘)’ before ‘*’ token
/var/tmp/portage/x11-drivers/ati-drivers-8.542/work/common/usr/include/GL/glATI.h:4649: error: expected ‘)’ before ‘*’ token
/var/tmp/portage/x11-drivers/ati-drivers-8.542/work/common/usr/include/GL/glATI.h:4650: error: expected ‘)’ before ‘*’ token
/var/tmp/portage/x11-drivers/ati-drivers-8.542/work/common/usr/include/GL/glATI.h:4651: error: expected ‘)’ before ‘*’ token
/var/tmp/portage/x11-drivers/ati-drivers-8.542/work/common/usr/include/GL/glATI.h:4652: error: expected ‘)’ before ‘*’ token
/var/tmp/portage/x11-drivers/ati-drivers-8.542/work/common/usr/include/GL/glATI.h:4653: error: expected ‘)’ before ‘*’ token
/var/tmp/portage/x11-drivers/ati-drivers-8.542/work/common/usr/include/GL/glATI.h:4654: error: expected ‘)’ before ‘*’ token
/var/tmp/portage/x11-drivers/ati-drivers-8.542/work/common/usr/include/GL/glATI.h:4655: error: expected ‘)’ before ‘*’ token
/var/tmp/portage/x11-drivers/ati-drivers-8.542/work/common/usr/include/GL/glATI.h:4656: error: expected ‘)’ before ‘*’ token
/var/tmp/portage/x11-drivers/ati-drivers-8.542/work/common/usr/include/GL/glATI.h:4657: error: expected ‘)’ before ‘*’ token
/var/tmp/portage/x11-drivers/ati-drivers-8.542/work/common/usr/include/GL/glATI.h:4658: error: expected ‘)’ before ‘*’ token
/var/tmp/portage/x11-drivers/ati-drivers-8.542/work/common/usr/include/GL/glATI.h:4659: error: expected ‘)’ before ‘*’ token
/var/tmp/portage/x11-drivers/ati-drivers-8.542/work/common/usr/include/GL/glATI.h:4660: error: expected ‘)’ before ‘*’ token
/var/tmp/portage/x11-drivers/ati-drivers-8.542/work/common/usr/include/GL/glATI.h:4739: error: expected ‘)’ before ‘*’ token
/var/tmp/portage/x11-drivers/ati-drivers-8.542/work/common/usr/include/GL/glATI.h:4740: error: expected ‘)’ before ‘*’ token
fgl_glxgears.c:92: error: expected ‘=’, ‘,’, ‘;’, ‘asm’ or ‘__attribute__’ before ‘glGenFramebuffersEXT’
fgl_glxgears.c:93: error: expected ‘=’, ‘,’, ‘;’, ‘asm’ or ‘__attribute__’ before ‘glBindFramebufferEXT’
fgl_glxgears.c:94: error: expected ‘=’, ‘,’, ‘;’, ‘asm’ or ‘__attribute__’ before ‘glFramebufferTexture2DEXT’
fgl_glxgears.c:95: error: expected ‘=’, ‘,’, ‘;’, ‘asm’ or ‘__attribute__’ before ‘glGenRenderbuffersEXT’
fgl_glxgears.c:96: error: expected ‘=’, ‘,’, ‘;’, ‘asm’ or ‘__attribute__’ before ‘glBindRenderbufferEXT’
fgl_glxgears.c:97: error: expected ‘=’, ‘,’, ‘;’, ‘asm’ or ‘__attribute__’ before ‘glRenderbufferStorageEXT’
fgl_glxgears.c:98: error: expected ‘=’, ‘,’, ‘;’, ‘asm’ or ‘__attribute__’ before ‘glFramebufferRenderbufferEXT’
fgl_glxgears.c:99: error: expected ‘=’, ‘,’, ‘;’, ‘asm’ or ‘__attribute__’ before ‘glDeleteFramebuffersEXT’
fgl_glxgears.c:100: error: expected ‘=’, ‘,’, ‘;’, ‘asm’ or ‘__attribute__’ before ‘glDeleteRenderbuffersEXT’
fgl_glxgears.c:111: error: expected ‘=’, ‘,’, ‘;’, ‘asm’ or ‘__attribute__’ before ‘pbuf’
fgl_glxgears.c:112: error: expected ‘=’, ‘,’, ‘;’, ‘asm’ or ‘__attribute__’ before ‘ctx_win’
fgl_glxgears.c:116: error: expected ‘=’, ‘,’, ‘;’, ‘asm’ or ‘__attribute__’ before ‘view_rotx’
fgl_glxgears.c:119: error: expected ‘=’, ‘,’, ‘;’, ‘asm’ or ‘__attribute__’ before ‘gear1’
fgl_glxgears.c:122: error: expected ‘=’, ‘,’, ‘;’, ‘asm’ or ‘__attribute__’ before ‘angle’
fgl_glxgears.c:123: error: expected ‘=’, ‘,’, ‘;’, ‘asm’ or ‘__attribute__’ before ‘gearsFB’
fgl_glxgears.c:126: error: expected ‘=’, ‘,’, ‘;’, ‘asm’ or ‘__attribute__’ before ‘rotX’
fgl_glxgears.c:127: error: expected ‘=’, ‘,’, ‘;’, ‘asm’ or ‘__attribute__’ before ‘rotY’
fgl_glxgears.c:128: error: expected ‘=’, ‘,’, ‘;’, ‘asm’ or ‘__attribute__’ before ‘rotZ’
fgl_glxgears.c:129: error: expected ‘=’, ‘,’, ‘;’, ‘asm’ or ‘__attribute__’ before ‘texture’
fgl_glxgears.c:145: error: expected ‘)’ before ‘inner_radius’
fgl_glxgears.c: In function ‘reshapeGears’:
fgl_glxgears.c:275: error: ‘GLfloat’ undeclared (first use in this function)
fgl_glxgears.c:275: error: (Each undeclared identifier is reported only once
fgl_glxgears.c:275: error: for each function it appears in.)
fgl_glxgears.c:275: error: expected ‘;’ before ‘h’
fgl_glxgears.c:279: error: ‘GLint’ undeclared (first use in this function)
fgl_glxgears.c:279: error: expected ‘)’ before ‘width’
fgl_glxgears.c:283: error: expected ‘)’ before ‘width’
fgl_glxgears.c:286: error: ‘GL_PROJECTION’ undeclared (first use in this function)
fgl_glxgears.c:288: error: ‘h’ undeclared (first use in this function)
fgl_glxgears.c:289: error: ‘GL_MODELVIEW’ undeclared (first use in this function)
fgl_glxgears.c: In function ‘setCommonGearsState’:
fgl_glxgears.c:298: error: expected ‘=’, ‘,’, ‘;’, ‘asm’ or ‘__attribute__’ before ‘pos’
fgl_glxgears.c:298: error: ‘pos’ undeclared (first use in this function)
fgl_glxgears.c:298: error: expected expression before ‘{’ token
fgl_glxgears.c:300: error: ‘GL_UNPACK_ALIGNMENT’ undeclared (first use in this function)
fgl_glxgears.c:305: error: ‘GL_LIGHT0’ undeclared (first use in this function)
fgl_glxgears.c:305: error: ‘GL_POSITION’ undeclared (first use in this function)
fgl_glxgears.c:306: error: ‘GL_TEXTURE_2D’ undeclared (first use in this function)
fgl_glxgears.c:307: error: ‘GL_CULL_FACE’ undeclared (first use in this function)
fgl_glxgears.c:308: error: ‘GL_LIGHTING’ undeclared (first use in this function)
fgl_glxgears.c:310: error: ‘GL_DEPTH_TEST’ undeclared (first use in this function)
fgl_glxgears.c: In function ‘drawGears’:
fgl_glxgears.c:318: error: ‘gearsFB’ undeclared (first use in this function)
fgl_glxgears.c:319: error: ‘gearsDB’ undeclared (first use in this function)
fgl_glxgears.c:321: error: ‘GL_TEXTURE_2D’ undeclared (first use in this function)
fgl_glxgears.c:321: error: ‘texture’ undeclared (first use in this function)
fgl_glxgears.c:328: error: ‘GL_SCISSOR_TEST’ undeclared (first use in this function)
fgl_glxgears.c:332: error: ‘pbuf’ undeclared (first use in this function)
fgl_glxgears.c:332: error: ‘ctx_pbuf’ undeclared (first use in this function)
fgl_glxgears.c:335: error: ‘GL_COLOR_BUFFER_BIT’ undeclared (first use in this function)
fgl_glxgears.c:335: error: ‘GL_DEPTH_BUFFER_BIT’ undeclared (first use in this function)
fgl_glxgears.c:338: error: ‘view_rotx’ undeclared (first use in this function)
fgl_glxgears.c:339: error: ‘view_roty’ undeclared (first use in this function)
fgl_glxgears.c:340: error: ‘view_rotz’ undeclared (first use in this function)
fgl_glxgears.c:344: error: ‘angle’ undeclared (first use in this function)
fgl_glxgears.c:345: error: ‘gear1’ undeclared (first use in this function)
fgl_glxgears.c:351: error: ‘gear2’ undeclared (first use in this function)
fgl_glxgears.c:357: error: ‘gear3’ undeclared (first use in this function)
fgl_glxgears.c: In function ‘setCommonWindowState’:
fgl_glxgears.c:386: error: ‘GL_DEPTH_TEST’ undeclared (first use in this function)
fgl_glxgears.c:387: error: ‘GL_TEXTURE_2D’ undeclared (first use in this function)
fgl_glxgears.c:388: error: ‘GL_LIGHTING’ undeclared (first use in this function)
fgl_glxgears.c:389: error: ‘GL_SMOOTH’ undeclared (first use in this function)
fgl_glxgears.c:390: error: ‘GL_LEQUAL’ undeclared (first use in this function)
fgl_glxgears.c:391: error: ‘GL_PERSPECTIVE_CORRECTION_HINT’ undeclared (first use in this function)
fgl_glxgears.c:391: error: ‘GL_NICEST’ undeclared (first use in this function)
fgl_glxgears.c:392: error: ‘GL_BACK’ undeclared (first use in this function)
fgl_glxgears.c:393: error: ‘GL_CULL_FACE’ undeclared (first use in this function)
fgl_glxgears.c:394: error: ‘GL_UNPACK_ALIGNMENT’ undeclared (first use in this function)
fgl_glxgears.c: In function ‘reshapeCube’:
fgl_glxgears.c:456: error: ‘GL_PROJECTION’ undeclared (first use in this function)
fgl_glxgears.c:458: error: ‘GLfloat’ undeclared (first use in this function)
fgl_glxgears.c:458: error: expected ‘)’ before ‘width’
fgl_glxgears.c:459: error: ‘GL_MODELVIEW’ undeclared (first use in this function)
fgl_glxgears.c: In function ‘drawCube’:
fgl_glxgears.c:473: error: ‘ctx_win’ undeclared (first use in this function)
fgl_glxgears.c:476: error: ‘GL_COLOR_BUFFER_BIT’ undeclared (first use in this function)
fgl_glxgears.c:476: error: ‘GL_DEPTH_BUFFER_BIT’ undeclared (first use in this function)
fgl_glxgears.c:480: error: ‘rotX’ undeclared (first use in this function)
fgl_glxgears.c:481: error: ‘rotY’ undeclared (first use in this function)
fgl_glxgears.c:482: error: ‘rotZ’ undeclared (first use in this function)
fgl_glxgears.c:484: error: ‘GL_TEXTURE_2D’ undeclared (first use in this function)
fgl_glxgears.c:484: error: ‘texture’ undeclared (first use in this function)
fgl_glxgears.c:486: error: ‘GL_QUADS’ undeclared (first use in this function)
fgl_glxgears.c: In function ‘init’:
fgl_glxgears.c:562: error: expected ‘=’, ‘,’, ‘;’, ‘asm’ or ‘__attribute__’ before ‘red’
fgl_glxgears.c:562: error: ‘red’ undeclared (first use in this function)
fgl_glxgears.c:562: error: expected expression before ‘{’ token
fgl_glxgears.c:563: error: expected ‘=’, ‘,’, ‘;’, ‘asm’ or ‘__attribute__’ before ‘green’
fgl_glxgears.c:563: error: ‘green’ undeclared (first use in this function)
fgl_glxgears.c:563: error: expected expression before ‘{’ token
fgl_glxgears.c:564: error: expected ‘=’, ‘,’, ‘;’, ‘asm’ or ‘__attribute__’ before ‘blue’
fgl_glxgears.c:564: error: ‘blue’ undeclared (first use in this function)
fgl_glxgears.c:564: error: expected expression before ‘{’ token
fgl_glxgears.c:579: error: ‘ctx_win’ undeclared (first use in this function)
fgl_glxgears.c:585: error: ‘texture’ undeclared (first use in this function)
fgl_glxgears.c:586: error: ‘GL_TEXTURE_2D’ undeclared (first use in this function)
fgl_glxgears.c:587: error: ‘GL_TEXTURE_MIN_FILTER’ undeclared (first use in this function)
fgl_glxgears.c:587: error: ‘GL_LINEAR’ undeclared (first use in this function)
fgl_glxgears.c:588: error: ‘GL_TEXTURE_MAG_FILTER’ undeclared (first use in this function)
fgl_glxgears.c:589: error: ‘GL_RGBA’ undeclared (first use in this function)
fgl_glxgears.c:591: error: ‘GL_UNSIGNED_BYTE’ undeclared (first use in this function)
fgl_glxgears.c:597: error: ‘pbuf’ undeclared (first use in this function)
fgl_glxgears.c:597: error: ‘ctx_pbuf’ undeclared (first use in this function)
fgl_glxgears.c:603: error: ‘gear1’ undeclared (first use in this function)
fgl_glxgears.c:604: error: ‘GL_COMPILE’ undeclared (first use in this function)
fgl_glxgears.c:605: error: ‘GL_FRONT’ undeclared (first use in this function)
fgl_glxgears.c:605: error: ‘GL_AMBIENT_AND_DIFFUSE’ undeclared (first use in this function)
fgl_glxgears.c:609: error: ‘gear2’ undeclared (first use in this function)
fgl_glxgears.c:615: error: ‘gear3’ undeclared (first use in this function)
fgl_glxgears.c:621: error: ‘GL_NORMALIZE’ undeclared (first use in this function)
fgl_glxgears.c: In function ‘make_window’:
fgl_glxgears.c:630: error: ‘GLX_RGBA’ undeclared (first use in this function)
fgl_glxgears.c:631: error: ‘GLX_RED_SIZE’ undeclared (first use in this function)
fgl_glxgears.c:632: error: ‘GLX_GREEN_SIZE’ undeclared (first use in this function)
fgl_glxgears.c:633: error: ‘GLX_BLUE_SIZE’ undeclared (first use in this function)
fgl_glxgears.c:634: error: ‘GLX_DOUBLEBUFFER’ undeclared (first use in this function)
fgl_glxgears.c:635: error: ‘GLX_DEPTH_SIZE’ undeclared (first use in this function)
fgl_glxgears.c:641: error: ‘XVisualInfo’ undeclared (first use in this function)
fgl_glxgears.c:641: error: ‘visinfo’ undeclared (first use in this function)
fgl_glxgears.c:641: error: invalid operands to binary *
fgl_glxgears.c:654: error: request for member ‘visual’ in something not a structure or union
fgl_glxgears.c:654: warning: passing argument 3 of ‘XCreateColormap’ from incompatible pointer type
fgl_glxgears.c:667: error: request for member ‘depth’ in something not a structure or union
fgl_glxgears.c:668: error: request for member ‘visual’ in something not a structure or union
fgl_glxgears.c:668: warning: passing argument 8 of ‘XCreateWindow’ makes integer from pointer without a cast
fgl_glxgears.c:668: warning: passing argument 10 of ‘XCreateWindow’ from incompatible pointer type
fgl_glxgears.c:672: error: ‘XSizeHints’ undeclared (first use in this function)
fgl_glxgears.c:672: error: expected ‘;’ before ‘sizehints’
fgl_glxgears.c:673: error: ‘sizehints’ undeclared (first use in this function)
fgl_glxgears.c:673: error: request for member ‘x’ in something not a structure or union
fgl_glxgears.c:674: error: request for member ‘y’ in something not a structure or union
fgl_glxgears.c:675: error: request for member ‘width’ in something not a structure or union
fgl_glxgears.c:676: error: request for member ‘height’ in something not a structure or union
fgl_glxgears.c:677: error: request for member ‘flags’ in something not a structure or union
fgl_glxgears.c:677: error: ‘USSize’ undeclared (first use in this function)
fgl_glxgears.c:677: error: ‘USPosition’ undeclared (first use in this function)
fgl_glxgears.c:677: error: invalid operands to binary |
fgl_glxgears.c:683: error: ‘ctx_win’ undeclared (first use in this function)
fgl_glxgears.c:683: error: ‘GL_TRUE’ undeclared (first use in this function)
fgl_glxgears.c: In function ‘make_fbo’:
fgl_glxgears.c:698: error: ‘glGenFramebuffersEXT’ undeclared (first use in this function)
fgl_glxgears.c:698: error: ‘PFNGLGENFRAMEBUFFERSEXTPROC’ undeclared (first use in this function)
fgl_glxgears.c:698: error: expected ‘;’ before ‘glXGetProcAddressARB’
fgl_glxgears.c:699: error: ‘glBindFramebufferEXT’ undeclared (first use in this function)
fgl_glxgears.c:699: error: ‘PFNGLBINDFRAMEBUFFEREXTPROC’ undeclared (first use in this function)
fgl_glxgears.c:699: error: expected ‘;’ before ‘glXGetProcAddressARB’
fgl_glxgears.c:700: error: ‘glFramebufferTexture2DEXT’ undeclared (first use in this function)
fgl_glxgears.c:700: error: ‘PFNGLFRAMEBUFFERTEXTURE2DEXTPROC’ undeclared (first use in this function)
fgl_glxgears.c:700: error: expected ‘;’ before ‘glXGetProcAddressARB’
fgl_glxgears.c:701: error: ‘glGenRenderbuffersEXT’ undeclared (first use in this function)
fgl_glxgears.c:701: error: ‘PFNGLGENRENDERBUFFERSEXTPROC’ undeclared (first use in this function)
fgl_glxgears.c:701: error: expected ‘;’ before ‘glXGetProcAddressARB’
fgl_glxgears.c:702: error: ‘glBindRenderbufferEXT’ undeclared (first use in this function)
fgl_glxgears.c:702: error: ‘PFNGLBINDRENDERBUFFEREXTPROC’ undeclared (first use in this function)
fgl_glxgears.c:702: error: expected ‘;’ before ‘glXGetProcAddressARB’
fgl_glxgears.c:703: error: ‘glRenderbufferStorageEXT’ undeclared (first use in this function)
fgl_glxgears.c:703: error: ‘PFNGLRENDERBUFFERSTORAGEEXTPROC’ undeclared (first use in this function)
fgl_glxgears.c:703: error: expected ‘;’ before ‘glXGetProcAddressARB’
fgl_glxgears.c:704: error: ‘glFramebufferRenderbufferEXT’ undeclared (first use in this function)
fgl_glxgears.c:704: error: ‘PFNGLFRAMEBUFFERRENDERBUFFEREXTPROC’ undeclared (first use in this function)
fgl_glxgears.c:704: error: expected ‘;’ before ‘glXGetProcAddressARB’
fgl_glxgears.c:705: error: ‘glDeleteFramebuffersEXT’ undeclared (first use in this function)
fgl_glxgears.c:705: error: ‘PFNGLDELETEFRAMEBUFFERSEXTPROC’ undeclared (first use in this function)
fgl_glxgears.c:705: error: expected ‘;’ before ‘glXGetProcAddressARB’
fgl_glxgears.c:706: error: ‘glDeleteRenderbuffersEXT’ undeclared (first use in this function)
fgl_glxgears.c:706: error: ‘PFNGLDELETERENDERBUFFERSEXTPROC’ undeclared (first use in this function)
fgl_glxgears.c:706: error: expected ‘;’ before ‘glXGetProcAddressARB’
fgl_glxgears.c:709: error: ‘gearsFB’ undeclared (first use in this function)
fgl_glxgears.c:712: error: ‘gearsDB’ undeclared (first use in this function)
fgl_glxgears.c:714: error: ‘GL_DEPTH_COMPONENT’ undeclared (first use in this function)
fgl_glxgears.c: In function ‘make_pbuffer’:
fgl_glxgears.c:727: error: ‘GLXFBConfig’ undeclared (first use in this function)
fgl_glxgears.c:727: error: ‘fbconfig’ undeclared (first use in this function)
fgl_glxgears.c:727: error: invalid operands to binary *
fgl_glxgears.c:728: error: ‘XVisualInfo’ undeclared (first use in this function)
fgl_glxgears.c:728: error: ‘visinfo’ undeclared (first use in this function)
fgl_glxgears.c:728: error: invalid operands to binary *
fgl_glxgears.c:732: error: ‘GLX_DOUBLEBUFFER’ undeclared (first use in this function)
fgl_glxgears.c:732: warning: initialization makes integer from pointer without a cast
fgl_glxgears.c:733: error: ‘GLX_RED_SIZE’ undeclared (first use in this function)
fgl_glxgears.c:733: warning: initialization makes integer from pointer without a cast
fgl_glxgears.c:734: error: ‘GLX_GREEN_SIZE’ undeclared (first use in this function)
fgl_glxgears.c:734: warning: initialization makes integer from pointer without a cast
fgl_glxgears.c:735: error: ‘GLX_BLUE_SIZE’ undeclared (first use in this function)
fgl_glxgears.c:735: warning: initialization makes integer from pointer without a cast
fgl_glxgears.c:736: error: ‘GLX_DEPTH_SIZE’ undeclared (first use in this function)
fgl_glxgears.c:736: warning: initialization makes integer from pointer without a cast
fgl_glxgears.c:737: error: ‘GLX_RENDER_TYPE’ undeclared (first use in this function)
fgl_glxgears.c:737: warning: initialization makes integer from pointer without a cast
fgl_glxgears.c:737: error: ‘GLX_RGBA_BIT’ undeclared (first use in this function)
fgl_glxgears.c:737: warning: initialization makes integer from pointer without a cast
fgl_glxgears.c:738: error: ‘GLX_DRAWABLE_TYPE’ undeclared (first use in this function)
fgl_glxgears.c:738: warning: initialization makes integer from pointer without a cast
fgl_glxgears.c:738: error: ‘GLX_PBUFFER_BIT’ undeclared (first use in this function)
fgl_glxgears.c:738: error: ‘GLX_WINDOW_BIT’ undeclared (first use in this function)
fgl_glxgears.c:738: error: invalid operands to binary |
fgl_glxgears.c:738: warning: initialization makes integer from pointer without a cast
fgl_glxgears.c:742: error: ‘GLX_PBUFFER_WIDTH’ undeclared (first use in this function)
fgl_glxgears.c:742: warning: initialization makes integer from pointer without a cast
fgl_glxgears.c:743: error: ‘GLX_PBUFFER_HEIGHT’ undeclared (first use in this function)
fgl_glxgears.c:743: warning: initialization makes integer from pointer without a cast
fgl_glxgears.c:744: error: ‘GLX_LARGEST_PBUFFER’ undeclared (first use in this function)
fgl_glxgears.c:744: warning: initialization makes integer from pointer without a cast
fgl_glxgears.c:760: error: ‘pbuf’ undeclared (first use in this function)
fgl_glxgears.c:768: error: ‘ctx_pbuf’ undeclared (first use in this function)
fgl_glxgears.c:768: error: ‘ctx_win’ undeclared (first use in this function)
fgl_glxgears.c:768: error: ‘GL_TRUE’ undeclared (first use in this function)
fgl_glxgears.c: In function ‘event_loop’:
fgl_glxgears.c:792: error: ‘ctx_win’ undeclared (first use in this function)
fgl_glxgears.c:803: error: ‘view_roty’ undeclared (first use in this function)
fgl_glxgears.c:809: error: ‘view_rotx’ undeclared (first use in this function)
fgl_glxgears.c:827: error: ‘angle’ undeclared (first use in this function)
fgl_glxgears.c:830: error: invalid operands to binary >
fgl_glxgears.c:849: error: ‘GLfloat’ undeclared (first use in this function)
fgl_glxgears.c:849: error: expected ‘;’ before ‘seconds’
fgl_glxgears.c:850: error: expected ‘;’ before ‘fps’
fgl_glxgears.c:851: error: ‘seconds’ undeclared (first use in this function)
fgl_glxgears.c:852: error: ‘fps’ undeclared (first use in this function)
fgl_glxgears.c: In function ‘main’:
fgl_glxgears.c:891: error: ‘GLboolean’ undeclared (first use in this function)
fgl_glxgears.c:891: error: expected ‘;’ before ‘printInfo’
fgl_glxgears.c:923: error: ‘printInfo’ undeclared (first use in this function)
fgl_glxgears.c:923: error: ‘GL_TRUE’ undeclared (first use in this function)
fgl_glxgears.c:960: error: ‘GL_RENDERER’ undeclared (first use in this function)
fgl_glxgears.c:961: error: ‘GL_VERSION’ undeclared (first use in this function)
fgl_glxgears.c:962: error: ‘GL_VENDOR’ undeclared (first use in this function)
fgl_glxgears.c:963: error: ‘GL_EXTENSIONS’ undeclared (first use in this function)
fgl_glxgears.c:982: error: ‘gearsDB’ undeclared (first use in this function)
fgl_glxgears.c:983: error: ‘gearsFB’ undeclared (first use in this function)
fgl_glxgears.c:987: error: ‘ctx_pbuf’ undeclared (first use in this function)
fgl_glxgears.c:988: error: ‘pbuf’ undeclared (first use in this function)
fgl_glxgears.c:992: error: ‘ctx_win’ undeclared (first use in this function)
 * 
 * ERROR: x11-drivers/ati-drivers-8.542 failed.
 * Call stack:
 *               ebuild.sh, line   49:  Called src_compile
 *             environment, line 3217:  Called die
 * The specific snippet of code:
 *       "$(tc-getCC)" -o fgl_glxgears ${CFLAGS} ${LDFLAGS} -DUSE_GLU -I"${S}"/common/usr/include fgl_glxgears.c -lGL -lGLU -lX11 -lm || die "fgl_glxgears build failed";
 *  The die message:
 *   fgl_glxgears build failed
 * 
 * If you need support, post the topmost build error, and the call stack if relevant.
 * A complete build log is located at '/var/tmp/portage/x11-drivers/ati-drivers-8.542/temp/build.log'.
 * The ebuild environment file is located at '/var/tmp/portage/x11-drivers/ati-drivers-8.542/temp/environment'.
 *