All pastes #125783 Raw Edit

Untitled

public text v1 · immutable
·published 2006-08-10 22:24 UTC
rendered paste body
/var/tmp/portage/libstdc++-v3-3.3.4/work/build/gcc/xgcc -B/var/tmp/portage/libstdc++-v3-3.3.4/work/build/gcc/ -B/usr/i686-pc-linux-gnu/bin/ -B/usr/i686-pc-linux-gnu/lib/ -isystem /usr/i686-pc-linux-gnu/include -O2 -DIN_GCC    -W -Wall -Wwrite-strings -Wstrict-prototypes -Wmissing-prototypes -isystem ./include  -I. -I. -I/var/tmp/portage/libstdc++-v3-3.3.4/work/gcc-3.3.4/gcc -I/var/tmp/portage/libstdc++-v3-3.3.4/work/gcc-3.3.4/gcc/. -I/var/tmp/portage/libstdc++-v3-3.3.4/work/gcc-3.3.4/gcc/config -I/var/tmp/portage/libstdc++-v3-3.3.4/work/gcc-3.3.4/gcc/../include  -g0 -finhibit-size-directive -fno-inline-functions -fno-exceptions -fno-zero-initialized-in-bss -fno-omit-frame-pointer -fPIC \
   -c /var/tmp/portage/libstdc++-v3-3.3.4/work/gcc-3.3.4/gcc/crtstuff.c -DCRT_BEGIN -DCRTSTUFFS_O \
  -o crtbeginS.o
/var/tmp/portage/libstdc++-v3-3.3.4/temp/ccKwTKlz.s: Assembler messages:
/var/tmp/portage/libstdc++-v3-3.3.4/temp/ccKwTKlz.s:33: Error: suffix or operands invalid for `push'
/var/tmp/portage/libstdc++-v3-3.3.4/temp/ccKwTKlz.s:46: Error: suffix or operands invalid for `call'
/var/tmp/portage/libstdc++-v3-3.3.4/temp/ccKwTKlz.s:64: Error: suffix or operands invalid for `push'
/var/tmp/portage/libstdc++-v3-3.3.4/temp/ccKwTKlz.s:78: Error: suffix or operands invalid for `pop'
/var/tmp/portage/libstdc++-v3-3.3.4/temp/ccIAd3Dy.s: Assembler messages:
/var/tmp/portage/libstdc++-v3-3.3.4/temp/ccIAd3Dy.s:34: Error: suffix or operands invalid for `push'
/var/tmp/portage/libstdc++-v3-3.3.4/temp/ccIAd3Dy.s:36: Error: suffix or operands invalid for `push'
/var/tmp/portage/libstdc++-v3-3.3.4/temp/ccIAd3Dy.s:39: Internal error, aborting at /var/tmp/portage/binutils-2.16.1-r3/work/binutils-2.16.1/gas/config/tc-i386.c line 3652 in output_imm
Please report this bug.
make[1]: *** [crtbegin.o] Error 1
make[1]: *** Waiting for unfinished jobs....
make[1]: *** [crtbeginS.o] Error 1
make[1]: Leaving directory `/var/tmp/portage/libstdc++-v3-3.3.4/work/build/gcc'
make: *** [all-gcc] Error 2

!!! ERROR: sys-libs/libstdc++-v3-3.3.4 failed.
Call stack:
  ebuild.sh, line 1539:   Called dyn_compile
  ebuild.sh, line 939:   Called src_compile
  libstdc++-v3-3.3.4.ebuild, line 233:   Called die

!!! (no error message)
!!! If you need support, post the topmost build error, and the call stack if relevant.