All pastes #125709 Raw Edit

Miscellany

public text v1 · immutable
·published 2006-08-10 21:05 UTC
rendered paste body
LANG=C make
/home/guillaume/Prgm/ffmpeg/version.sh "/home/guillaume/Prgm/ffmpeg"
make -C libavutil   all
make[1]: Entering directory `/home/guillaume/Prgm/ffmpeg/libavutil'
make[1]: Nothing to be done for `all'.
make[1]: Leaving directory `/home/guillaume/Prgm/ffmpeg/libavutil'
make -C libavcodec  all
make[1]: Entering directory `/home/guillaume/Prgm/ffmpeg/libavcodec'
make[1]: Nothing to be done for `all'.
make[1]: Leaving directory `/home/guillaume/Prgm/ffmpeg/libavcodec'
make -C libavformat all
make[1]: Entering directory `/home/guillaume/Prgm/ffmpeg/libavformat'
make[1]: Nothing to be done for `all'.
make[1]: Leaving directory `/home/guillaume/Prgm/ffmpeg/libavformat'
make -C libswscale  all
make[1]: Entering directory `/home/guillaume/Prgm/ffmpeg/libswscale'
gcc -O3  -g -Wdeclaration-after-statement -Wall -Wno-switch -I.. -I/home/guillaume/Prgm/ffmpeg -I/home/guillaume/Prgm/ffmpeg/libavutil -DHAVE_AV_CONFIG_H -D_FILE_OFFSET_BITS=64 -D_LARGEFILE_SOURCE -D_GNU_SOURCE  -c -o swscale.o swscale.c
swscale.c:74:24: error: img_format.h: No such file or directory
swscale.c:215: error: 'IMGFMT_I420' undeclared here (not in a function)
swscale.c:216: error: 'IMGFMT_Y422' undeclared here (not in a function)
swscale.c:217: error: 'IMGFMT_RGB24' undeclared here (not in a function)
swscale.c:218: error: 'IMGFMT_BGR24' undeclared here (not in a function)
swscale.c:219: error: 'IMGFMT_422P' undeclared here (not in a function)
swscale.c:220: error: 'IMGFMT_444P' undeclared here (not in a function)
swscale.c:221: error: 'IMGFMT_RGB32' undeclared here (not in a function)
swscale.c:222: error: 'IMGFMT_YVU9' undeclared here (not in a function)
swscale.c:223: error: 'IMGFMT_411P' undeclared here (not in a function)
swscale.c:224: error: 'IMGFMT_RGB16' undeclared here (not in a function)
swscale.c:225: error: 'IMGFMT_RGB15' undeclared here (not in a function)
swscale.c:226: error: 'IMGFMT_UYVY' undeclared here (not in a function)
swscale.c:227: error: 'IMGFMT_Y800' undeclared here (not in a function)
swscale.c: In function 'yuv2nv12XinC':
swscale.c:308: error: 'IMGFMT_NV12' undeclared (first use in this function)
swscale.c:308: error: (Each undeclared identifier is reported only once
swscale.c:308: error: for each function it appears in.)
swscale.c: In function 'yuv2packedXinC':
swscale.c:614: error: 'IMGFMT_BGR32' undeclared (first use in this function)
swscale.c:643: error: 'IMGFMT_BGR16' undeclared (first use in this function)
swscale.c:658: error: 'IMGFMT_BGR15' undeclared (first use in this function)
swscale.c:672: error: 'IMGFMT_RGB8' undeclared (first use in this function)
swscale.c:673: error: 'IMGFMT_BGR8' undeclared (first use in this function)
swscale.c:683: error: 'IMGFMT_RGB4' undeclared (first use in this function)
swscale.c:684: error: 'IMGFMT_BGR4' undeclared (first use in this function)
swscale.c:694: error: 'IMGFMT_RG4B' undeclared (first use in this function)
swscale.c:695: error: 'IMGFMT_BG4B' undeclared (first use in this function)
swscale.c:705: error: 'IMGFMT_RGB1' undeclared (first use in this function)
swscale.c:706: error: 'IMGFMT_BGR1' undeclared (first use in this function)
swscale.c:739: error: 'IMGFMT_YUY2' undeclared (first use in this function)
swscale.c:740: warning: unused variable 'g'
swscale.c:740: warning: unused variable 'b'
swscale.c:740: warning: unused variable 'r'
swscale.c:748: warning: unused variable 'g'
swscale.c:748: warning: unused variable 'b'
swscale.c:748: warning: unused variable 'r'
In file included from swscale.c:827:
swscale_template.c:19:22: error: asmalign.h: No such file or directory
In file included from swscale.c:827:
swscale_template.c: In function 'yuv2yuvX_MMX':
swscale_template.c:934: error: syntax error before 'ASMALIGN16'
swscale_template.c:935: error: syntax error before 'ASMALIGN16'
swscale_template.c:938: error: syntax error before 'ASMALIGN16'
swscale_template.c:941: error: syntax error before 'ASMALIGN16'
swscale_template.c:942: error: syntax error before 'ASMALIGN16'
swscale_template.c:945: error: syntax error before 'ASMALIGN16'
swscale_template.c: In function 'yuv2yuv1_MMX':
swscale_template.c:976: error: syntax error before 'ASMALIGN16'
swscale_template.c:983: error: syntax error before 'ASMALIGN16'
swscale_template.c:991: error: syntax error before 'ASMALIGN16'
swscale_template.c: In function 'yuv2packedX_MMX':
swscale_template.c:1041: error: 'IMGFMT_BGR32' undeclared (first use in this function)
swscale_template.c:1042: error: syntax error before 'ASMALIGN16'
swscale_template.c:1049: error: syntax error before 'ASMALIGN16'
swscale_template.c:1062: error: 'IMGFMT_BGR15' undeclared (first use in this function)
swscale_template.c:1063: error: syntax error before 'ASMALIGN16'
swscale_template.c:1075: error: 'IMGFMT_BGR16' undeclared (first use in this function)
swscale_template.c:1076: error: syntax error before 'ASMALIGN16'
swscale_template.c:1088: error: 'IMGFMT_YUY2' undeclared (first use in this function)
swscale_template.c:1089: error: syntax error before 'ASMALIGN16'
swscale_template.c:1104: error: syntax error before 'ASMALIGN16'
swscale_template.c:1110: error: syntax error before 'ASMALIGN16'
swscale_template.c:1123: error: syntax error before 'ASMALIGN16'
swscale_template.c:1136: error: syntax error before 'ASMALIGN16'
swscale_template.c:1149: error: syntax error before 'ASMALIGN16'
swscale_template.c:1037: warning: unused variable 'dummy'
swscale_template.c: In function 'yuv2packed2_MMX':
swscale_template.c:1408: error: 'IMGFMT_BGR32' undeclared (first use in this function)
swscale_template.c:1413: error: syntax error before 'ASMALIGN16'
swscale_template.c:1427: error: syntax error before 'ASMALIGN16'
swscale_template.c:1435: error: 'IMGFMT_BGR15' undeclared (first use in this function)
swscale_template.c:1440: error: syntax error before 'ASMALIGN16'
swscale_template.c:1456: error: 'IMGFMT_BGR16' undeclared (first use in this function)
swscale_template.c:1461: error: syntax error before 'ASMALIGN16'
swscale_template.c:1476: error: 'IMGFMT_YUY2' undeclared (first use in this function)
swscale_template.c:1481: error: syntax error before 'ASMALIGN16'
swscale_template.c:1492: error: 'IMGFMT_RGB8' undeclared (first use in this function)
swscale_template.c:1492: error: 'IMGFMT_BGR8' undeclared (first use in this function)
swscale_template.c:1492: error: 'IMGFMT_RGB4' undeclared (first use in this function)
swscale_template.c:1492: error: 'IMGFMT_BGR4' undeclared (first use in this function)
swscale_template.c:1492: error: 'IMGFMT_RG4B' undeclared (first use in this function)
swscale_template.c:1492: error: 'IMGFMT_BG4B' undeclared (first use in this function)
swscale_template.c:1492: error: 'IMGFMT_RGB1' undeclared (first use in this function)
swscale_template.c:1492: error: 'IMGFMT_BGR1' undeclared (first use in this function)
swscale_template.c: In function 'yuv2packed1_MMX':
swscale_template.c:1518: error: 'IMGFMT_BGR32' undeclared (first use in this function)
swscale_template.c:1523: error: syntax error before 'ASMALIGN16'
swscale_template.c:1537: error: syntax error before 'ASMALIGN16'
swscale_template.c:1546: error: 'IMGFMT_BGR15' undeclared (first use in this function)
swscale_template.c:1551: error: syntax error before 'ASMALIGN16'
swscale_template.c:1566: error: 'IMGFMT_BGR16' undeclared (first use in this function)
swscale_template.c:1571: error: syntax error before 'ASMALIGN16'
swscale_template.c:1587: error: 'IMGFMT_YUY2' undeclared (first use in this function)
swscale_template.c:1592: error: syntax error before 'ASMALIGN16'
swscale_template.c:1612: error: syntax error before 'ASMALIGN16'
swscale_template.c:1626: error: syntax error before 'ASMALIGN16'
swscale_template.c:1640: error: syntax error before 'ASMALIGN16'
swscale_template.c:1660: error: syntax error before 'ASMALIGN16'
swscale_template.c:1681: error: syntax error before 'ASMALIGN16'
swscale_template.c:1695: error: 'IMGFMT_RGB8' undeclared (first use in this function)
swscale_template.c:1695: error: 'IMGFMT_BGR8' undeclared (first use in this function)
swscale_template.c:1695: error: 'IMGFMT_RGB4' undeclared (first use in this function)
swscale_template.c:1695: error: 'IMGFMT_BGR4' undeclared (first use in this function)
swscale_template.c:1695: error: 'IMGFMT_RG4B' undeclared (first use in this function)
swscale_template.c:1695: error: 'IMGFMT_BG4B' undeclared (first use in this function)
swscale_template.c:1695: error: 'IMGFMT_RGB1' undeclared (first use in this function)
swscale_template.c:1695: error: 'IMGFMT_BGR1' undeclared (first use in this function)
swscale_template.c: In function 'bgr24ToY_MMX':
swscale_template.c:1871: error: syntax error before 'ASMALIGN16'
swscale_template.c: In function 'bgr24ToUV_MMX':
swscale_template.c:1957: error: syntax error before 'ASMALIGN16'
swscale_template.c: In function 'hScale_MMX':
swscale_template.c:2264: error: syntax error before 'ASMALIGN16'
swscale_template.c:2302: error: syntax error before 'ASMALIGN16'
swscale_template.c:2351: error: syntax error before 'ASMALIGN16'
swscale_template.c:2343: warning: unused variable 'offset'
swscale_template.c: In function 'hyscale_MMX':
swscale_template.c:2421: error: 'IMGFMT_YUY2' undeclared (first use in this function)
swscale_template.c:2431: error: 'IMGFMT_BGR32' undeclared (first use in this function)
swscale_template.c:2441: error: 'IMGFMT_BGR16' undeclared (first use in this function)
swscale_template.c:2446: error: 'IMGFMT_BGR15' undeclared (first use in this function)
swscale_template.c:2469: warning: pointer targets in passing argument 1 of 'hScale_MMX' differ in signedness
swscale_template.c:2535: error: syntax error before 'ASMALIGN16'
swscale_template.c:2529: warning: unused variable 'xInc_mask'
swscale_template.c:2528: warning: unused variable 'xInc_shr16'
swscale_template.c: In function 'hcscale_MMX':
swscale_template.c:2593: error: 'IMGFMT_YUY2' undeclared (first use in this function)
swscale_template.c:2605: error: 'IMGFMT_BGR32' undeclared (first use in this function)
swscale_template.c:2617: error: 'IMGFMT_BGR16' undeclared (first use in this function)
swscale_template.c:2623: error: 'IMGFMT_BGR15' undeclared (first use in this function)
swscale_template.c:2653: warning: pointer targets in passing argument 1 of 'hScale_MMX' differ in signedness
swscale_template.c:2654: warning: pointer targets in passing argument 1 of 'hScale_MMX' differ in signedness
swscale_template.c:2732: error: syntax error before 'ASMALIGN16'
swscale_template.c:2727: warning: unused variable 'xInc_mask'
swscale_template.c:2726: warning: unused variable 'xInc_shr16'
swscale_template.c: In function 'swScale_MMX':
swscale_template.c:2840: error: 'IMGFMT_YUY2' undeclared (first use in this function)
swscale_template.c:2840: error: 'IMGFMT_RGB_MASK' undeclared (first use in this function)
swscale_template.c:2840: error: 'IMGFMT_RGB' undeclared (first use in this function)
swscale_template.c:2840: error: 'IMGFMT_BGR_MASK' undeclared (first use in this function)
swscale_template.c:2840: error: 'IMGFMT_BGR' undeclared (first use in this function)
swscale_template.c:2926: warning: pointer targets in passing argument 1 of 'hyscale_MMX' differ in signedness
swscale_template.c:2943: warning: pointer targets in passing argument 1 of 'hcscale_MMX' differ in signedness
swscale_template.c:2968: warning: pointer targets in passing argument 1 of 'hyscale_MMX' differ in signedness
swscale_template.c:2984: warning: pointer targets in passing argument 1 of 'hcscale_MMX' differ in signedness
swscale_template.c:3007: warning: assignment makes integer from pointer without a cast
swscale_template.c:3008: warning: assignment makes integer from pointer without a cast
swscale_template.c:3014: warning: assignment makes integer from pointer without a cast
swscale_template.c:3015: warning: assignment makes integer from pointer without a cast
swscale_template.c:3037: error: 'IMGFMT_NV12' undeclared (first use in this function)
swscale_template.c:3037: error: 'IMGFMT_NV21' undeclared (first use in this function)
swscale_template.c:3045: error: 'IMGFMT_YV12' undeclared (first use in this function)
swscale_template.c:3071: warning: pointer targets in passing argument 2 of 'yuv2packed1_MMX' differ in signedness
swscale_template.c:3071: warning: pointer targets in passing argument 3 of 'yuv2packed1_MMX' differ in signedness
swscale_template.c:3071: warning: pointer targets in passing argument 4 of 'yuv2packed1_MMX' differ in signedness
swscale_template.c:3082: warning: pointer targets in passing argument 2 of 'yuv2packed2_MMX' differ in signedness
swscale_template.c:3082: warning: pointer targets in passing argument 3 of 'yuv2packed2_MMX' differ in signedness
swscale_template.c:3082: warning: pointer targets in passing argument 4 of 'yuv2packed2_MMX' differ in signedness
swscale_template.c:3082: warning: pointer targets in passing argument 5 of 'yuv2packed2_MMX' differ in signedness
swscale.c: In function 'PlanarToNV12Wrapper':
swscale.c:1483: error: 'IMGFMT_NV12' undeclared (first use in this function)
swscale.c: In function 'rgb2rgbWrapper':
swscale.c:1521: error: 'IMGFMT_BGR_MASK' undeclared (first use in this function)swscale.c:1521: error: 'IMGFMT_BGR' undeclared (first use in this function)
swscale.c:1522: error: 'IMGFMT_RGB_MASK' undeclared (first use in this function)swscale.c:1522: error: 'IMGFMT_RGB' undeclared (first use in this function)
swscale.c: In function 'yvu9toyv12Wrapper':
swscale.c:1616: error: 'IMGFMT_YV12' undeclared (first use in this function)
swscale.c: In function 'sws_orderYUV':
swscale.c:1630: error: 'IMGFMT_YV12' undeclared (first use in this function)
swscale.c:1639: error: 'IMGFMT_YUY2' undeclared (first use in this function)
swscale.c:1639: error: 'IMGFMT_RGB_MASK' undeclared (first use in this function)swscale.c:1639: error: 'IMGFMT_RGB' undeclared (first use in this function)
swscale.c:1639: error: 'IMGFMT_BGR_MASK' undeclared (first use in this function)swscale.c:1639: error: 'IMGFMT_BGR' undeclared (first use in this function)
swscale.c:1639: error: 'IMGFMT_Y8' undeclared (first use in this function)
swscale.c:1648: error: 'IMGFMT_IYUV' undeclared (first use in this function)
swscale.c:1657: error: 'IMGFMT_NV12' undeclared (first use in this function)
swscale.c:1657: error: 'IMGFMT_NV21' undeclared (first use in this function)
swscale.c: In function 'simpleCopy':
swscale.c:1674: error: 'IMGFMT_YUY2' undeclared (first use in this function)
swscale.c:1674: error: 'IMGFMT_RGB_MASK' undeclared (first use in this function)swscale.c:1674: error: 'IMGFMT_RGB' undeclared (first use in this function)
swscale.c:1674: error: 'IMGFMT_BGR_MASK' undeclared (first use in this function)swscale.c:1674: error: 'IMGFMT_BGR' undeclared (first use in this function)
swscale.c: In function 'remove_dup_fourcc':
swscale.c:1739: error: 'IMGFMT_IYUV' undeclared (first use in this function)
swscale.c:1739: error: 'IMGFMT_YV12' undeclared (first use in this function)
swscale.c:1740: error: 'IMGFMT_Y8' undeclared (first use in this function)
swscale.c:1741: error: 'IMGFMT_IF09' undeclared (first use in this function)
swscale.c: In function 'getSubSampleFactors':
swscale.c:1749: error: 'IMGFMT_YUY2' undeclared (first use in this function)
swscale.c:1753: error: 'IMGFMT_YV12' undeclared (first use in this function)
swscale.c:1755: error: 'IMGFMT_NV12' undeclared (first use in this function)
swscale.c:1756: error: 'IMGFMT_NV21' undeclared (first use in this function)
swscale.c: In function 'sws_setColorspaceDetails':
swscale.c:1803: error: 'IMGFMT_YUY2' undeclared (first use in this function)
swscale.c:1803: error: 'IMGFMT_YV12' undeclared (first use in this function)
swscale.c:1803: error: 'IMGFMT_NV12' undeclared (first use in this function)
swscale.c:1803: error: 'IMGFMT_NV21' undeclared (first use in this function)
swscale.c: In function 'sws_getColorspaceDetails':
swscale.c:1850: error: 'IMGFMT_YUY2' undeclared (first use in this function)
swscale.c:1850: error: 'IMGFMT_YV12' undeclared (first use in this function)
swscale.c:1850: error: 'IMGFMT_NV12' undeclared (first use in this function)
swscale.c:1850: error: 'IMGFMT_NV21' undeclared (first use in this function)
swscale.c: In function 'sws_getContext':
swscale.c:1903: error: 'IMGFMT_BGR_MASK' undeclared (first use in this function)swscale.c:1903: error: 'IMGFMT_BGR' undeclared (first use in this function)
swscale.c:1903: error: 'IMGFMT_RGB_MASK' undeclared (first use in this function)swscale.c:1903: error: 'IMGFMT_RGB' undeclared (first use in this function)
swscale.c:1907: error: 'IMGFMT_YV12' undeclared (first use in this function)
swscale.c:1907: error: 'IMGFMT_YUY2' undeclared (first use in this function)
swscale.c:1907: error: 'IMGFMT_BGR32' undeclared (first use in this function)
swscale.c:1907: error: 'IMGFMT_BGR16' undeclared (first use in this function)
swscale.c:1907: error: 'IMGFMT_BGR15' undeclared (first use in this function)
swscale.c:1912: error: 'IMGFMT_NV12' undeclared (first use in this function)
swscale.c:1912: error: 'IMGFMT_NV21' undeclared (first use in this function)
make[1]: *** [swscale.o] Error 1
make[1]: Leaving directory `/home/guillaume/Prgm/ffmpeg/libswscale'
make: *** [lib] Error 2
guillaume@moonlight:~/Prgm/ffmpeg$