rendered paste body-crebuild
NOTE: package com.buglabs.bug.jni.common-1.0+svnr6848: started
NOTE: package com.buglabs.bug.jni.common-1.0+svnr6848-r3: task do_rebuild: started
NOTE: package com.buglabs.bug.jni.common-1.0+svnr6848-r3: task do_clean: started
NOTE: removing /home/hrw/devel/BugLabs/svn/build/tmp/work/bug-poky-linux-gnueabi/com.buglabs.bug.jni.common-1.0+svnr6848-r3
NOTE: removing /home/hrw/devel/BugLabs/svn/build/tmp/stamps/bug-poky-linux-gnueabi/com.buglabs.bug.jni.common-1.0+svnr6848-r3.*
NOTE: package com.buglabs.bug.jni.common-1.0+svnr6848-r3: task do_clean: completed
NOTE: package com.buglabs.bug.jni.common-1.0+svnr6848-r3: task do_fetch: started
NOTE: fetch http://www.o-hand.com/~richard/poky/sources/com.buglabs.bug.jni.common_svn.buglabs.net_.bug.trunk_6848_.tar.gz
--2008-11-13 16:34:02-- http://www.o-hand.com/~richard/poky/sources/com.buglabs.bug.jni.common_svn.buglabs.net_.bug.trunk_6848_.tar.gz
Resolving www.o-hand.com... 70.86.75.186
Connecting to www.o-hand.com|70.86.75.186|:80... connected.
HTTP request sent, awaiting response... 302 Found
Location: http://folks.o-hand.com/richard/poky/sources/com.buglabs.bug.jni.common_svn.buglabs.net_.bug.trunk_6848_.tar.gz [following]
--2008-11-13 16:34:03-- http://folks.o-hand.com/richard/poky/sources/com.buglabs.bug.jni.common_svn.buglabs.net_.bug.trunk_6848_.tar.gz
Resolving folks.o-hand.com... 70.86.75.186
Connecting to folks.o-hand.com|70.86.75.186|:80... connected.
HTTP request sent, awaiting response... 302 Found
Location: http://pokylinux.org/sources/com.buglabs.bug.jni.common_svn.buglabs.net_.bug.trunk_6848_.tar.gz [following]
--2008-11-13 16:34:05-- http://pokylinux.org/sources/com.buglabs.bug.jni.common_svn.buglabs.net_.bug.trunk_6848_.tar.gz
Resolving pokylinux.org... 70.86.75.186
Connecting to pokylinux.org|70.86.75.186|:80... connected.
HTTP request sent, awaiting response... 404 Not Found
2008-11-13 16:34:09 ERROR 404: Not Found.
NOTE: Update svn://svn.buglabs.net/bug/trunk;module=com.buglabs.bug.jni.common;proto=svn
At revision 6848.
NOTE: package com.buglabs.bug.jni.common-1.0+svnr6848-r3: task do_fetch: completed
NOTE: package com.buglabs.bug.jni.common-1.0+svnr6848-r3: task do_unpack: started
NOTE: Unpacking /home/hrw/devel/BugLabs/svn/meta-bug/packages/bug-osgi/com.buglabs.bug.jni.common.bb to /home/hrw/devel/BugLabs/svn/build/tmp/work/bug-poky-linux-gnueabi/com.buglabs.bug.jni.common-1.0+svnr6848-r3/
NOTE: Unpacking /home/hrw/devel/sources/dl_dir/com.buglabs.bug.jni.common_svn.buglabs.net_.bug.trunk_6848_.tar.gz to /home/hrw/devel/BugLabs/svn/build/tmp/work/bug-poky-linux-gnueabi/com.buglabs.bug.jni.common-1.0+svnr6848-r3/
NOTE: Unpacking /home/hrw/devel/BugLabs/svn/meta-bug/packages/bug-osgi/files/osgi.jar to /home/hrw/devel/BugLabs/svn/build/tmp/work/bug-poky-linux-gnueabi/com.buglabs.bug.jni.common-1.0+svnr6848-r3/
NOTE: package com.buglabs.bug.jni.common-1.0+svnr6848-r3: task do_unpack: completed
NOTE: package com.buglabs.bug.jni.common-1.0+svnr6848-r3: task do_patch: started
NOTE: package com.buglabs.bug.jni.common-1.0+svnr6848-r3: task do_patch: completed
NOTE: package com.buglabs.bug.jni.common-1.0+svnr6848-r3: task do_configure: started
NOTE: package com.buglabs.bug.jni.common-1.0+svnr6848-r3: task do_configure: completed
NOTE: package com.buglabs.bug.jni.common-1.0+svnr6848-r3: task do_qa_configure: started
NOTE: Checking sanity of the config.log file
NOTE: package com.buglabs.bug.jni.common-1.0+svnr6848-r3: task do_qa_configure: completed
NOTE: package com.buglabs.bug.jni.common-1.0+svnr6848-r3: task do_compile: started
NOTE: package com.buglabs.bug.jni.common-1.0+svnr6848-r3: task do_compile: completed
NOTE: package com.buglabs.bug.jni.common-1.0+svnr6848-r3: task do_jni_compile: started
ERROR: function do_jni_compile failed
ERROR: log data follows (/home/hrw/devel/BugLabs/svn/build/tmp/work/bug-poky-linux-gnueabi/com.buglabs.bug.jni.common-1.0+svnr6848-r3/temp/log.do_jni_compile.3344)
| NOTE: make PHONEME_HOME=/home/hrw/devel/BugLabs/svn/build/tmp/staging/arm-poky-linux-gnueabi/phoneme-advanced-personal/cdc/build/linux-arm-generic JAVAH_OUT=/home/hrw/devel/BugLabs/svn/build/tmp/work/bug-poky-linux-gnueabi/com.buglabs.bug.jni.common-1.0+svnr6848-r3/image/usr/lib/jni LIB_DIR=/home/hrw/devel/BugLabs/svn/build/tmp/work/bug-poky-linux-gnueabi/com.buglabs.bug.jni.common-1.0+svnr6848-r3/image/usr/lib/jni JAVAH_CLASSPATH=/home/hrw/devel/BugLabs/svn/build/tmp/work/bug-poky-linux-gnueabi/com.buglabs.bug.jni.common-1.0+svnr6848-r3/com.buglabs.bug.jni.common/build --debug COMMON_CLASSPATH=/home/hrw/devel/BugLabs/svn/build/tmp/staging/arm-poky-linux-gnueabi/usr/lib/com.buglabs.bug.jni.common.jar STAGING_BUG_INCDIR=/home/hrw/devel/BugLabs/svn/build/tmp/staging/arm-poky-linux-gnueabi/usr/include/bug BUG_LINUX_SRC=/home/hrw/devel/BugLabs/svn/build/tmp/staging/bug-poky-linux-gnueabi/kernel/ STAGING_INCDIR=/home/hrw/devel/BugLabs/svn/build/tmp/staging/arm-poky-linux-gnueabi/usr/include jni
| GNU Make 3.81
| Copyright (C) 2006 Free Software Foundation, Inc.
| This is free software; see the source for copying conditions.
| There is NO warranty; not even for MERCHANTABILITY or FITNESS FOR A
| PARTICULAR PURPOSE.
|
| This program built for x86_64-pc-linux-gnu
| Reading makefiles...
| Updating goal targets....
| File `jni' does not exist.
| Must remake target `jni'.
| javah -d /home/hrw/devel/BugLabs/svn/build/tmp/work/bug-poky-linux-gnueabi/com.buglabs.bug.jni.common-1.0+svnr6848-r3/image/usr/lib/jni -classpath /home/hrw/devel/BugLabs/svn/build/tmp/work/bug-poky-linux-gnueabi/com.buglabs.bug.jni.common-1.0+svnr6848-r3/com.buglabs.bug.jni.common/build:. com.buglabs.bug.jni.common.CharDevice
| java.lang.NoClassDefFoundError: com.sun.source.tree.Tree not found in java.lang.ClassLoader$1{urls=[file:/home/hrw/devel/BugLabs/svn/build/tmp/staging/x86_64-linux/usr/lib/tools.jar], parent=null}
| at java.lang.VMClassLoader.defineClass(Native Method)
| at java.lang.VMClassLoader.defineClassWithTransformers(VMClassLoader.java:454)
| at java.lang.ClassLoader.defineClass(ClassLoader.java:471)
| at java.security.SecureClassLoader.defineClass(SecureClassLoader.java:83)
| at java.net.URLClassLoader.findClass(URLClassLoader.java:615)
| at java.lang.ClassLoader.loadClass(ClassLoader.java:341)
| at java.lang.ClassLoader$1.loadClass(ClassLoader.java:1112)
| at java.lang.ClassLoader.loadClass(ClassLoader.java:293)
| at com.sun.tools.javac.tree.JCTree$Visitor.<clinit>(JCTree.java:2129)
| at com.sun.tools.javadoc.JavadocTool.make0(JavadocTool.java:89)
| at com.sun.tools.javadoc.Start.parseAndExecute(Start.java:340)
| at com.sun.tools.javadoc.Start.begin(Start.java:146)
| at com.sun.tools.javadoc.Main.execute(Main.java:84)
| at com.sun.tools.javah.Main.main(Main.java:153)
| Caused by: java.lang.ClassNotFoundException: com.sun.source.tree.Tree not found in java.lang.ClassLoader$1{urls=[file:/home/hrw/devel/BugLabs/svn/build/tmp/staging/x86_64-linux/usr/lib/tools.jar], parent=null}
| at java.net.URLClassLoader.findClass(URLClassLoader.java:529)
| at java.lang.ClassLoader.loadClass(ClassLoader.java:341)
| at java.lang.ClassLoader$1.loadClass(ClassLoader.java:1112)
| at java.lang.ClassLoader.loadClass(ClassLoader.java:293)
| at java.lang.VMClassLoader.defineClass(Native Method)
| ...13 more
| javadoc: error - fatal error
| 1 error
| make: *** [jni] Error 1
| FATAL: oe_runmake failed
NOTE: Task failed: /home/hrw/devel/BugLabs/svn/build/tmp/work/bug-poky-linux-gnueabi/com.buglabs.bug.jni.common-1.0+svnr6848-r3/temp/log.do_jni_compile.3344
NOTE: package com.buglabs.bug.jni.common-1.0+svnr6848-r3: task do_jni_compile: failed
ERROR: Error in executing:
ERROR: Exception:<class 'bb.build.EventException'> Message:('Function failed in task: /home/hrw/devel/BugLabs/svn/build/tmp/work/bug-poky-linux-gnueabi/com.buglabs.bug.jni.common-1.0+svnr6848-r3/temp/log.do_jni_compile.3344', <bb.build.TaskFailed instance at 0x11611b8>)
ERROR: Printing the environment of the function
ERROR: Error in executing:
ERROR: Exception:<class 'bb.build.EventException'> Message:('Function failed in task: /home/hrw/devel/BugLabs/svn/build/tmp/work/bug-poky-linux-gnueabi/com.buglabs.bug.jni.common-1.0+svnr6848-r3/temp/log.do_jni_compile.3344', <bb.build.TaskFailed instance at 0x11611b8>)
ERROR: Printing the environment of the function
ERROR: TaskFailed event exception, aborting
NOTE: package com.buglabs.bug.jni.common-1.0+svnr6848: failed
ERROR: Build of 'com.buglabs.bug.jni.common' failed
[36m16:34 [31mhrw[34m@[33mhome[36m:[32mbuild[35m$[0m [K
[K[36m16:34 [31mhrw[34m@[33mhome[36m:[32mbuild[35m$[0m