/home/data/cross/gcc-3.4.1/gcc/xgcc -B/home/data/cross/gcc-3.4.1/gcc/ -B/opt/x86-uclibc/toolchain_i386//i386-unknown-linux-uclibc/bin/ -B/opt/x86-uclibc/toolchain_i386//i386-unknown-linux-uclibc/lib/ -isystem /opt/x86-uclibc/toolchain_i386//i386-unknown-linux-uclibc/include -isystem /opt/x86-uclibc/toolchain_i386//i386-unknown-linux-uclibc/sys-include -O2 -DIN_GCC -DCROSS_COMPILE -W -Wall -Wwrite-strings -Wstrict-prototypes -Wmissing-prototypes -Wold-style-definition -isystem ./include -I. -I. -I. -I./. -I./../include -g0 -finhibit-size-directive -fno-inline-functions -fno-exceptions -fno-zero-initialized-in-bss -fno-unit-at-a-time -fno-omit-frame-pointer \
-c ./crtstuff.c -DCRT_BEGIN \
-o crtbegin.o
In file included from /opt/x86-uclibc/toolchain_i386//i386-unknown-linux-uclibc/sys-include/stdio.h:28,
from ./tsystem.h:79,
from ./crtstuff.c:62:
/opt/x86-uclibc/toolchain_i386//i386-unknown-linux-uclibc/sys-include/features.h:267:32: bits/uClibc_config.h: No such file or directory
In file included from ./tsystem.h:79,
from ./crtstuff.c:62:
/opt/x86-uclibc/toolchain_i386//i386-unknown-linux-uclibc/sys-include/stdio.h:36:25: bits/types.h: No such file or directory
/opt/x86-uclibc/toolchain_i386//i386-unknown-linux-uclibc/sys-include/stdio.h:72:31: bits/uClibc_stdio.h: No such file or directory
In file included from ./tsystem.h:79,
from ./crtstuff.c:62:
/opt/x86-uclibc/toolchain_i386//i386-unknown-linux-uclibc/sys-include/stdio.h:81: error: syntax error before "fpos_t"
/opt/x86-uclibc/toolchain_i386//i386-unknown-linux-uclibc/sys-include/stdio.h:131:28: bits/stdio_lim.h: No such file or directory
/opt/x86-uclibc/toolchain_i386//i386-unknown-linux-uclibc/sys-include/stdio.h:560: error: syntax error before "__getdelim"
/opt/x86-uclibc/toolchain_i386//i386-unknown-linux-uclibc/sys-include/stdio.h:563: error: syntax error before "getdelim"
/opt/x86-uclibc/toolchain_i386//i386-unknown-linux-uclibc/sys-include/stdio.h:573: error: syntax error before "getline"
/opt/x86-uclibc/toolchain_i386//i386-unknown-linux-uclibc/sys-include/stdio.h:668: error: syntax error before "__off_t"
/opt/x86-uclibc/toolchain_i386//i386-unknown-linux-uclibc/sys-include/stdio.h:673: error: syntax error before "ftello"
/opt/x86-uclibc/toolchain_i386//i386-unknown-linux-uclibc/sys-include/stdio.h:693: error: syntax error before "fpos_t"
/opt/x86-uclibc/toolchain_i386//i386-unknown-linux-uclibc/sys-include/stdio.h:698: error: syntax error before '*' token
In file included from ./tsystem.h:82,
from ./crtstuff.c:62:
/opt/x86-uclibc/toolchain_i386//i386-unknown-linux-uclibc/sys-include/sys/types.h:34: error: syntax error before "u_char"
/opt/x86-uclibc/toolchain_i386//i386-unknown-linux-uclibc/sys-include/sys/types.h:35: error: syntax error before "u_short"
/opt/x86-uclibc/toolchain_i386//i386-unknown-linux-uclibc/sys-include/sys/types.h:36: error: syntax error before "u_int"
/opt/x86-uclibc/toolchain_i386//i386-unknown-linux-uclibc/sys-include/sys/types.h:37: error: syntax error before "u_long"
/opt/x86-uclibc/toolchain_i386//i386-unknown-linux-uclibc/sys-include/sys/types.h:38: error: syntax error before "quad_t"
/opt/x86-uclibc/toolchain_i386//i386-unknown-linux-uclibc/sys-include/sys/types.h:39: error: syntax error before "u_quad_t"
/opt/x86-uclibc/toolchain_i386//i386-unknown-linux-uclibc/sys-include/sys/types.h:40: error: syntax error before "fsid_t"
/opt/x86-uclibc/toolchain_i386//i386-unknown-linux-uclibc/sys-include/sys/types.h:45: error: syntax error before "loff_t"
/opt/x86-uclibc/toolchain_i386//i386-unknown-linux-uclibc/sys-include/sys/types.h:49: error: syntax error before "ino_t"
/opt/x86-uclibc/toolchain_i386//i386-unknown-linux-uclibc/sys-include/sys/types.h:61: error: syntax error before "dev_t"
/opt/x86-uclibc/toolchain_i386//i386-unknown-linux-uclibc/sys-include/sys/types.h:66: error: syntax error before "gid_t"
/opt/x86-uclibc/toolchain_i386//i386-unknown-linux-uclibc/sys-include/sys/types.h:71: error: syntax error before "mode_t"
/opt/x86-uclibc/toolchain_i386//i386-unknown-linux-uclibc/sys-include/sys/types.h:76: error: syntax error before "nlink_t"
/opt/x86-uclibc/toolchain_i386//i386-unknown-linux-uclibc/sys-include/sys/types.h:81: error: syntax error before "uid_t"
/opt/x86-uclibc/toolchain_i386//i386-unknown-linux-uclibc/sys-include/sys/types.h:87: error: syntax error before "off_t"
/opt/x86-uclibc/toolchain_i386//i386-unknown-linux-uclibc/sys-include/sys/types.h:99: error: syntax error before "pid_t"
/opt/x86-uclibc/toolchain_i386//i386-unknown-linux-uclibc/sys-include/sys/types.h:104: error: syntax error before "id_t"
/opt/x86-uclibc/toolchain_i386//i386-unknown-linux-uclibc/sys-include/sys/types.h:109: error: syntax error before "ssize_t"
/opt/x86-uclibc/toolchain_i386//i386-unknown-linux-uclibc/sys-include/sys/types.h:115: error: syntax error before "daddr_t"
/opt/x86-uclibc/toolchain_i386//i386-unknown-linux-uclibc/sys-include/sys/types.h:116: error: syntax error before "caddr_t"
/opt/x86-uclibc/toolchain_i386//i386-unknown-linux-uclibc/sys-include/sys/types.h:122: error: syntax error before "key_t"
In file included from /opt/x86-uclibc/toolchain_i386//i386-unknown-linux-uclibc/sys-include/sys/types.h:132,
from ./tsystem.h:82,
from ./crtstuff.c:62:
/opt/x86-uclibc/toolchain_i386//i386-unknown-linux-uclibc/sys-include/time.h:60: error: syntax error before "clock_t"
/opt/x86-uclibc/toolchain_i386//i386-unknown-linux-uclibc/sys-include/time.h:76: error: syntax error before "time_t"
/opt/x86-uclibc/toolchain_i386//i386-unknown-linux-uclibc/sys-include/time.h:92: error: syntax error before "clockid_t"
/opt/x86-uclibc/toolchain_i386//i386-unknown-linux-uclibc/sys-include/time.h:104: error: syntax error before "timer_t"
In file included from ./tsystem.h:82,
from ./crtstuff.c:62:
/opt/x86-uclibc/toolchain_i386//i386-unknown-linux-uclibc/sys-include/sys/types.h:136: error: syntax error before "useconds_t"
/opt/x86-uclibc/toolchain_i386//i386-unknown-linux-uclibc/sys-include/sys/types.h:140: error: syntax error before "suseconds_t"
In file included from /opt/x86-uclibc/toolchain_i386//i386-unknown-linux-uclibc/sys-include/sys/types.h:212,
from ./tsystem.h:82,
from ./crtstuff.c:62:
/opt/x86-uclibc/toolchain_i386//i386-unknown-linux-uclibc/sys-include/endian.h:37:25: bits/endian.h: No such file or directory
In file included from /opt/x86-uclibc/toolchain_i386//i386-unknown-linux-uclibc/sys-include/sys/types.h:215,
from ./tsystem.h:82,
from ./crtstuff.c:62:
/opt/x86-uclibc/toolchain_i386//i386-unknown-linux-uclibc/sys-include/sys/select.h:31:25: bits/select.h: No such file or directory
/opt/x86-uclibc/toolchain_i386//i386-unknown-linux-uclibc/sys-include/sys/select.h:34:25: bits/sigset.h: No such file or directory
In file included from /opt/x86-uclibc/toolchain_i386//i386-unknown-linux-uclibc/sys-include/sys/types.h:215,
from ./tsystem.h:82,
from ./crtstuff.c:62:
/opt/x86-uclibc/toolchain_i386//i386-unknown-linux-uclibc/sys-include/sys/select.h:38: error: syntax error before "sigset_t"
In file included from /opt/x86-uclibc/toolchain_i386//i386-unknown-linux-uclibc/sys-include/sys/select.h:43,
from /opt/x86-uclibc/toolchain_i386//i386-unknown-linux-uclibc/sys-include/sys/types.h:215,
from ./tsystem.h:82,
from ./crtstuff.c:62:
/opt/x86-uclibc/toolchain_i386//i386-unknown-linux-uclibc/sys-include/time.h:120: error: syntax error before "__time_t"
/opt/x86-uclibc/toolchain_i386//i386-unknown-linux-uclibc/sys-include/time.h:122: error: syntax error before '}' token
/opt/x86-uclibc/toolchain_i386//i386-unknown-linux-uclibc/sys-include/sys/select.h:45:23: bits/time.h: No such file or directory
In file included from /opt/x86-uclibc/toolchain_i386//i386-unknown-linux-uclibc/sys-include/sys/types.h:215,
from ./tsystem.h:82,
from ./crtstuff.c:62:
/opt/x86-uclibc/toolchain_i386//i386-unknown-linux-uclibc/sys-include/sys/select.h:62: error: `__FD_SETSIZE' undeclared here (not in a function)
/opt/x86-uclibc/toolchain_i386//i386-unknown-linux-uclibc/sys-include/sys/select.h:109: error: syntax error before '*' token
In file included from ./tsystem.h:82,
from ./crtstuff.c:62:
/opt/x86-uclibc/toolchain_i386//i386-unknown-linux-uclibc/sys-include/sys/types.h:223: error: syntax error before "blksize_t"
/opt/x86-uclibc/toolchain_i386//i386-unknown-linux-uclibc/sys-include/sys/types.h:230: error: syntax error before "blkcnt_t"
/opt/x86-uclibc/toolchain_i386//i386-unknown-linux-uclibc/sys-include/sys/types.h:234: error: syntax error before "fsblkcnt_t"
/opt/x86-uclibc/toolchain_i386//i386-unknown-linux-uclibc/sys-include/sys/types.h:238: error: syntax error before "fsfilcnt_t"
In file included from ./tsystem.h:85,
from ./crtstuff.c:62:
/opt/x86-uclibc/toolchain_i386//i386-unknown-linux-uclibc/sys-include/errno.h:36:24: bits/errno.h: No such file or directory
In file included from ./tsystem.h:92,
from ./crtstuff.c:62:
/opt/x86-uclibc/toolchain_i386//i386-unknown-linux-uclibc/sys-include/string.h:273: error: syntax error before "__C_SYMBOL_PREFIX__"
In file included from ./tsystem.h:93,
from ./crtstuff.c:62:
/opt/x86-uclibc/toolchain_i386//i386-unknown-linux-uclibc/sys-include/stdlib.h:44:29: bits/waitflags.h: No such file or directory
/opt/x86-uclibc/toolchain_i386//i386-unknown-linux-uclibc/sys-include/stdlib.h:45:30: bits/waitstatus.h: No such file or directory
In file included from ./tsystem.h:94,
from ./crtstuff.c:62:
/opt/x86-uclibc/toolchain_i386//i386-unknown-linux-uclibc/sys-include/unistd.h:175:28: bits/posix_opt.h: No such file or directory
/opt/x86-uclibc/toolchain_i386//i386-unknown-linux-uclibc/sys-include/unistd.h:179:32: bits/environments.h: No such file or directory
In file included from ./tsystem.h:94,
from ./crtstuff.c:62:
/opt/x86-uclibc/toolchain_i386//i386-unknown-linux-uclibc/sys-include/unistd.h:240: error: syntax error before "intptr_t"
/opt/x86-uclibc/toolchain_i386//i386-unknown-linux-uclibc/sys-include/unistd.h:247: error: syntax error before "socklen_t"
/opt/x86-uclibc/toolchain_i386//i386-unknown-linux-uclibc/sys-include/unistd.h:284: error: syntax error before "lseek"
/opt/x86-uclibc/toolchain_i386//i386-unknown-linux-uclibc/sys-include/unistd.h:284: error: syntax error before "__off_t"
/opt/x86-uclibc/toolchain_i386//i386-unknown-linux-uclibc/sys-include/unistd.h:304: error: syntax error before "read"
/opt/x86-uclibc/toolchain_i386//i386-unknown-linux-uclibc/sys-include/unistd.h:307: error: syntax error before "write"
/opt/x86-uclibc/toolchain_i386//i386-unknown-linux-uclibc/sys-include/unistd.h:311: error: syntax error before "pread"
/opt/x86-uclibc/toolchain_i386//i386-unknown-linux-uclibc/sys-include/unistd.h:311: error: syntax error before "__off_t"
/opt/x86-uclibc/toolchain_i386//i386-unknown-linux-uclibc/sys-include/unistd.h:313: error: syntax error before "pwrite"
/opt/x86-uclibc/toolchain_i386//i386-unknown-linux-uclibc/sys-include/unistd.h:314: error: syntax error before "__off_t"
/opt/x86-uclibc/toolchain_i386//i386-unknown-linux-uclibc/sys-include/unistd.h:372: error: syntax error before "ualarm"
/opt/x86-uclibc/toolchain_i386//i386-unknown-linux-uclibc/sys-include/unistd.h:372: error: syntax error before "__value"
/opt/x86-uclibc/toolchain_i386//i386-unknown-linux-uclibc/sys-include/unistd.h:377: error: syntax error before "__useconds"
/opt/x86-uclibc/toolchain_i386//i386-unknown-linux-uclibc/sys-include/unistd.h:387: error: syntax error before "__uid_t"
/opt/x86-uclibc/toolchain_i386//i386-unknown-linux-uclibc/sys-include/unistd.h:392: error: syntax error before "__uid_t"
/opt/x86-uclibc/toolchain_i386//i386-unknown-linux-uclibc/sys-include/unistd.h:397: error: syntax error before "__uid_t"
/opt/x86-uclibc/toolchain_i386//i386-unknown-linux-uclibc/sys-include/unistd.h:478:27: bits/confname.h: No such file or directory
/opt/x86-uclibc/toolchain_i386//i386-unknown-linux-uclibc/sys-include/unistd.h:496: error: syntax error before "getpid"
/opt/x86-uclibc/toolchain_i386//i386-unknown-linux-uclibc/sys-include/unistd.h:499: error: syntax error before "getppid"
/opt/x86-uclibc/toolchain_i386//i386-unknown-linux-uclibc/sys-include/unistd.h:504: error: syntax error before "getpgrp"
/opt/x86-uclibc/toolchain_i386//i386-unknown-linux-uclibc/sys-include/unistd.h:514: error: syntax error before "__getpgid"
/opt/x86-uclibc/toolchain_i386//i386-unknown-linux-uclibc/sys-include/unistd.h:514: error: syntax error before "__pid"
/opt/x86-uclibc/toolchain_i386//i386-unknown-linux-uclibc/sys-include/unistd.h:516: error: syntax error before "getpgid"
/opt/x86-uclibc/toolchain_i386//i386-unknown-linux-uclibc/sys-include/unistd.h:516: error: syntax error before "__pid"
/opt/x86-uclibc/toolchain_i386//i386-unknown-linux-uclibc/sys-include/unistd.h:523: error: syntax error before "__pid"
/opt/x86-uclibc/toolchain_i386//i386-unknown-linux-uclibc/sys-include/unistd.h:558: error: syntax error before "setsid"
/opt/x86-uclibc/toolchain_i386//i386-unknown-linux-uclibc/sys-include/unistd.h:562: error: syntax error before "getsid"
/opt/x86-uclibc/toolchain_i386//i386-unknown-linux-uclibc/sys-include/unistd.h:562: error: syntax error before "__pid"
/opt/x86-uclibc/toolchain_i386//i386-unknown-linux-uclibc/sys-include/unistd.h:566: error: syntax error before "getuid"
/opt/x86-uclibc/toolchain_i386//i386-unknown-linux-uclibc/sys-include/unistd.h:569: error: syntax error before "geteuid"
/opt/x86-uclibc/toolchain_i386//i386-unknown-linux-uclibc/sys-include/unistd.h:572: error: syntax error before "getgid"
/opt/x86-uclibc/toolchain_i386//i386-unknown-linux-uclibc/sys-include/unistd.h:575: error: syntax error before "getegid"
/opt/x86-uclibc/toolchain_i386//i386-unknown-linux-uclibc/sys-include/unistd.h:580: error: syntax error before "__gid_t"
/opt/x86-uclibc/toolchain_i386//i386-unknown-linux-uclibc/sys-include/unistd.h:586: error: syntax error before "__uid"
/opt/x86-uclibc/toolchain_i386//i386-unknown-linux-uclibc/sys-include/unistd.h:591: error: syntax error before "__ruid"
/opt/x86-uclibc/toolchain_i386//i386-unknown-linux-uclibc/sys-include/unistd.h:596: error: syntax error before "__uid"
/opt/x86-uclibc/toolchain_i386//i386-unknown-linux-uclibc/sys-include/unistd.h:603: error: syntax error before "__gid"
/opt/x86-uclibc/toolchain_i386//i386-unknown-linux-uclibc/sys-include/unistd.h:608: error: syntax error before "__rgid"
/opt/x86-uclibc/toolchain_i386//i386-unknown-linux-uclibc/sys-include/unistd.h:613: error: syntax error before "__gid"
/opt/x86-uclibc/toolchain_i386//i386-unknown-linux-uclibc/sys-include/unistd.h:619: error: syntax error before '*' token
/opt/x86-uclibc/toolchain_i386//i386-unknown-linux-uclibc/sys-include/unistd.h:623: error: syntax error before '*' token
/opt/x86-uclibc/toolchain_i386//i386-unknown-linux-uclibc/sys-include/unistd.h:627: error: syntax error before "__euid"
/opt/x86-uclibc/toolchain_i386//i386-unknown-linux-uclibc/sys-include/unistd.h:631: error: syntax error before "__egid"
/opt/x86-uclibc/toolchain_i386//i386-unknown-linux-uclibc/sys-include/unistd.h:638: error: syntax error before "fork"
/opt/x86-uclibc/toolchain_i386//i386-unknown-linux-uclibc/sys-include/unistd.h:645: error: syntax error before "vfork"
/opt/x86-uclibc/toolchain_i386//i386-unknown-linux-uclibc/sys-include/unistd.h:685: error: syntax error before "tcgetpgrp"
/opt/x86-uclibc/toolchain_i386//i386-unknown-linux-uclibc/sys-include/unistd.h:688: error: syntax error before "__pid_t"
/opt/x86-uclibc/toolchain_i386//i386-unknown-linux-uclibc/sys-include/unistd.h:707:26: bits/getopt.h: No such file or directory
/opt/x86-uclibc/toolchain_i386//i386-unknown-linux-uclibc/sys-include/unistd.h:795: error: syntax error before "__off_t"
/opt/x86-uclibc/toolchain_i386//i386-unknown-linux-uclibc/sys-include/unistd.h:811: error: syntax error before "__off_t"
/opt/x86-uclibc/toolchain_i386//i386-unknown-linux-uclibc/sys-include/unistd.h:842: error: syntax error before "__delta"
/opt/x86-uclibc/toolchain_i386//i386-unknown-linux-uclibc/sys-include/unistd.h:877: error: syntax error before "__off_t"
/opt/x86-uclibc/toolchain_i386//i386-unknown-linux-uclibc/sys-include/unistd.h:928: error: syntax error before "ssize_t"
In file included from ./tsystem.h:100,
from ./crtstuff.c:62:
/opt/x86-uclibc/toolchain_i386//i386-unknown-linux-uclibc/sys-include/time.h:163: error: field `it_interval' has incomplete type
/opt/x86-uclibc/toolchain_i386//i386-unknown-linux-uclibc/sys-include/time.h:164: error: field `it_value' has incomplete type
/opt/x86-uclibc/toolchain_i386//i386-unknown-linux-uclibc/sys-include/time.h:183: error: syntax error before "clock"
/opt/x86-uclibc/toolchain_i386//i386-unknown-linux-uclibc/sys-include/time.h:186: error: syntax error before "time"
/opt/x86-uclibc/toolchain_i386//i386-unknown-linux-uclibc/sys-include/time.h:186: error: syntax error before '*' token
/opt/x86-uclibc/toolchain_i386//i386-unknown-linux-uclibc/sys-include/time.h:195: error: syntax error before "mktime"
/opt/x86-uclibc/toolchain_i386//i386-unknown-linux-uclibc/sys-include/time.h:246: error: syntax error before '*' token
/opt/x86-uclibc/toolchain_i386//i386-unknown-linux-uclibc/sys-include/time.h:250: error: syntax error before '*' token
/opt/x86-uclibc/toolchain_i386//i386-unknown-linux-uclibc/sys-include/time.h:256: error: syntax error before '*' token
/opt/x86-uclibc/toolchain_i386//i386-unknown-linux-uclibc/sys-include/time.h:261: error: syntax error before '*' token
/opt/x86-uclibc/toolchain_i386//i386-unknown-linux-uclibc/sys-include/time.h:271: error: syntax error before '*' token
/opt/x86-uclibc/toolchain_i386//i386-unknown-linux-uclibc/sys-include/time.h:283: error: syntax error before '*' token
/opt/x86-uclibc/toolchain_i386//i386-unknown-linux-uclibc/sys-include/time.h:314: error: syntax error before '*' token
/opt/x86-uclibc/toolchain_i386//i386-unknown-linux-uclibc/sys-include/time.h:329: error: syntax error before "timegm"
/opt/x86-uclibc/toolchain_i386//i386-unknown-linux-uclibc/sys-include/time.h:332: error: syntax error before "timelocal"
/opt/x86-uclibc/toolchain_i386//i386-unknown-linux-uclibc/sys-include/time.h:349: error: syntax error before "__clock_id"
In file included from /opt/x86-uclibc/toolchain_i386//i386-unknown-linux-uclibc/sys-include/elf.h:30,
from /opt/x86-uclibc/toolchain_i386//i386-unknown-linux-uclibc/sys-include/link.h:25,
from ./crtstuff.c:86:
/opt/x86-uclibc/toolchain_i386//i386-unknown-linux-uclibc/sys-include/stdint.h:30:27: bits/wordsize.h: No such file or directory
In file included from /opt/x86-uclibc/toolchain_i386//i386-unknown-linux-uclibc/sys-include/link.h:26,
from ./crtstuff.c:86:
/opt/x86-uclibc/toolchain_i386//i386-unknown-linux-uclibc/sys-include/dlfcn.h:28:24: bits/dlfcn.h: No such file or directory
In file included from ./crtstuff.c:86:
/opt/x86-uclibc/toolchain_i386//i386-unknown-linux-uclibc/sys-include/link.h:35:63: bits/elfclass.h: No such file or directory
In file included from ./crtstuff.c:86:
/opt/x86-uclibc/toolchain_i386//i386-unknown-linux-uclibc/sys-include/link.h:53: error: syntax error before "Elf__ELF_NATIVE_CLASS_Addr"
/opt/x86-uclibc/toolchain_i386//i386-unknown-linux-uclibc/sys-include/link.h:63: error: syntax error before "r_ldbase"
/opt/x86-uclibc/toolchain_i386//i386-unknown-linux-uclibc/sys-include/link.h:76: error: syntax error before "_DYNAMIC"
/opt/x86-uclibc/toolchain_i386//i386-unknown-linux-uclibc/sys-include/link.h:89: error: syntax error before "Elf__ELF_NATIVE_CLASS_Addr"
/opt/x86-uclibc/toolchain_i386//i386-unknown-linux-uclibc/sys-include/link.h:91: error: syntax error before '*' token
/opt/x86-uclibc/toolchain_i386//i386-unknown-linux-uclibc/sys-include/link.h:93: error: syntax error before '}' token
/opt/x86-uclibc/toolchain_i386//i386-unknown-linux-uclibc/sys-include/link.h:99: error: syntax error before "Elf__ELF_NATIVE_CLASS_Addr"
/opt/x86-uclibc/toolchain_i386//i386-unknown-linux-uclibc/sys-include/link.h:101: error: syntax error before '*' token
/opt/x86-uclibc/toolchain_i386//i386-unknown-linux-uclibc/sys-include/link.h:102: error: syntax error before "dlpi_phnum"
/opt/x86-uclibc/toolchain_i386//i386-unknown-linux-uclibc/sys-include/link.h:76: warning: array '_DYNAMIC' assumed to have one element
make[1]: *** [crtbegin.o] Error 1
make[1]: Leaving directory `/home/data/cross/gcc-3.4.1/gcc'
make: *** [all-gcc] Error 2