rendered paste body| /bin/sh ../arm-linux-libtool --tag=CC --mode=link ccache arm-linux-gcc -march=armv5te -mtune=xscale -I/home/hrw/zaurus/oe/build/husky/tmp/staging/arm-linux/include -fexpensive-optimizations -fomit-frame-pointer -frename-registers -O2 -L/home/hrw/zaurus/oe/build/husky/tmp/staging/arm-linux/lib -Wl,-rpath-link,/home/hrw/zaurus/oe/build/husky/tmp/staging/arm-linux/lib -Wl,-O1 -o Bonobo_module.la -rpath /usr/lib/orbit-2.0 -export-dynamic -module -avoid-version -no-undefined Bonobo-imodule.lo -pthread -L/home/hrw/zaurus/oe/build/husky/tmp/staging/arm-linux/lib -lORBitCosNaming-2 -lORBit-2 -lm -lgmodule-2.0 -ldl -lgobject-2.0 -lgthread-2.0 -lglib-2.0
| arm-linux-libtool: link: warning: library `/home/hrw/zaurus/oe/build/husky/tmp/staging/arm-linux/lib/libORBitCosNaming-2.la' was moved.
| grep: /home/hrw/zaurus/oe/build/husky/tmp/work/armv5te-linux/orbit2-2.10.2-r2/ORBit2-2.10.2/src/orb/libORBit-2.la: No such file or directory
| /bin/sed: can't read /home/hrw/zaurus/oe/build/husky/tmp/work/armv5te-linux/orbit2-2.10.2-r2/ORBit2-2.10.2/src/orb/libORBit-2.la: No such file or directory
| arm-linux-libtool: link: `/home/hrw/zaurus/oe/build/husky/tmp/work/armv5te-linux/orbit2-2.10.2-r2/ORBit2-2.10.2/src/orb/libORBit-2.la' is not a valid libtool archive
| make[3]: *** [Bonobo_module.la] Error 1
| make[3]: Leaving directory `/home/hrw/zaurus/oe/build/husky/tmp/work/armv5te-linux/libbonobo-2.6.2-r1/libbonobo-2.6.2/idl'
| make[2]: *** [all] Error 2
| make[2]: Leaving directory `/home/hrw/zaurus/oe/build/husky/tmp/work/armv5te-linux/libbonobo-2.6.2-r1/libbonobo-2.6.2/idl'
| make[1]: *** [all-recursive] Error 1
| make[1]: Leaving directory `/home/hrw/zaurus/oe/build/husky/tmp/work/armv5te-linux/libbonobo-2.6.2-r1/libbonobo-2.6.2'
| make: *** [all] Error 2
| FATAL: oe_runmake failed
NOTE: [11:27] Task failed:
NOTE: [11:27] package libbonobo-2.6.2-r1: task do_compile: failed
ERROR: TaskFailed event exception, aborting
NOTE: [11:27] package libbonobo-2.6.2: failed
ERROR: Build of gpdf failed