rendered paste body/var/tmp/cross/i386-linux-uclibc/portage/gcc-4.1.1/work/build/./gcc/xgcc -shared-libgcc -B/var/tmp/cross/i386-linux-uclibc/portage/gcc-4.1.1/work/build/./gcc -nostdinc++ -L/var/tmp/cross/i386-linux-uclibc/portage/gcc-4.1.1/work/build/i386-linux-uclibc/libstdc++-v3/src -L/var/tmp/cross/i386-linux-uclibc/portage/gcc-4.1.1/work/build/i386-linux-uclibc/libstdc++-v3/src/.libs -B/usr/i386-linux-uclibc/bin/ -B/usr/i386-linux-uclibc/lib/ -isystem /usr/i386-linux-uclibc/include -isystem /usr/i386-linux-uclibc/sys-include -I/var/tmp/cross/i386-linux-uclibc/portage/gcc-4.1.1/work/build/i386-linux-uclibc/libstdc++-v3/include/i386-linux-uclibc - I/var/tmp/cross/i386-linux-uclibc/portage/gcc-4.1.1/work/build/i386-linux-uclibc/libstdc++-v3/include -I/var/tmp/cross/i386-linux-uclibc/portage/gcc-4.1.1/work/gcc-4.1.1/libstdc++-v3/libsupc++ -g -Os -fno-implicit-templates -Wall -Wextra -Wwrite-strings -Wcast-qual -fdiagnostics-show-location=once -ffunction-sections - fdata-sections -c monetary_members.cc -fPIC -DPIC -o .libs/monetary_members.o
monetary_members.cc: In member function 'void std::moneypunct<_CharT, _Intl>::_M_initialize_moneypunct(int*, const char*) [with _CharT = wchar_t, bool _Intl = t rue]':
monetary_members.cc:409: error: '__global_locale' was not declared in this scopemonetary_members.cc: In member function 'void std::moneypunct<_CharT, _Intl>::_M_initialize_moneypunct(int*, const char*) [with _CharT = wchar_t, bool _Intl = f alse]':
monetary_members.cc:564: error: '__global_locale' was not declared in this scopemake[4]: *** [monetary_members.lo] Error 1
make[4]: Leaving directory `/var/tmp/cross/i386-linux-uclibc/portage/gcc-4.1.1/work/build/i386-linux-uclibc/libstdc++-v3/src'
make[3]: *** [all-recursive] Error 1
make[3]: Leaving directory `/var/tmp/cross/i386-linux-uclibc/portage/gcc-4.1.1/work/build/i386-linux-uclibc/libstdc++-v3'
make[2]: *** [all] Error 2
make[2]: Leaving directory `/var/tmp/cross/i386-linux-uclibc/portage/gcc-4.1.1/work/build/i386-linux-uclibc/libstdc++-v3'
make[1]: *** [all-target-libstdc++-v3] Error 2
make[1]: Leaving directory `/var/tmp/cross/i386-linux-uclibc/portage/gcc-4.1.1/work/build'
make: *** [all] Error 2
!!! ERROR: cross-i386-linux-uclibc/gcc-4.1.1 failed.
!!! Function gcc_do_make, Line 1397, Exitcode 2
!!! emake failed with all
!!! If you need support, post the topmost build error, NOT this status message.
es ;-) files/3.4.0/gcc-3.4.0-cc1-no-stack-protector.patch
>>> md5 files ;-) files/3.4.0/gcc34-reiser4-fix.patch
>>> md5 files ;-) files/3.4.1/gcc-3.4.1-r2-gentoo-branding.patch
>>> md5 files ;-) files/3.4.1/gcc-3.4.1-glibc-is-native.patch
>>> md5 files ;-) files/3.4.1/gcc-3.4.1-mips-n32only.patch
>>> md5 files ;-) files/3.4.1/gcc-3.4.1-mips-n64only.patch
>>> md5 files ;-) files/3.4.2/gcc-3.4.x-mips-add-march-r10k.patch
>>> md5 files ;-) files/3.4.2/810-arm-bigendian-uclibc.patch
>>> md5 files ;-) files/3.4.2/gcc34-fix-sse2_pinsrw.patch
>>> md5 files ;-) files/3.4.2/gcc34-m32-no-sse2.patch
>>> md5 files ;-) files/3.4.2/gcc-3.4.2-mips-ip28_cache_barriers-v2.patch
>>> md5 files ;-) files/3.4.2/gcc-3.4.2-mips-ip28_cache_barriers-v3-ip32r10k.patch
>>> md5 files ;-) files/3.4.2/gcc-3.4.2-mips-ip28_cache_barriers-v3.patch
>>> md5 files ;-) files/3.4.2/gcc-3.4.2-mips-ip28_cache_barriers-v4.patch
>>> md5 files ;-) files/awk/fixlafiles.awk-no_gcc_la
>>> md5 files ;-) files/awk/fixlafiles.awk
>>> md5 files ;-) files/awk/scanforssp.awk
>>> md5 files ;-) files/3.4.3/libffi-nogcj-lib-path-fix.patch
>>> md5 files ;-) files/3.4.3/libffi-without-libgcj.patch
>>> md5 files ;-) files/3.4.3/libssp.patch
>>> md5 files ;-) files/3.4.3/gcc-3.4.3-cross-compile.patch
>>> md5 files ;-) files/3.3.5/gcc-3.3.5-ffecom_gfrt_basictype-prototype.patch>>> md5 files ;-) files/3.3.5/gcc-3.3.5-no-COPYING-cross-compile.patch
>>> md5 files ;-) files/stubs/gcc-3.3-htb-stub.patch
>>> md5 files ;-) files/stubs/gcc-3.3-ssp-stub.patch
>>> md5 files ;-) files/stubs/gcc-3.4-htb-stub.patch
>>> md5 files ;-) files/stubs/gcc-3.4-ssp-stub.patch
>>> md5 files ;-) files/stubs/gcc-4.0-htb-stub.patch
>>> md5 files ;-) files/stubs/gcc-4.0-ssp-stub.patch
>>> md5 files ;-) files/4.0.2/gcc-4.0.2-cross-compile.patch
>>> md5 files ;-) files/4.0.2/gcc-4.0.2-softfloat.patch
>>> md5 files ;-) files/3.3.6/gcc-3.3.6-cross-compile.patch
>>> md5 files ;-) files/4.1.0/gcc-4.1.0-cross-compile.patch
>>> md5 src_uri ;-) gcc-4.1.1.tar.bz2
>>> md5 src_uri ;-) gcc-4.1.1-uclibc-patches-1.0.tar.bz2
>>> md5 src_uri ;-) gcc-4.1.1-patches-1.6.tar.bz2
* gcc failed :(
* If you file a bug, please attach the following logfiles:
* /var/log/portage/cross-i386-pc-linux-uclibc-info.log
* /var/log/portage/cross-i386-pc-linux-uclibc-gcc-stage2.log