All pastes #124481 Raw Edit

xmms2_config_log

public text v1 · immutable
·published 2006-08-10 02:42 UTC
rendered paste body
cat config.log

file /usr/src/xmms2-0.2DrFeelgood/xmmsenv.py,line 96:
        Configure(confdir = .sconf_temp)
xmmsscons: File src/clients/lib/ruby/xmmsclient_ecore reported error 'Command 'ecore-config --libs --cflags | sed  -e 's/ -lecore_job / /'  -e 's/ -lecore_x / /'  -e 's/ -lecore_evas / /'  -e 's/ -lecore_con / /'  -e 's/ -lecore_ipc / /'  -e 's/ -lecore_txt / /'  -e 's/ -lecore_fb / /'  -e 's/ -lecore_config / /'  -e 's/ -lecore_file / /' -e 's/ -leet / /'  -e 's/ -ljpeg / /'  -e 's/ -lz / /'' failed' and was disabled.
xmmsscons: File src/clients/lib/xmmsclient-ecore/xmmsclient-ecore reported error 'Command 'ecore-config --libs --cflags | sed  -e 's/ -lecore_job / /'  -e 's/ -lecore_x / /'  -e 's/ -lecore_evas / /'  -e 's/ -lecore_con / /'  -e 's/ -lecore_ipc / /'  -e 's/ -lecore_txt / /'  -e 's/ -lecore_fb / /'  -e 's/ -lecore_config / /'  -e 's/ -lecore_file / /' -e 's/ -leet / /'  -e 's/ -ljpeg / /'  -e 's/ -lz / /'' failed' and was disabled.
scons: Configure: Checking for C++ header file boost/signal.hpp...
.sconf_temp/conftest_0.cpp <-
  |
  |#include "boost/signal.hpp"
  |
  |
g++ -o .sconf_temp/conftest_0.o -c -g -Wall -O0 -Isrc/include .sconf_temp/conftest_0.cpp
scons: Configure: yes

scons: Configure: Checking for boost::signals::connection::connection() in C++ library boost_signals...
.sconf_temp/conftest_1.cpp <-
  |
  |
  |#include <boost/signal.hpp>
  |int
  |main() {
  |  boost::signals::connection::connection();
  |return 0;
  |}
  |
g++ -o .sconf_temp/conftest_1.o -c -g -Wall -O0 -Isrc/include .sconf_temp/conftest_1.cpp
g++ -o .sconf_temp/conftest_1 .sconf_temp/conftest_1.o -lboost_signals
/usr/lib/gcc/x86_64-pc-linux-gnu/4.0.3/../../../../x86_64-pc-linux-gnu/bin/ld: cannot find -lboost_signals
collect2: ld returned 1 exit status
scons: Configure: no

xmmsscons: File src/clients/lib/xmmsclient++/xmmsclient++ reported error 'Symbol 'boost::signals::connection::connection' in library 'boost_signals' not found' and was disabled.
scons: Configure: Checking for sin() in C library m...
.sconf_temp/conftest_2.c <-
  |
  |
  |
  |#ifdef __cplusplus
  |extern "C"
  |#endif
  |char sin();
  |
  |int
  |main() {
  |  sin();
  |return 0;
  |}
  |
gcc -o .sconf_temp/conftest_2.o -c -g -Wall -O0 -Isrc/include .sconf_temp/conftest_2.c
.sconf_temp/conftest_2.c:7: warning: conflicting types for built-in function &#8216;sin&#8217;
gcc -o .sconf_temp/conftest_2 .sconf_temp/conftest_2.o -lm
scons: Configure: yes

scons: Configure: Checking for C header file sys/vfs.h...
.sconf_temp/conftest_3.c <-
  |
  |#include "sys/vfs.h"
  |
  |
gcc -o .sconf_temp/conftest_3.o -c -g -Wall -O0 -Isrc/include .sconf_temp/conftest_3.c
scons: Configure: yes

xmmsscons: File src/plugins/m3u/m3u reported error 'Disabled' and was disabled.
scons: Configure: Checking for C header file mad.h...
.sconf_temp/conftest_4.c <-
  |
  |#include "mad.h"
  |
  |
gcc -o .sconf_temp/conftest_4.o -c -g -Wall -O0 -Isrc/include .sconf_temp/conftest_4.c
scons: Configure: yes

scons: Configure: Checking for mad_synth_init() in C library mad...
.sconf_temp/conftest_5.c <-
  |
  |
  |
  |#ifdef __cplusplus
  |extern "C"
  |#endif
  |char mad_synth_init();
  |
  |int
  |main() {
  |  mad_synth_init();
  |return 0;
  |}
  |
gcc -o .sconf_temp/conftest_5.o -c -g -Wall -O0 -Isrc/include .sconf_temp/conftest_5.c
gcc -o .sconf_temp/conftest_5 .sconf_temp/conftest_5.o -lmad
scons: Configure: yes

scons: Configure: Checking for C header file sys/soundcard.h...
.sconf_temp/conftest_6.c <-
  |
  |#include "sys/soundcard.h"
  |
  |
gcc -o .sconf_temp/conftest_6.o -c -g -Wall -O0 -Isrc/include .sconf_temp/conftest_6.c
scons: Configure: yes

scons: Configure: Checking for _oss_ioctl() in C library ossaudio...
.sconf_temp/conftest_7.c <-
  |
  |
  |
  |#ifdef __cplusplus
  |extern "C"
  |#endif
  |char _oss_ioctl();
  |
  |int
  |main() {
  |  _oss_ioctl();
  |return 0;
  |}
  |
gcc -o .sconf_temp/conftest_7.o -c -g -Wall -O0 -Isrc/include .sconf_temp/conftest_7.c
gcc -o .sconf_temp/conftest_7 .sconf_temp/conftest_7.o -lossaudio
/usr/lib/gcc/x86_64-pc-linux-gnu/4.0.3/../../../../x86_64-pc-linux-gnu/bin/ld: cannot find -lossaudio
collect2: ld returned 1 exit status
scons: Configure: no

xmmsscons: File src/plugins/pls/pls reported error 'Disabled' and was disabled.
scons: Configure: Checking for resid_version_string() in C library resid-builder...
.sconf_temp/conftest_8.c <-
  |
  |
  |
  |#ifdef __cplusplus
  |extern "C"
  |#endif
  |char resid_version_string();
  |
  |int
  |main() {
  |  resid_version_string();
  |return 0;
  |}
  |
gcc -o .sconf_temp/conftest_8.o -c -g -Wall -O0 -Isrc/include .sconf_temp/conftest_8.c
gcc -o .sconf_temp/conftest_8 .sconf_temp/conftest_8.o -lresid-builder
/usr/lib/gcc/x86_64-pc-linux-gnu/4.0.3/../../../../x86_64-pc-linux-gnu/bin/ld: cannot find -lresid-builder
collect2: ld returned 1 exit status
scons: Configure: no

xmmsscons: File src/plugins/sid/sid reported error 'Symbol 'resid_version_string' in library 'resid-builder' not found' and was disabled.
scons: Configure: Checking for C header file sys/audioio.h...
.sconf_temp/conftest_9.c <-
  |#include "sys/types.h"
  |
  |#include "sys/audioio.h"
  |
  |
gcc -o .sconf_temp/conftest_9.o -c -g -Wall -O0 -Isrc/include .sconf_temp/conftest_9.c
.sconf_temp/conftest_9.c:3:25: error: sys/audioio.h: No such file or directory
scons: Configure: no

xmmsscons: File src/plugins/sun/sun reported error 'Headerfile '['sys/types.h', 'sys/audioio.h']' not found' and was disabled.
xmmsscons: File src/plugins/wma/wma reported error 'Command 'pkg-config --silence-errors --cflags --libs "libavformat"' failed' and was disabled.
scons: Configure: Checking for faacDecInit2() in C library faad...
.sconf_temp/conftest_10.c <-
  |
  |
  |
  |#ifdef __cplusplus
  |extern "C"
  |#endif
  |char faacDecInit2();
  |
  |int
  |main() {
  |  faacDecInit2();
  |return 0;
  |}
  |
gcc -o .sconf_temp/conftest_10.o -c -g -Wall -O0 -Isrc/include .sconf_temp/conftest_10.c
gcc -o .sconf_temp/conftest_10 .sconf_temp/conftest_10.o -lfaad
/usr/lib/gcc/x86_64-pc-linux-gnu/4.0.3/../../../../lib/libfaad.so: undefined reference to `log'
/usr/lib/gcc/x86_64-pc-linux-gnu/4.0.3/../../../../lib/libfaad.so: undefined reference to `sqrt'
/usr/lib/gcc/x86_64-pc-linux-gnu/4.0.3/../../../../lib/libfaad.so: undefined reference to `logf'
/usr/lib/gcc/x86_64-pc-linux-gnu/4.0.3/../../../../lib/libfaad.so: undefined reference to `sqrtf'
/usr/lib/gcc/x86_64-pc-linux-gnu/4.0.3/../../../../lib/libfaad.so: undefined reference to `cosf'
/usr/lib/gcc/x86_64-pc-linux-gnu/4.0.3/../../../../lib/libfaad.so: undefined reference to `cos'
/usr/lib/gcc/x86_64-pc-linux-gnu/4.0.3/../../../../lib/libfaad.so: undefined reference to `sin'
/usr/lib/gcc/x86_64-pc-linux-gnu/4.0.3/../../../../lib/libfaad.so: undefined reference to `pow'
/usr/lib/gcc/x86_64-pc-linux-gnu/4.0.3/../../../../lib/libfaad.so: undefined reference to `sinf'
collect2: ld returned 1 exit status
scons: Configure: no

scons: Configure: Checking for NeAACDecInit2() in C library faad...
.sconf_temp/conftest_11.c <-
  |
  |
  |
  |#ifdef __cplusplus
  |extern "C"
  |#endif
  |char NeAACDecInit2();
  |
  |int
  |main() {
  |  NeAACDecInit2();
  |return 0;
  |}
  |
gcc -o .sconf_temp/conftest_11.o -c -g -Wall -O0 -Isrc/include .sconf_temp/conftest_11.c
gcc -o .sconf_temp/conftest_11 .sconf_temp/conftest_11.o -lfaad
.sconf_temp/conftest_11.o: In function `main':
.sconf_temp/conftest_11.c:11: undefined reference to `NeAACDecInit2'
/usr/lib/gcc/x86_64-pc-linux-gnu/4.0.3/../../../../lib/libfaad.so: undefined reference to `log'
/usr/lib/gcc/x86_64-pc-linux-gnu/4.0.3/../../../../lib/libfaad.so: undefined reference to `sqrt'
/usr/lib/gcc/x86_64-pc-linux-gnu/4.0.3/../../../../lib/libfaad.so: undefined reference to `logf'
/usr/lib/gcc/x86_64-pc-linux-gnu/4.0.3/../../../../lib/libfaad.so: undefined reference to `sqrtf'
/usr/lib/gcc/x86_64-pc-linux-gnu/4.0.3/../../../../lib/libfaad.so: undefined reference to `cosf'
/usr/lib/gcc/x86_64-pc-linux-gnu/4.0.3/../../../../lib/libfaad.so: undefined reference to `cos'
/usr/lib/gcc/x86_64-pc-linux-gnu/4.0.3/../../../../lib/libfaad.so: undefined reference to `sin'
/usr/lib/gcc/x86_64-pc-linux-gnu/4.0.3/../../../../lib/libfaad.so: undefined reference to `pow'
/usr/lib/gcc/x86_64-pc-linux-gnu/4.0.3/../../../../lib/libfaad.so: undefined reference to `sinf'
collect2: ld returned 1 exit status
scons: Configure: no

xmmsscons: File src/plugins/faad/faad reported error 'Symbol 'NeAACDecInit2' in library 'faad' not found' and was disabled.
scons: Configure: Checking for C header file FLAC/all.h...
.sconf_temp/conftest_12.c <-
  |
  |#include "FLAC/all.h"
  |
  |
gcc -o .sconf_temp/conftest_12.o -c -g -Wall -O0 -Isrc/include .sconf_temp/conftest_12.c
scons: Configure: yes

scons: Configure: Checking for FLAC__seekable_stream_decoder_get_state() in C library FLAC...
.sconf_temp/conftest_13.c <-
  |
  |
  |
  |#ifdef __cplusplus
  |extern "C"
  |#endif
  |char FLAC__seekable_stream_decoder_get_state();
  |
  |int
  |main() {
  |  FLAC__seekable_stream_decoder_get_state();
  |return 0;
  |}
  |
gcc -o .sconf_temp/conftest_13.o -c -g -Wall -O0 -Isrc/include .sconf_temp/conftest_13.c
gcc -o .sconf_temp/conftest_13 .sconf_temp/conftest_13.o -lFLAC
/usr/lib/gcc/x86_64-pc-linux-gnu/4.0.3/../../../../lib/libFLAC.so: undefined reference to `log'
/usr/lib/gcc/x86_64-pc-linux-gnu/4.0.3/../../../../lib/libFLAC.so: undefined reference to `floor'
collect2: ld returned 1 exit status
scons: Configure: no

xmmsscons: File src/plugins/flac/flac reported error 'Symbol 'FLAC__seekable_stream_decoder_get_state' in library 'FLAC' not found' and was disabled.
xmmsscons: File src/plugins/ices/ices reported error 'Plugin disabled' and was disabled.
xmmsscons: File src/plugins/html/html reported error 'Disabled' and was disabled.
scons: Configure: Checking for C header file libsmbclient.h...
.sconf_temp/conftest_14.c <-
  |
  |#include "libsmbclient.h"
  |
  |
gcc -o .sconf_temp/conftest_14.o -c -g -Wall -O0 -Isrc/include .sconf_temp/conftest_14.c
.sconf_temp/conftest_14.c:2:26: error: libsmbclient.h: No such file or directory
scons: Configure: no

xmmsscons: File src/plugins/samba/smb reported error 'Headerfile 'libsmbclient.h' not found' and was disabled.
xmmsscons: File src/plugins/speex/speex reported error 'Disabled' and was disabled.
scons: Configure: Checking for mpc_decoder_decode() in C library mpcdec...
.sconf_temp/conftest_15.c <-
  |
  |
  |
  |#ifdef __cplusplus
  |extern "C"
  |#endif
  |char mpc_decoder_decode();
  |
  |int
  |main() {
  |  mpc_decoder_decode();
  |return 0;
  |}
  |
gcc -o .sconf_temp/conftest_15.o -c -g -Wall -O0 -Isrc/include .sconf_temp/conftest_15.c
gcc -o .sconf_temp/conftest_15 .sconf_temp/conftest_15.o -lmpcdec
scons: Configure: yes

scons: Configure: Checking for C header file vorbis/vorbisfile.h...
.sconf_temp/conftest_16.c <-
  |
  |#include "vorbis/vorbisfile.h"
  |
  |
gcc -o .sconf_temp/conftest_16.o -c -g -Wall -O0 -Isrc/include .sconf_temp/conftest_16.c
scons: Configure: yes

scons: Configure: Checking for ov_open_callbacks() in C library vorbisfile...
.sconf_temp/conftest_17.c <-
  |
  |
  |
  |#ifdef __cplusplus
  |extern "C"
  |#endif
  |char ov_open_callbacks();
  |
  |int
  |main() {
  |  ov_open_callbacks();
  |return 0;
  |}
  |
gcc -o .sconf_temp/conftest_17.o -c -g -Wall -O0 -Isrc/include .sconf_temp/conftest_17.c
gcc -o .sconf_temp/conftest_17 .sconf_temp/conftest_17.o -lvorbisfile
scons: Configure: yes

xmmsscons: File src/plugins/gnomevfs/gnomevfs reported error 'Command 'pkg-config --silence-errors --cflags --libs "gnome-vfs-2.0"' failed' and was disabled.
scons: Configure: Checking for C header file AudioUnit/AudioUnit.h...
.sconf_temp/conftest_18.c <-
  |
  |#include "AudioUnit/AudioUnit.h"
  |
  |
gcc -o .sconf_temp/conftest_18.o -c -g -Wall -O0 -Isrc/include .sconf_temp/conftest_18.c
.sconf_temp/conftest_18.c:2:33: error: AudioUnit/AudioUnit.h: No such file or directory
scons: Configure: no

xmmsscons: File src/plugins/coreaudio/coreaudio reported error 'Headerfile 'AudioUnit/AudioUnit.h' not found' and was disabled.
xmmsscons: File src/clients/mdns/avahi/xmms2-find-avahi reported error 'Command 'pkg-config --silence-errors --cflags --libs "avahi-client"' failed' and was disabled.
xmmsscons: File src/clients/mdns/avahi/xmms2-mdns-avahi reported error 'Command 'pkg-config --silence-errors --cflags --libs "avahi-client"' failed' and was disabled.
scons: Configure: Checking for C header file dns_sd.h...
.sconf_temp/conftest_19.c <-
  |
  |#include "dns_sd.h"
  |
  |
gcc -o .sconf_temp/conftest_19.o -c -g -Wall -O0 -Isrc/include .sconf_temp/conftest_19.c
.sconf_temp/conftest_19.c:2:20: error: dns_sd.h: No such file or directory
scons: Configure: no

xmmsscons: File src/clients/mdns/dns_sd/xmms2-mdns-dnssd reported error 'Headerfile 'dns_sd.h' not found' and was disabled.
scons: Configure: Checking for TTF_Init() in C library SDL_ttf...
.sconf_temp/conftest_20.c <-
  |
  |
  |
  |#ifdef __cplusplus
  |extern "C"
  |#endif
  |char TTF_Init();
  |
  |int
  |main() {
  |  TTF_Init();
  |return 0;
  |}
  |
gcc -o .sconf_temp/conftest_20.o -c -g -Wall -O0 -Isrc/include .sconf_temp/conftest_20.c
gcc -o .sconf_temp/conftest_20 .sconf_temp/conftest_20.o -lSDL_ttf
scons: Configure: yes