././pch.h:3:26: qbuttongroup.h: No such file or directory
././pch.h:4:23: qcheckbox.h: No such file or directory
././pch.h:5:23: qcombobox.h: No such file or directory
././pch.h:6:21: qdialog.h: No such file or directory
././pch.h:7:20: qframe.h: No such file or directory
././pch.h:8:23: qgroupbox.h: No such file or directory
././pch.h:9:21: qheader.h: No such file or directory
././pch.h:10:20: qimage.h: No such file or directory
././pch.h:11:20: qlabel.h: No such file or directory
././pch.h:12:21: qlayout.h: No such file or directory
././pch.h:13:23: qlineedit.h: No such file or directory
././pch.h:14:22: qlistbox.h: No such file or directory
././pch.h:15:23: qlistview.h: No such file or directory
././pch.h:16:28: qmultilineedit.h: No such file or directory
././pch.h:17:21: qpixmap.h: No such file or directory
././pch.h:18:26: qprogressbar.h: No such file or directory
././pch.h:19:25: qpushbutton.h: No such file or directory
././pch.h:20:26: qradiobutton.h: No such file or directory
././pch.h:21:21: qslider.h: No such file or directory
././pch.h:22:22: qspinbox.h: No such file or directory
././pch.h:23:24: qtabwidget.h: No such file or directory
././pch.h:24:26: qtextbrowser.h: No such file or directory
././pch.h:25:23: qtextview.h: No such file or directory
././pch.h:26:22: qtooltip.h: No such file or directory
././pch.h:27:22: qvariant.h: No such file or directory
././pch.h:28:24: qwhatsthis.h: No such file or directory
././pch.h:29:21: qwidget.h: No such file or directory
././pch.h:30:26: qwidgetstack.h: No such file or directory
In file included from BiblioModuleBase.C:10:
BiblioModuleBase.h:27: error: expected class-name before '{' token
BiblioModuleBase.h:30: error: ISO C++ forbids declaration of `Q_OBJECT' with no type
BiblioModuleBase.h:30: error: expected `;' before "public"
BiblioModuleBase.h:48: error: expected `:' before "slots"
BiblioModuleBase.h:49: error: expected primary-expression before "virtual"
BiblioModuleBase.h:49: error: ISO C++ forbids declaration of `slots' with no type
BiblioModuleBase.h:49: error: expected `;' before "virtual"
BiblioModuleBase.C:29: error: expected `)' before '*' token
BiblioModuleBase.C:29: error: expected `,' or `;' before '*' token
BiblioModuleBase.C:100: error: no `void BiblioModuleBase::languageChange()' member function declared in class `BiblioModuleBase'
BiblioModuleBase.C: In member function `void BiblioModuleBase::languageChange()':
BiblioModuleBase.C:101: error: incomplete type `QString' used in nested name specifier
BiblioModuleBase.C:101: error: `setCaption' undeclared (first use this function)
BiblioModuleBase.C:101: error: (Each undeclared identifier is reported only once for each function it appears in.)
BiblioModuleBase.C:102: error: invalid use of undefined type `struct QButtonGroup'
BiblioModuleBase.h:20: error: forward declaration of `struct QButtonGroup'
BiblioModuleBase.C:102: error: invalid use of undefined type `const struct QString'
../../../../src/frontends/qt2/qt_helpers.h:22: error: forward declaration of `const struct QString'
BiblioModuleBase.C:103: error: invalid use of undefined type `struct QRadioButton'
BiblioModuleBase.h:21: error: forward declaration of `struct QRadioButton'
BiblioModuleBase.C:103: error: invalid use of undefined type `const struct QString'
../../../../src/frontends/qt2/qt_helpers.h:22: error: forward declaration of `const struct QString'
BiblioModuleBase.C:104: error: `QToolTip' has not been declared
BiblioModuleBase.C:104: error: invalid use of undefined type `const struct QString'
../../../../src/frontends/qt2/qt_helpers.h:22: error: forward declaration of `const struct QString'
BiblioModuleBase.C:104: error: `add' undeclared (first use this function)
BiblioModuleBase.C:105: error: invalid use of undefined type `struct QRadioButton'
BiblioModuleBase.h:21: error: forward declaration of `struct QRadioButton'
BiblioModuleBase.C:105: error: invalid use of undefined type `const struct QString'
../../../../src/frontends/qt2/qt_helpers.h:22: error: forward declaration of `const struct QString'
BiblioModuleBase.C:106: error: `QToolTip' has not been declared
BiblioModuleBase.C:106: error: invalid use of undefined type `const struct QString'
../../../../src/frontends/qt2/qt_helpers.h:22: error: forward declaration of `const struct QString'
BiblioModuleBase.C:107: error: invalid use of undefined type `struct QRadioButton'
BiblioModuleBase.h:21: error: forward declaration of `struct QRadioButton'
BiblioModuleBase.C:107: error: invalid use of undefined type `const struct QString'
../../../../src/frontends/qt2/qt_helpers.h:22: error: forward declaration of `const struct QString'
BiblioModuleBase.C:108: error: `QToolTip' has not been declared
BiblioModuleBase.C:108: error: invalid use of undefined type `const struct QString'
../../../../src/frontends/qt2/qt_helpers.h:22: error: forward declaration of `const struct QString'
BiblioModuleBase.C:109: error: invalid use of undefined type `struct QLabel'
BiblioModuleBase.h:22: error: forward declaration of `struct QLabel'
BiblioModuleBase.C:109: error: invalid use of undefined type `const struct QString'
../../../../src/frontends/qt2/qt_helpers.h:22: error: forward declaration of `const struct QString'
BiblioModuleBase.C:110: error: invalid use of undefined type `struct QCheckBox'
BiblioModuleBase.h:24: error: forward declaration of `struct QCheckBox'
BiblioModuleBase.C:110: error: invalid use of undefined type `const struct QString'
../../../../src/frontends/qt2/qt_helpers.h:22: error: forward declaration of `const struct QString'
BiblioModuleBase.C:111: error: `QToolTip' has not been declared
BiblioModuleBase.C:111: error: invalid use of undefined type `const struct QString'
../../../../src/frontends/qt2/qt_helpers.h:22: error: forward declaration of `const struct QString'
make[9]: *** [BiblioModuleBase.lo] Error 1
make[9]: Leaving directory `/home/lontra/conary/build/lyx/lyx-1.4.2/src/frontends/qt2/ui'
make[8]: *** [all-recursive] Error 1
make[8]: Leaving directory `/home/lontra/conary/build/lyx/lyx-1.4.2/src/frontends/qt2/ui'
make[7]: *** [all] Error 2
make[7]: Leaving directory `/home/lontra/conary/build/lyx/lyx-1.4.2/src/frontends/qt2/ui'
make[6]: *** [all-recursive] Error 1
make[6]: Leaving directory `/home/lontra/conary/build/lyx/lyx-1.4.2/src/frontends/qt2'
make[5]: *** [all] Error 2
make[5]: Leaving directory `/home/lontra/conary/build/lyx/lyx-1.4.2/src/frontends/qt2'
make[4]: *** [all-recursive] Error 1
make[4]: Leaving directory `/home/lontra/conary/build/lyx/lyx-1.4.2/src/frontends'
make[3]: *** [all] Error 2
make[3]: Leaving directory `/home/lontra/conary/build/lyx/lyx-1.4.2/src/frontends'
make[2]: *** [all-recursive] Error 1
make[2]: Leaving directory `/home/lontra/conary/build/lyx/lyx-1.4.2/src'
make[1]: *** [all] Error 2
make[1]: Leaving directory `/home/lontra/conary/build/lyx/lyx-1.4.2/src'
make: *** [all-recursive] Error 1
error: Shell command "cd /home/lontra/conary/build/lyx/lyx-1.4.2/; CFLAGS="-O2 -march=i686 -g" CXXFLAGS="-O2 -march=i686 -g " CPPFLAGS="" CLASSPATH="" LDFLAGS="-g" CC=gcc CXX=g++ make " exited with exit code 2
/usr/lib/python2.4/site-packages//conary/build/packagerecipe.py:982: RuntimeError: Shell command "cd /home/lontra/conary/build/lyx/lyx-1.4.2/; CFLAGS="-O2 -march=i686 -g" CXXFLAGS="-O2 -march=i686 -g " CPPFLAGS="" CLASSPATH="" LDFLAGS="-g" CC=gcc CXX=g++ make " exited with exit code 2