All pastes #1240641 Raw Edit

Mine

public text v1 · immutable
#1240641 ·published 2008-10-30 15:14 UTC
rendered paste body
PERL_DL_NONLAZY=1 /usr/bin/perl "-MExtUtils::Command::MM" "-e" "test_harness(0, 'blib/lib', 'blib/arch')" t/*.t
t/01base................# Test loading DBI, DBD::Oracle and version

#   Failed test 'install_driver'
#   in t/01base.t at line 22.
Failed to load Oracle extension and/or shared libraries:
install_driver(Oracle) failed: Can't load '/Users/nathan/.cpan/build/DBD-Oracle-1.22/blib/arch/auto/DBD/Oracle/Oracle.bundle' for module DBD::Oracle: dlopen(/Users/nathan/.cpan/build/DBD-Oracle-1.22/blib/arch/auto/DBD/Oracle/Oracle.bundle, 2): Symbol not found: _environ
  Referenced from: /Users/nathan/.cpan/build/DBD-Oracle-1.22/blib/arch/auto/DBD/Oracle/Oracle.bundle
  Expected in: dynamic lookup
 at (eval 7) line 3
Compilation failed in require at (eval 7) line 3.
Perhaps a required shared library or dll isn't installed where expected
 at t/01base.t line 19
The remaining tests will probably also fail with the same error.

*** Please read the README and README.help.txt files for help. ***

# Looks like you failed 1 test of 6.
dubious
	Test returned status 1 (wstat 256, 0x100)
DIED. FAILED test 4
	Failed 1/6 tests, 83.33% okay (less 2 skipped tests: 3 okay, 50.00%)
t/10general.............install_driver(Oracle) failed: Can't load '/Users/nathan/.cpan/build/DBD-Oracle-1.22/blib/arch/auto/DBD/Oracle/Oracle.bundle' for module DBD::Oracle: dlopen(/Users/nathan/.cpan/build/DBD-Oracle-1.22/blib/arch/auto/DBD/Oracle/Oracle.bundle, 2): Symbol not found: _environ
  Referenced from: /Users/nathan/.cpan/build/DBD-Oracle-1.22/blib/arch/auto/DBD/Oracle/Oracle.bundle
  Expected in: dynamic lookup
 at (eval 5) line 3
Compilation failed in require at (eval 5) line 3.
Perhaps a required shared library or dll isn't installed where expected
 at /Users/nathan/.cpan/build/DBD-Oracle-1.22/blib/lib/Oraperl.pm line 55
Compilation failed in require at t/10general.t line 6.
BEGIN failed--compilation aborted at t/10general.t line 6.
# Looks like your test died before it could output anything.
dubious
	Test returned status 255 (wstat 65280, 0xff00)
t/12impdata.............skipped
        all skipped: DBI version 1.52 does not support iThreads. Use version 1.602 or later.
t/14threads.............skipped
        all skipped: DBI version 1.52 does not support iThreads. Use version 1.602 or later.
t/15nls.................Can't load '/Users/nathan/.cpan/build/DBD-Oracle-1.22/blib/arch/auto/DBD/Oracle/Oracle.bundle' for module DBD::Oracle: dlopen(/Users/nathan/.cpan/build/DBD-Oracle-1.22/blib/arch/auto/DBD/Oracle/Oracle.bundle, 2): Symbol not found: _environ
  Referenced from: /Users/nathan/.cpan/build/DBD-Oracle-1.22/blib/arch/auto/DBD/Oracle/Oracle.bundle
  Expected in: dynamic lookup
 at t/nchar_test_lib.pl line 6
Compilation failed in require at t/nchar_test_lib.pl line 6.
BEGIN failed--compilation aborted at t/nchar_test_lib.pl line 6.
Compilation failed in require at t/15nls.t line 9.
# Looks like your test died before it could output anything.
dubious
	Test returned status 255 (wstat 65280, 0xff00)
t/20select..............Can't load '/Users/nathan/.cpan/build/DBD-Oracle-1.22/blib/arch/auto/DBD/Oracle/Oracle.bundle' for module DBD::Oracle: dlopen(/Users/nathan/.cpan/build/DBD-Oracle-1.22/blib/arch/auto/DBD/Oracle/Oracle.bundle, 2): Symbol not found: _environ
  Referenced from: /Users/nathan/.cpan/build/DBD-Oracle-1.22/blib/arch/auto/DBD/Oracle/Oracle.bundle
  Expected in: dynamic lookup
 at t/20select.t line 4
Compilation failed in require at t/20select.t line 4.
BEGIN failed--compilation aborted at t/20select.t line 4.
# Looks like your test died before it could output anything.
dubious
	Test returned status 255 (wstat 65280, 0xff00)
t/21nchar...............Can't load '/Users/nathan/.cpan/build/DBD-Oracle-1.22/blib/arch/auto/DBD/Oracle/Oracle.bundle' for module DBD::Oracle: dlopen(/Users/nathan/.cpan/build/DBD-Oracle-1.22/blib/arch/auto/DBD/Oracle/Oracle.bundle, 2): Symbol not found: _environ
  Referenced from: /Users/nathan/.cpan/build/DBD-Oracle-1.22/blib/arch/auto/DBD/Oracle/Oracle.bundle
  Expected in: dynamic lookup
 at t/21nchar.t line 12
Compilation failed in require at t/21nchar.t line 12.
BEGIN failed--compilation aborted at t/21nchar.t line 12.
# Looks like your test died before it could output anything.
dubious
	Test returned status 255 (wstat 65280, 0xff00)
t/22nchar_al32utf8......Can't load '/Users/nathan/.cpan/build/DBD-Oracle-1.22/blib/arch/auto/DBD/Oracle/Oracle.bundle' for module DBD::Oracle: dlopen(/Users/nathan/.cpan/build/DBD-Oracle-1.22/blib/arch/auto/DBD/Oracle/Oracle.bundle, 2): Symbol not found: _environ
  Referenced from: /Users/nathan/.cpan/build/DBD-Oracle-1.22/blib/arch/auto/DBD/Oracle/Oracle.bundle
  Expected in: dynamic lookup
 at t/22nchar_al32utf8.t line 9
Compilation failed in require at t/22nchar_al32utf8.t line 9.
BEGIN failed--compilation aborted at t/22nchar_al32utf8.t line 9.
# Looks like your test died before it could output anything.
dubious
	Test returned status 255 (wstat 65280, 0xff00)
t/22nchar_utf8..........Can't load '/Users/nathan/.cpan/build/DBD-Oracle-1.22/blib/arch/auto/DBD/Oracle/Oracle.bundle' for module DBD::Oracle: dlopen(/Users/nathan/.cpan/build/DBD-Oracle-1.22/blib/arch/auto/DBD/Oracle/Oracle.bundle, 2): Symbol not found: _environ
  Referenced from: /Users/nathan/.cpan/build/DBD-Oracle-1.22/blib/arch/auto/DBD/Oracle/Oracle.bundle
  Expected in: dynamic lookup
 at t/22nchar_utf8.t line 9
Compilation failed in require at t/22nchar_utf8.t line 9.
BEGIN failed--compilation aborted at t/22nchar_utf8.t line 9.
# Looks like your test died before it could output anything.
dubious
	Test returned status 255 (wstat 65280, 0xff00)
t/23wide_db.............Can't load '/Users/nathan/.cpan/build/DBD-Oracle-1.22/blib/arch/auto/DBD/Oracle/Oracle.bundle' for module DBD::Oracle: dlopen(/Users/nathan/.cpan/build/DBD-Oracle-1.22/blib/arch/auto/DBD/Oracle/Oracle.bundle, 2): Symbol not found: _environ
  Referenced from: /Users/nathan/.cpan/build/DBD-Oracle-1.22/blib/arch/auto/DBD/Oracle/Oracle.bundle
  Expected in: dynamic lookup
 at t/23wide_db.t line 9
Compilation failed in require at t/23wide_db.t line 9.
BEGIN failed--compilation aborted at t/23wide_db.t line 9.
# Looks like your test died before it could output anything.
dubious
	Test returned status 255 (wstat 65280, 0xff00)
t/23wide_db_8bit........Can't load '/Users/nathan/.cpan/build/DBD-Oracle-1.22/blib/arch/auto/DBD/Oracle/Oracle.bundle' for module DBD::Oracle: dlopen(/Users/nathan/.cpan/build/DBD-Oracle-1.22/blib/arch/auto/DBD/Oracle/Oracle.bundle, 2): Symbol not found: _environ
  Referenced from: /Users/nathan/.cpan/build/DBD-Oracle-1.22/blib/arch/auto/DBD/Oracle/Oracle.bundle
  Expected in: dynamic lookup
 at t/23wide_db_8bit.t line 9
Compilation failed in require at t/23wide_db_8bit.t line 9.
BEGIN failed--compilation aborted at t/23wide_db_8bit.t line 9.
# Looks like your test died before it could output anything.
dubious
	Test returned status 255 (wstat 65280, 0xff00)
t/23wide_db_al32utf8....Can't load '/Users/nathan/.cpan/build/DBD-Oracle-1.22/blib/arch/auto/DBD/Oracle/Oracle.bundle' for module DBD::Oracle: dlopen(/Users/nathan/.cpan/build/DBD-Oracle-1.22/blib/arch/auto/DBD/Oracle/Oracle.bundle, 2): Symbol not found: _environ
  Referenced from: /Users/nathan/.cpan/build/DBD-Oracle-1.22/blib/arch/auto/DBD/Oracle/Oracle.bundle
  Expected in: dynamic lookup
 at t/23wide_db_al32utf8.t line 9
Compilation failed in require at t/23wide_db_al32utf8.t line 9.
BEGIN failed--compilation aborted at t/23wide_db_al32utf8.t line 9.
# Looks like your test died before it could output anything.
dubious
	Test returned status 255 (wstat 65280, 0xff00)
t/24implicit_utf8.......Can't load '/Users/nathan/.cpan/build/DBD-Oracle-1.22/blib/arch/auto/DBD/Oracle/Oracle.bundle' for module DBD::Oracle: dlopen(/Users/nathan/.cpan/build/DBD-Oracle-1.22/blib/arch/auto/DBD/Oracle/Oracle.bundle, 2): Symbol not found: _environ
  Referenced from: /Users/nathan/.cpan/build/DBD-Oracle-1.22/blib/arch/auto/DBD/Oracle/Oracle.bundle
  Expected in: dynamic lookup
 at t/24implicit_utf8.t line 12
Compilation failed in require at t/24implicit_utf8.t line 12.
BEGIN failed--compilation aborted at t/24implicit_utf8.t line 12.
# Looks like your test died before it could output anything.
dubious
	Test returned status 255 (wstat 65280, 0xff00)
t/25plsql...............Can't load '/Users/nathan/.cpan/build/DBD-Oracle-1.22/blib/arch/auto/DBD/Oracle/Oracle.bundle' for module DBD::Oracle: dlopen(/Users/nathan/.cpan/build/DBD-Oracle-1.22/blib/arch/auto/DBD/Oracle/Oracle.bundle, 2): Symbol not found: _environ
  Referenced from: /Users/nathan/.cpan/build/DBD-Oracle-1.22/blib/arch/auto/DBD/Oracle/Oracle.bundle
  Expected in: dynamic lookup
 at t/25plsql.t line 5
Compilation failed in require at t/25plsql.t line 5.
BEGIN failed--compilation aborted at t/25plsql.t line 5.
# Looks like your test died before it could output anything.
dubious
	Test returned status 255 (wstat 65280, 0xff00)
t/26exe_array...........Can't load '/Users/nathan/.cpan/build/DBD-Oracle-1.22/blib/arch/auto/DBD/Oracle/Oracle.bundle' for module DBD::Oracle: dlopen(/Users/nathan/.cpan/build/DBD-Oracle-1.22/blib/arch/auto/DBD/Oracle/Oracle.bundle, 2): Symbol not found: _environ
  Referenced from: /Users/nathan/.cpan/build/DBD-Oracle-1.22/blib/arch/auto/DBD/Oracle/Oracle.bundle
  Expected in: dynamic lookup
 at t/26exe_array.t line 4
Compilation failed in require at t/26exe_array.t line 4.
BEGIN failed--compilation aborted at t/26exe_array.t line 4.
dubious
	Test returned status 2 (wstat 512, 0x200)
t/28array_bind..........Can't load '/Users/nathan/.cpan/build/DBD-Oracle-1.22/blib/arch/auto/DBD/Oracle/Oracle.bundle' for module DBD::Oracle: dlopen(/Users/nathan/.cpan/build/DBD-Oracle-1.22/blib/arch/auto/DBD/Oracle/Oracle.bundle, 2): Symbol not found: _environ
  Referenced from: /Users/nathan/.cpan/build/DBD-Oracle-1.22/blib/arch/auto/DBD/Oracle/Oracle.bundle
  Expected in: dynamic lookup
 at t/28array_bind.t line 22
Compilation failed in require at t/28array_bind.t line 22.
BEGIN failed--compilation aborted at t/28array_bind.t line 22.
dubious
	Test returned status 2 (wstat 512, 0x200)
t/30long................Can't load '/Users/nathan/.cpan/build/DBD-Oracle-1.22/blib/arch/auto/DBD/Oracle/Oracle.bundle' for module DBD::Oracle: dlopen(/Users/nathan/.cpan/build/DBD-Oracle-1.22/blib/arch/auto/DBD/Oracle/Oracle.bundle, 2): Symbol not found: _environ
  Referenced from: /Users/nathan/.cpan/build/DBD-Oracle-1.22/blib/arch/auto/DBD/Oracle/Oracle.bundle
  Expected in: dynamic lookup
 at t/30long.t line 5
Compilation failed in require at t/30long.t line 5.
BEGIN failed--compilation aborted at t/30long.t line 5.
dubious
	Test returned status 2 (wstat 512, 0x200)
t/31lob.................Can't load '/Users/nathan/.cpan/build/DBD-Oracle-1.22/blib/arch/auto/DBD/Oracle/Oracle.bundle' for module DBD::Oracle: dlopen(/Users/nathan/.cpan/build/DBD-Oracle-1.22/blib/arch/auto/DBD/Oracle/Oracle.bundle, 2): Symbol not found: _environ
  Referenced from: /Users/nathan/.cpan/build/DBD-Oracle-1.22/blib/arch/auto/DBD/Oracle/Oracle.bundle
  Expected in: dynamic lookup
 at t/31lob.t line 5
Compilation failed in require at t/31lob.t line 5.
BEGIN failed--compilation aborted at t/31lob.t line 5.
# Looks like your test died before it could output anything.
dubious
	Test returned status 255 (wstat 65280, 0xff00)
DIED. FAILED tests 1-9
	Failed 9/9 tests, 0.00% okay
t/31lob_extended........Can't load '/Users/nathan/.cpan/build/DBD-Oracle-1.22/blib/arch/auto/DBD/Oracle/Oracle.bundle' for module DBD::Oracle: dlopen(/Users/nathan/.cpan/build/DBD-Oracle-1.22/blib/arch/auto/DBD/Oracle/Oracle.bundle, 2): Symbol not found: _environ
  Referenced from: /Users/nathan/.cpan/build/DBD-Oracle-1.22/blib/arch/auto/DBD/Oracle/Oracle.bundle
  Expected in: dynamic lookup
 at t/31lob_extended.t line 16
Compilation failed in require at t/31lob_extended.t line 16.
BEGIN failed--compilation aborted at t/31lob_extended.t line 16.
# Looks like your test died before it could output anything.
dubious
	Test returned status 255 (wstat 65280, 0xff00)
t/32xmltype.............Can't load '/Users/nathan/.cpan/build/DBD-Oracle-1.22/blib/arch/auto/DBD/Oracle/Oracle.bundle' for module DBD::Oracle: dlopen(/Users/nathan/.cpan/build/DBD-Oracle-1.22/blib/arch/auto/DBD/Oracle/Oracle.bundle, 2): Symbol not found: _environ
  Referenced from: /Users/nathan/.cpan/build/DBD-Oracle-1.22/blib/arch/auto/DBD/Oracle/Oracle.bundle
  Expected in: dynamic lookup
 at t/32xmltype.t line 5
Compilation failed in require at t/32xmltype.t line 5.
BEGIN failed--compilation aborted at t/32xmltype.t line 5.
# Looks like your test died before it could output anything.
dubious
	Test returned status 255 (wstat 65280, 0xff00)
DIED. FAILED tests 1-4
	Failed 4/4 tests, 0.00% okay
t/34pres_lobs...........install_driver(Oracle) failed: Can't load '/Users/nathan/.cpan/build/DBD-Oracle-1.22/blib/arch/auto/DBD/Oracle/Oracle.bundle' for module DBD::Oracle: dlopen(/Users/nathan/.cpan/build/DBD-Oracle-1.22/blib/arch/auto/DBD/Oracle/Oracle.bundle, 2): Symbol not found: _environ
  Referenced from: /Users/nathan/.cpan/build/DBD-Oracle-1.22/blib/arch/auto/DBD/Oracle/Oracle.bundle
  Expected in: dynamic lookup
 at (eval 5) line 3
Compilation failed in require at (eval 5) line 3.
Perhaps a required shared library or dll isn't installed where expected
 at /Users/nathan/.cpan/build/DBD-Oracle-1.22/blib/lib/Oraperl.pm line 55
Compilation failed in require at t/34pres_lobs.t line 6.
BEGIN failed--compilation aborted at t/34pres_lobs.t line 6.
# Looks like your test died before it could output anything.
dubious
	Test returned status 255 (wstat 65280, 0xff00)
t/40ph_type.............Can't load '/Users/nathan/.cpan/build/DBD-Oracle-1.22/blib/arch/auto/DBD/Oracle/Oracle.bundle' for module DBD::Oracle: dlopen(/Users/nathan/.cpan/build/DBD-Oracle-1.22/blib/arch/auto/DBD/Oracle/Oracle.bundle, 2): Symbol not found: _environ
  Referenced from: /Users/nathan/.cpan/build/DBD-Oracle-1.22/blib/arch/auto/DBD/Oracle/Oracle.bundle
  Expected in: dynamic lookup
 at t/40ph_type.t line 6
Compilation failed in require at t/40ph_type.t line 6.
BEGIN failed--compilation aborted at t/40ph_type.t line 6.
# Looks like your test died before it could output anything.
dubious
	Test returned status 255 (wstat 65280, 0xff00)
t/50cursor..............Can't load '/Users/nathan/.cpan/build/DBD-Oracle-1.22/blib/arch/auto/DBD/Oracle/Oracle.bundle' for module DBD::Oracle: dlopen(/Users/nathan/.cpan/build/DBD-Oracle-1.22/blib/arch/auto/DBD/Oracle/Oracle.bundle, 2): Symbol not found: _environ
  Referenced from: /Users/nathan/.cpan/build/DBD-Oracle-1.22/blib/arch/auto/DBD/Oracle/Oracle.bundle
  Expected in: dynamic lookup
 at t/50cursor.t line 5
Compilation failed in require at t/50cursor.t line 5.
BEGIN failed--compilation aborted at t/50cursor.t line 5.
# Looks like your test died before it could output anything.
dubious
	Test returned status 255 (wstat 65280, 0xff00)
t/51scroll..............Can't load '/Users/nathan/.cpan/build/DBD-Oracle-1.22/blib/arch/auto/DBD/Oracle/Oracle.bundle' for module DBD::Oracle: dlopen(/Users/nathan/.cpan/build/DBD-Oracle-1.22/blib/arch/auto/DBD/Oracle/Oracle.bundle, 2): Symbol not found: _environ
  Referenced from: /Users/nathan/.cpan/build/DBD-Oracle-1.22/blib/arch/auto/DBD/Oracle/Oracle.bundle
  Expected in: dynamic lookup
 at t/51scroll.t line 5
Compilation failed in require at t/51scroll.t line 5.
BEGIN failed--compilation aborted at t/51scroll.t line 5.
# Looks like your test died before it could output anything.
dubious
	Test returned status 255 (wstat 65280, 0xff00)
DIED. FAILED tests 1-33
	Failed 33/33 tests, 0.00% okay
t/55nested..............Can't load '/Users/nathan/.cpan/build/DBD-Oracle-1.22/blib/arch/auto/DBD/Oracle/Oracle.bundle' for module DBD::Oracle: dlopen(/Users/nathan/.cpan/build/DBD-Oracle-1.22/blib/arch/auto/DBD/Oracle/Oracle.bundle, 2): Symbol not found: _environ
  Referenced from: /Users/nathan/.cpan/build/DBD-Oracle-1.22/blib/arch/auto/DBD/Oracle/Oracle.bundle
  Expected in: dynamic lookup
 at t/55nested.t line 5
Compilation failed in require at t/55nested.t line 5.
BEGIN failed--compilation aborted at t/55nested.t line 5.
# Looks like your test died before it could output anything.
dubious
	Test returned status 255 (wstat 65280, 0xff00)
t/56embbeded............Can't load '/Users/nathan/.cpan/build/DBD-Oracle-1.22/blib/arch/auto/DBD/Oracle/Oracle.bundle' for module DBD::Oracle: dlopen(/Users/nathan/.cpan/build/DBD-Oracle-1.22/blib/arch/auto/DBD/Oracle/Oracle.bundle, 2): Symbol not found: _environ
  Referenced from: /Users/nathan/.cpan/build/DBD-Oracle-1.22/blib/arch/auto/DBD/Oracle/Oracle.bundle
  Expected in: dynamic lookup
 at t/56embbeded.t line 4
Compilation failed in require at t/56embbeded.t line 4.
BEGIN failed--compilation aborted at t/56embbeded.t line 4.
dubious
	Test returned status 2 (wstat 512, 0x200)
t/60reauth..............Can't load '/Users/nathan/.cpan/build/DBD-Oracle-1.22/blib/arch/auto/DBD/Oracle/Oracle.bundle' for module DBD::Oracle: dlopen(/Users/nathan/.cpan/build/DBD-Oracle-1.22/blib/arch/auto/DBD/Oracle/Oracle.bundle, 2): Symbol not found: _environ
  Referenced from: /Users/nathan/.cpan/build/DBD-Oracle-1.22/blib/arch/auto/DBD/Oracle/Oracle.bundle
  Expected in: dynamic lookup
 at t/nchar_test_lib.pl line 6
Compilation failed in require at t/nchar_test_lib.pl line 6.
BEGIN failed--compilation aborted at t/nchar_test_lib.pl line 6.
Compilation failed in require at t/60reauth.t line 6.
# Looks like your test died before it could output anything.
dubious
	Test returned status 255 (wstat 65280, 0xff00)
t/70meta................Can't load '/Users/nathan/.cpan/build/DBD-Oracle-1.22/blib/arch/auto/DBD/Oracle/Oracle.bundle' for module DBD::Oracle: dlopen(/Users/nathan/.cpan/build/DBD-Oracle-1.22/blib/arch/auto/DBD/Oracle/Oracle.bundle, 2): Symbol not found: _environ
  Referenced from: /Users/nathan/.cpan/build/DBD-Oracle-1.22/blib/arch/auto/DBD/Oracle/Oracle.bundle
  Expected in: dynamic lookup
 at t/nchar_test_lib.pl line 6
Compilation failed in require at t/nchar_test_lib.pl line 6.
BEGIN failed--compilation aborted at t/nchar_test_lib.pl line 6.
Compilation failed in require at t/70meta.t line 9.
# Looks like your test died before it could output anything.
dubious
	Test returned status 255 (wstat 65280, 0xff00)
t/80ora_charset.........Can't load '/Users/nathan/.cpan/build/DBD-Oracle-1.22/blib/arch/auto/DBD/Oracle/Oracle.bundle' for module DBD::Oracle: dlopen(/Users/nathan/.cpan/build/DBD-Oracle-1.22/blib/arch/auto/DBD/Oracle/Oracle.bundle, 2): Symbol not found: _environ
  Referenced from: /Users/nathan/.cpan/build/DBD-Oracle-1.22/blib/arch/auto/DBD/Oracle/Oracle.bundle
  Expected in: dynamic lookup
 at t/80ora_charset.t line 8
Compilation failed in require at t/80ora_charset.t line 8.
BEGIN failed--compilation aborted at t/80ora_charset.t line 8.
dubious
	Test returned status 2 (wstat 512, 0x200)
Failed Test            Stat Wstat Total Fail  Failed  List of Failed
-------------------------------------------------------------------------------
t/01base.t                1   256     6    1  16.67%  4
t/10general.t           255 65280    ??   ??       %  ??
t/15nls.t               255 65280    ??   ??       %  ??
t/20select.t            255 65280    ??   ??       %  ??
t/21nchar.t             255 65280    ??   ??       %  ??
t/22nchar_al32utf8.t    255 65280    ??   ??       %  ??
t/22nchar_utf8.t        255 65280    ??   ??       %  ??
t/23wide_db.t           255 65280    ??   ??       %  ??
t/23wide_db_8bit.t      255 65280    ??   ??       %  ??
t/23wide_db_al32utf8.t  255 65280    ??   ??       %  ??
t/24implicit_utf8.t     255 65280    ??   ??       %  ??
t/25plsql.t             255 65280    ??   ??       %  ??
t/26exe_array.t           2   512    ??   ??       %  ??
t/28array_bind.t          2   512    ??   ??       %  ??
t/30long.t                2   512    ??   ??       %  ??
t/31lob.t               255 65280     9   18 200.00%  1-9
t/31lob_extended.t      255 65280    ??   ??       %  ??
t/32xmltype.t           255 65280     4    8 200.00%  1-4
t/34pres_lobs.t         255 65280    ??   ??       %  ??
t/40ph_type.t           255 65280    ??   ??       %  ??
t/50cursor.t            255 65280    ??   ??       %  ??
t/51scroll.t            255 65280    33   66 200.00%  1-33
t/55nested.t            255 65280    ??   ??       %  ??
t/56embbeded.t            2   512    ??   ??       %  ??
t/60reauth.t            255 65280    ??   ??       %  ??
t/70meta.t              255 65280    ??   ??       %  ??
t/80ora_charset.t         2   512    ??   ??       %  ??
2 tests and 2 subtests skipped.
Failed 27/29 test scripts, 6.90% okay. 47/52 subtests failed, 9.62% okay.
make: *** [test_dynamic] Error 2