All pastes #123823 Raw Edit

Anonymous

public text v1 · immutable
·published 2006-08-09 16:38 UTC
rendered paste body
make -C /lib/modules/2.6.15-26-686/build SUBDIRS=/home/james/Desktop/dripkg/agpgart-2.0 modules
make[1]: Entering directory `/usr/src/linux-headers-2.6.15-26-686'
  CC [M]  /home/james/Desktop/dripkg/agpgart-2.0/backend.o
/home/james/Desktop/dripkg/agpgart-2.0/backend.c:69: error: conflicting types for ‘agp_backend_acquire’
include/linux/agp_backend.h:105: error: previous declaration of ‘agp_backend_acquire’ was here
/home/james/Desktop/dripkg/agpgart-2.0/backend.c:89: error: conflicting types for ‘agp_backend_release’
include/linux/agp_backend.h:106: error: previous declaration of ‘agp_backend_release’ was here
/home/james/Desktop/dripkg/agpgart-2.0/backend.c:220: error: syntax error before ‘drm_agp’
/home/james/Desktop/dripkg/agpgart-2.0/backend.c:220: warning: type defaults to ‘int’ in declaration of ‘drm_agp’
/home/james/Desktop/dripkg/agpgart-2.0/backend.c:221: warning: initialization makes integer from pointer without a cast
/home/james/Desktop/dripkg/agpgart-2.0/backend.c:222: warning: excess elements in scalar initializer
/home/james/Desktop/dripkg/agpgart-2.0/backend.c:222: warning: (near initialization for ‘drm_agp’)
/home/james/Desktop/dripkg/agpgart-2.0/backend.c:223: warning: excess elements in scalar initializer
/home/james/Desktop/dripkg/agpgart-2.0/backend.c:223: warning: (near initialization for ‘drm_agp’)
/home/james/Desktop/dripkg/agpgart-2.0/backend.c:224: warning: excess elements in scalar initializer
/home/james/Desktop/dripkg/agpgart-2.0/backend.c:224: warning: (near initialization for ‘drm_agp’)
/home/james/Desktop/dripkg/agpgart-2.0/backend.c:225: warning: excess elements in scalar initializer
/home/james/Desktop/dripkg/agpgart-2.0/backend.c:225: warning: (near initialization for ‘drm_agp’)
/home/james/Desktop/dripkg/agpgart-2.0/backend.c:226: warning: excess elements in scalar initializer
/home/james/Desktop/dripkg/agpgart-2.0/backend.c:226: warning: (near initialization for ‘drm_agp’)
/home/james/Desktop/dripkg/agpgart-2.0/backend.c:227: warning: excess elements in scalar initializer
/home/james/Desktop/dripkg/agpgart-2.0/backend.c:227: warning: (near initialization for ‘drm_agp’)
/home/james/Desktop/dripkg/agpgart-2.0/backend.c:229: warning: excess elements in scalar initializer
/home/james/Desktop/dripkg/agpgart-2.0/backend.c:229: warning: (near initialization for ‘drm_agp’)
/home/james/Desktop/dripkg/agpgart-2.0/backend.c:229: warning: data definition has no type or storage class
/home/james/Desktop/dripkg/agpgart-2.0/backend.c: In function ‘agp_add_bridge’:
/home/james/Desktop/dripkg/agpgart-2.0/backend.c:281: warning: ‘inter_module_register’ is deprecated (declared at include/linux/module.h:571)
/home/james/Desktop/dripkg/agpgart-2.0/backend.c: In function ‘agp_remove_bridge’:
/home/james/Desktop/dripkg/agpgart-2.0/backend.c:301: warning: ‘inter_module_unregister’ is deprecated (declared at include/linux/module.h:572)
make[2]: *** [/home/james/Desktop/dripkg/agpgart-2.0/backend.o] Error 1
make[1]: *** [_module_/home/james/Desktop/dripkg/agpgart-2.0] Error 2
make[1]: Leaving directory `/usr/src/linux-headers-2.6.15-26-686'
make: *** [default] Error 2
make -f Makefile.linux DRM_MODULES=gdg.ko modules
make[1]: Entering directory `/home/james/Desktop/dripkg/drm'
make -C /lib/modules/2.6.15-26-686/build  SUBDIRS=`pwd` DRMSRCDIR=`pwd` modules
make[2]: Entering directory `/usr/src/linux-headers-2.6.15-26-686'
  CC [M]  /home/james/Desktop/dripkg/drm/gdg_drv.o
In file included from /home/james/Desktop/dripkg/drm/gdg_drv.c:12:
/home/james/Desktop/dripkg/drm/drmP.h:647:5: warning: "__HAVE_VBL_IRQ" is not defined
/home/james/Desktop/dripkg/drm/drmP.h:750:5: warning: "__HAVE_VBL_IRQ" is not defined
/home/james/Desktop/dripkg/drm/drmP.h:967:5: warning: "__HAVE_VBL_IRQ" is not defined
/home/james/Desktop/dripkg/drm/drmP.h:973:5: warning: "__HAVE_IRQ_BH" is not defined
/home/james/Desktop/dripkg/drm/drmP.h:1021:5: warning: "__HAVE_SG" is not defined
In file included from /home/james/Desktop/dripkg/drm/gdg_drv.c:17:
/home/james/Desktop/dripkg/drm/drm_agpsupport.h:47: error: syntax error before ‘*’ token
/home/james/Desktop/dripkg/drm/drm_agpsupport.h:47: warning: type defaults to ‘int’ in declaration of ‘drm_agp’
/home/james/Desktop/dripkg/drm/drm_agpsupport.h:47: warning: data definition has no type or storage class
/home/james/Desktop/dripkg/drm/drm_agpsupport.h: In function ‘gdg_agp_info’:
/home/james/Desktop/dripkg/drm/drm_agpsupport.h:69: error: request for member ‘copy_info’ in something not a structure or union
/home/james/Desktop/dripkg/drm/drm_agpsupport.h: In function ‘gdg_agp_acquire’:
/home/james/Desktop/dripkg/drm/drm_agpsupport.h:111: error: request for member ‘acquire’ in something not a structure or union
/home/james/Desktop/dripkg/drm/drm_agpsupport.h:117: error: request for member ‘acquire’ in something not a structure or union
/home/james/Desktop/dripkg/drm/drm_agpsupport.h: In function ‘gdg_agp_release’:
/home/james/Desktop/dripkg/drm/drm_agpsupport.h:140: error: request for member ‘release’ in something not a structure or union
/home/james/Desktop/dripkg/drm/drm_agpsupport.h:142: error: request for member ‘release’ in something not a structure or union
/home/james/Desktop/dripkg/drm/drm_agpsupport.h: In function ‘gdg_agp_do_release’:
/home/james/Desktop/dripkg/drm/drm_agpsupport.h:155: error: request for member ‘release’ in something not a structure or union
/home/james/Desktop/dripkg/drm/drm_agpsupport.h:156: error: request for member ‘release’ in something not a structure or union
/home/james/Desktop/dripkg/drm/drm_agpsupport.h: In function ‘gdg_agp_enable’:
/home/james/Desktop/dripkg/drm/drm_agpsupport.h:178: error: request for member ‘enable’ in something not a structure or union
/home/james/Desktop/dripkg/drm/drm_agpsupport.h:185: error: request for member ‘enable’ in something not a structure or union
/home/james/Desktop/dripkg/drm/drm_agpsupport.h: In function ‘gdg_agp_bind’:
/home/james/Desktop/dripkg/drm/drm_agpsupport.h:333: error: request for member ‘bind_memory’ in something not a structure or union
/home/james/Desktop/dripkg/drm/drm_agpsupport.h: In function ‘gdg_agp_init’:
/home/james/Desktop/dripkg/drm/drm_agpsupport.h:407: error: ‘drm_agp_t’ undeclared (first use in this function)
/home/james/Desktop/dripkg/drm/drm_agpsupport.h:407: error: (Each undeclared identifier is reported only once
/home/james/Desktop/dripkg/drm/drm_agpsupport.h:407: error: for each function it appears in.)
/home/james/Desktop/dripkg/drm/drm_agpsupport.h:407: error: syntax error before ‘)’ token
/home/james/Desktop/dripkg/drm/drm_agpsupport.h:412: error: request for member ‘copy_info’ in something not a structure or union
/home/james/Desktop/dripkg/drm/drm_agpsupport.h: In function ‘gdg_agp_uninit’:
/home/james/Desktop/dripkg/drm/drm_agpsupport.h:436: warning: ‘inter_module_put’ is deprecated (declared at include/linux/module.h:575)
/home/james/Desktop/dripkg/drm/drm_agpsupport.h: In function ‘gdg_agp_allocate_memory’:
/home/james/Desktop/dripkg/drm/drm_agpsupport.h:443: error: request for member ‘allocate_memory’ in something not a structure or union
/home/james/Desktop/dripkg/drm/drm_agpsupport.h:445: error: request for member ‘allocate_memory’ in something not a structure or union
/home/james/Desktop/dripkg/drm/drm_agpsupport.h:446: warning: control reaches end of non-void function
/home/james/Desktop/dripkg/drm/drm_agpsupport.h: In function ‘gdg_agp_free_memory’:
/home/james/Desktop/dripkg/drm/drm_agpsupport.h:451: error: request for member ‘free_memory’ in something not a structure or union
/home/james/Desktop/dripkg/drm/drm_agpsupport.h:453: error: request for member ‘free_memory’ in something not a structure or union
/home/james/Desktop/dripkg/drm/drm_agpsupport.h: In function ‘gdg_agp_bind_memory’:
/home/james/Desktop/dripkg/drm/drm_agpsupport.h:460: error: request for member ‘bind_memory’ in something not a structure or union
/home/james/Desktop/dripkg/drm/drm_agpsupport.h:462: error: request for member ‘bind_memory’ in something not a structure or union
/home/james/Desktop/dripkg/drm/drm_agpsupport.h:463: warning: control reaches end of non-void function
/home/james/Desktop/dripkg/drm/drm_agpsupport.h: In function ‘gdg_agp_unbind_memory’:
/home/james/Desktop/dripkg/drm/drm_agpsupport.h:468: error: request for member ‘unbind_memory’ in something not a structure or union
/home/james/Desktop/dripkg/drm/drm_agpsupport.h:470: error: request for member ‘unbind_memory’ in something not a structure or union
/home/james/Desktop/dripkg/drm/drm_agpsupport.h:471: warning: control reaches end of non-void function
In file included from /home/james/Desktop/dripkg/drm/gdg_drv.c:22:
/home/james/Desktop/dripkg/drm/drm_drv.h:246:5: warning: "__HAVE_VBL_IRQ" is not defined
In file included from /home/james/Desktop/dripkg/drm/gdg_drv.c:25:
/home/james/Desktop/dripkg/drm/drm_irq.h:137:5: warning: "__HAVE_IRQ_BH" is not defined
/home/james/Desktop/dripkg/drm/drm_irq.h:148:5: warning: "__HAVE_VBL_IRQ" is not defined
/home/james/Desktop/dripkg/drm/drm_irq.h:239:5: warning: "__HAVE_VBL_IRQ" is not defined
In file included from /home/james/Desktop/dripkg/drm/gdg_drv.c:28:
/home/james/Desktop/dripkg/drm/drm_memory.h: In function ‘drm_follow_page’:
/home/james/Desktop/dripkg/drm/drm_memory.h:139: warning: passing argument 1 of ‘pmd_offset’ from incompatible pointer type
In file included from /home/james/Desktop/dripkg/drm/gdg_drv.c:30:
/home/james/Desktop/dripkg/drm/drm_vm.h:79:5: warning: "__alpha__" is not defined
In file included from /home/james/Desktop/dripkg/drm/gdg_drv.c:30:
/home/james/Desktop/dripkg/drm/drm_vm.h: In function ‘gdg_mmap’:
/home/james/Desktop/dripkg/drm/drm_vm.h:625: warning: implicit declaration of function ‘remap_page_range’
In file included from /home/james/Desktop/dripkg/drm/gdg_drv.c:31:
/home/james/Desktop/dripkg/drm/drm_stub.h: In function ‘gdg_stub_putminor’:
/home/james/Desktop/dripkg/drm/drm_stub.h:145: warning: ‘inter_module_put’ is deprecated (declared at include/linux/module.h:575)
/home/james/Desktop/dripkg/drm/drm_stub.h:147: warning: ‘inter_module_unregister’ is deprecated (declared at include/linux/module.h:572)
/home/james/Desktop/dripkg/drm/drm_stub.h: In function ‘gdg_stub_register’:
/home/james/Desktop/dripkg/drm/drm_stub.h:177: warning: implicit declaration of function ‘inter_module_get’
/home/james/Desktop/dripkg/drm/drm_stub.h:188: warning: ‘inter_module_register’ is deprecated (declared at include/linux/module.h:571)
make[3]: *** [/home/james/Desktop/dripkg/drm/gdg_drv.o] Error 1
make[2]: *** [_module_/home/james/Desktop/dripkg/drm] Error 2
make[2]: Leaving directory `/usr/src/linux-headers-2.6.15-26-686'
make[1]: *** [modules] Error 2
make[1]: Leaving directory `/home/james/Desktop/dripkg/drm'
make: *** [gdg.ko] Error 2