All pastes #123323 Raw Edit

Untitled

public text v1 · immutable
·published 2006-08-09 05:49 UTC
rendered paste body
-----------------------------------------------------------------------------


PREPARING FOR PHASE 2...

#############################################################################
#             easy_e17.sh (1.0.2) by Brian 'morlenxus' Miculcy              #
#                                                                           #
#         Thanks to David 'onefang' Seikel for contributing patches!        #
#    This is the result of the ideas from the people of #e.de - join us.    #
# Updates: http://omicron.homeip.net/projects/ | Contact: morlenxus@gmx.net #
#############################################################################


CURRENT CONFIGURATION:
  - install-path:     /opt/e17
  - cvs-path:         /home/keo/e17_cvs
  - logs-path:        /tmp/easy_e17/install_logs
  - nice level:       0

  - installable libs:     imlib2 edb eet evas ecore epeg embryo edje epsilon esmart emotion ewl engrave exml
  - installable apps:     entrance e eclair evfs e_utils
  - installable misc:     engage scrot
  - installable proto:    etk etk_server exhibit entropy ephoto empower
  - installable modules:  calendar cpu devian eveil evolume flame language mbar mem moon mount net rain screenshot slideshow snow tclock uptime weather wlan
  - skipping:             -

  - script action:        install


BUILD PHASE: 2/3
  - lib-compilation and installation
  - apps-compilation and installation

#############################################################################



LIB-COMPILATION AND INSTALLATION:
-----------------------------------------------------------------------------
- imlib2 ..................... ok
- edb ........................ ok
- eet ........................ ok
- evas ....................... ok
- ecore ...................... ERROR!
-----------------------------------------------------------------------------

LAST LOGLINES FROM /tmp/easy_e17/install_logs/ecore.log:
-----------------------------------------------------------------------------
ecore_fb_vt.c:78: warning: unused variable `tio'
ecore_fb_vt.c: At top level:
ecore_fb_vt.c:60: warning: '_ecore_fb_vt_switch' defined but not used
 gcc -DHAVE_CONFIG_H -I. -I. -I../../.. -I../../../src/lib/ecore -I../../../src/lib/ecore -I/opt/e17/include -I/opt/e17/include -g -O2 -Wall -MT ecore_fb_vt.lo -MD -MP -MF .deps/ecore_fb_vt.Tpo -c ecore_fb_vt.c -o ecore_fb_vt.o >/dev/null 2>&1
if /bin/sh ../../../libtool --tag=CC --mode=compile gcc -DHAVE_CONFIG_H -I. -I. -I../../.. -I../../../src/lib/ecore -I../../../src/lib/ecore  -I/opt/e17/include  -I/opt/e17/include -g -O2 -Wall -MT ecore_fb_li.lo -MD -MP -MF ".deps/ecore_fb_li.Tpo" -c -o ecore_fb_li.lo ecore_fb_li.c; \
        then mv -f ".deps/ecore_fb_li.Tpo" ".deps/ecore_fb_li.Plo"; else rm -f ".deps/ecore_fb_li.Tpo"; exit 1; fi
 gcc -DHAVE_CONFIG_H -I. -I. -I../../.. -I../../../src/lib/ecore -I../../../src/lib/ecore -I/opt/e17/include -I/opt/e17/include -g -O2 -Wall -MT ecore_fb_li.lo -MD -MP -MF .deps/ecore_fb_li.Tpo -c ecore_fb_li.c  -fPIC -DPIC -o .libs/ecore_fb_li.o
ecore_fb_li.c: In function `ecore_fb_input_device_open':
ecore_fb_li.c:385: error: `EV_SYN' undeclared (first use in this function)
ecore_fb_li.c:385: error: (Each undeclared identifier is reported only once
ecore_fb_li.c:385: error: for each function it appears in.)
ecore_fb_li.c:405: error: `EV_FF_STATUS' undeclared (first use in this function)ecore_fb_li.c:406: error: `EV_PWR' undeclared (first use in this function)
ecore_fb_li.c: In function `ecore_fb_input_device_axis_size_set':
ecore_fb_li.c:454: error: storage size of 'abs_features' isn't known
ecore_fb_li.c:454: warning: unused variable `abs_features'
make[4]: *** [ecore_fb_li.lo] Error 1
make[4]: Leaving directory `/home/keo/e17_cvs/e17/libs/ecore/src/lib/ecore_fb'
make[3]: *** [all-recursive] Error 1
make[3]: Leaving directory `/home/keo/e17_cvs/e17/libs/ecore/src/lib'
make[2]: *** [all-recursive] Error 1
make[2]: Leaving directory `/home/keo/e17_cvs/e17/libs/ecore/src'
make[1]: *** [all-recursive] Error 1
make[1]: Leaving directory `/home/keo/e17_cvs/e17/libs/ecore'
make: *** [all] Error 2
-----------------------------------------------------------------------------


keo[~]$