rendered paste bodymake[4]: Entering directory `/home/rick/cvs_apps/kopetesvn/kdenetwork/kopete/libkopete/avdevice'
if /bin/sh ../../../libtool --silent --mode=compile --tag=CXX g++ -DHAVE_CONFIG_H -I. -I. -I../../.. -DKDE_NO_COMPAT -DQT_NO _COMPAT -DQT_NO_CAST_ASCII -DQT_NO_ASCII_CAST -I../../../kopete/libkopete -I../../../kopete/libkopete/avdevice -I../../../kop ete/libkopete/ui -I../../../kopete/libkopete/ui -I../../../kopete/libkopete/private -I../../../kopete/libkopete/ui -I/usr/kde /3.3/include -I/usr/qt/3/include -I. -DQT_THREAD_SUPPORT -D_REENTRANT -D_FILE_OFFSET_BITS=64 -Wnon-virtual-dtor -Wno-long- long -Wundef -ansi -D_XOPEN_SOURCE=500 -D_BSD_SOURCE -Wcast-align -Wconversion -Wchar-subscripts -Wall -W -Wpointer-arith -Wn o-non-virtual-dtor -g3 -fno-inline -Wformat-security -Wmissing-format-attribute -fno-exceptions -fno-check-new -fno-common -D QT_CLEAN_NAMESPACE -DQT_NO_ASCII_CAST -DQT_NO_STL -DQT_NO_COMPAT -DQT_NO_TRANSLATION -MT videodevice.lo -MD -MP -MF ".deps/v ideodevice.Tpo" \
-c -o videodevice.lo `test -f 'videodevice.cpp' || echo './'`videodevice.cpp; \
then mv -f ".deps/videodevice.Tpo" ".deps/videodevice.Plo"; \
else rm -f ".deps/videodevice.Tpo"; exit 1; \
fi
In file included from /usr/include/linux/fs.h:12,
from videodevice.cpp:42:
/usr/include/linux/wait.h: In function `int
waitqueue_active(wait_queue_head_t*)':
/usr/include/linux/wait.h:79: error: `list_empty' undeclared (first use this
function)
/usr/include/linux/wait.h:79: error: (Each undeclared identifier is reported
only once for each function it appears in.)
In file included from videodevice.cpp:54:
videoinput.h: At global scope:
videoinput.h:38: warning: `visibility' attribute does not apply to types
In file included from videodevice.cpp:55:
videodevice.h:104: warning: `visibility' attribute does not apply to types
make[4]: *** [videodevice.lo] Error 1
make[4]: Leaving directory `/home/rick/cvs_apps/kopetesvn/kdenetwork/kopete/libkopete/avdevice'
make[3]: *** [all-recursive] Error 1
make[3]: Leaving directory `/home/rick/cvs_apps/kopetesvn/kdenetwork/kopete/libkopete'
make[2]: *** [all-recursive] Error 1
make[2]: Leaving directory `/home/rick/cvs_apps/kopetesvn/kdenetwork/kopete'
make[1]: *** [all-recursive] Error 1
make[1]: Leaving directory `/home/rick/cvs_apps/kopetesvn/kdenetwork'
make: *** [all] Error 2