make -C installwatch-0.7.0beta4
make[1]: Entering directory `/usr/local/software/checkinstall-1.6.0/installwatch-0.7.0beta4'
gcc -Wall -c -D_GNU_SOURCE -DPIC -fPIC -D_REENTRANT -DVERSION=\"0.7.0beta3\" installwatch.c
installwatch.c:96: error: syntax error before "__mode_t"
installwatch.c:98: error: syntax error before "__off64_t"
installwatch.c:104: warning: "struct stat64" declared inside parameter list
installwatch.c:104: warning: its scope is only this definition or declaration, which is probably not what you want
installwatch.c:105: warning: "struct stat64" declared inside parameter list
installwatch.c:106: error: syntax error before "__off64_t"
installwatch.c: In function `true_stat':
installwatch.c:117: error: `_STAT_VER' undeclared (first use in this function)
installwatch.c:117: error: (Each undeclared identifier is reported only once
installwatch.c:117: error: for each function it appears in.)
installwatch.c: In function `true_mknod':
installwatch.c:121: error: `_MKNOD_VER' undeclared (first use in this function)
installwatch.c: In function `true_lstat':
installwatch.c:125: error: `_STAT_VER' undeclared (first use in this function)
installwatch.c: At top level:
installwatch.c:260: warning: conflicting types for built-in function 'log'
installwatch.c: In function `__instw_printdirent':
installwatch.c:847: error: structure has no member named `d_type'
installwatch.c: In function `__instw_printdirent64':
installwatch.c:873: warning: long long int format, uint64_t arg (arg 4)
installwatch.c:873: warning: long long int format, int64_t arg (arg 5)
installwatch.c: In function `fopen':
installwatch.c:2307: warning: cast from pointer to integer of different size
installwatch.c:2322: warning: cast from pointer to integer of different size
installwatch.c: At top level:
installwatch.c:2811: error: conflicting types for 'scandir'
/usr/include/dirent.h:45: error: previous declaration of 'scandir' was here
installwatch.c:2811: error: conflicting types for 'scandir'
/usr/include/dirent.h:45: error: previous declaration of 'scandir' was here
installwatch.c:3038: error: conflicting types for 'utime'
/usr/include/utime.h:15: error: previous declaration of 'utime' was here
installwatch.c:3038: error: conflicting types for 'utime'
/usr/include/utime.h:15: error: previous declaration of 'utime' was here
installwatch.c:3076: error: syntax error before "__mode_t"
installwatch.c: In function `creat64':
installwatch.c:3076: error: number of arguments doesn't match prototype
/usr/include/unistd.h:52: error: prototype declaration
installwatch.c:3087: error: `pathname' undeclared (first use in this function)
installwatch.c:3093: error: `mode' undeclared (first use in this function)
installwatch.c: At top level:
installwatch.c:3115: error: syntax error before "__off64_t"
installwatch.c: In function `ftruncate64':
installwatch.c:3127: error: `fd' undeclared (first use in this function)
installwatch.c:3127: error: `length' undeclared (first use in this function)
installwatch.c: In function `fopen64':
installwatch.c:3176: warning: cast from pointer to integer of different size
installwatch.c: At top level:
installwatch.c:3271: error: conflicting types for 'scandir64'
/usr/include/dirent.h:48: error: previous declaration of 'scandir64' was here
installwatch.c:3271: error: conflicting types for 'scandir64'
/usr/include/dirent.h:48: error: previous declaration of 'scandir64' was here
installwatch.c:3293: warning: "struct stat64" declared inside parameter list
installwatch.c: In function `__xstat64':
installwatch.c:3305: warning: passing arg 3 of pointer to function from incompatible pointer type
installwatch.c:3320: warning: passing arg 3 of pointer to function from incompatible pointer type
installwatch.c:3324: warning: passing arg 3 of pointer to function from incompatible pointer type
installwatch.c: At top level:
installwatch.c:3332: warning: "struct stat64" declared inside parameter list
installwatch.c: In function `__lxstat64':
installwatch.c:3344: warning: passing arg 3 of pointer to function from incompatible pointer type
installwatch.c:3359: warning: passing arg 3 of pointer to function from incompatible pointer type
installwatch.c:3363: warning: passing arg 3 of pointer to function from incompatible pointer type
installwatch.c: At top level:
installwatch.c:3371: error: syntax error before "__off64_t"
installwatch.c: In function `truncate64':
installwatch.c:3384: error: `path' undeclared (first use in this function)
installwatch.c:3390: error: `length' undeclared (first use in this function)
make[1]: *** [installwatch.o] Error 1
make[1]: Leaving directory `/usr/local/software/checkinstall-1.6.0/installwatch-0.7.0beta4'
make: *** [all] Error 2