All pastes #119300 Raw Edit

Unnamed

public text v1 · immutable
·published 2006-08-06 19:42 UTC
rendered paste body
frepe@lovin:~/src/gst-python_cvs/gst-python$ ./configure && make
checking for a BSD-compatible install... /usr/bin/install -c
checking whether build environment is sane... yes
checking for gawk... no
checking for mawk... mawk
checking whether make sets $(MAKE)... yes
checking nano version... 1
checking whether to enable maintainer-specific portions of Makefiles... no
checking build system type... i686-pc-linux-gnu
checking host system type... i686-pc-linux-gnu
checking for style of include used by make... GNU
checking for gcc... gcc
checking for C compiler default output file name... a.out
checking whether the C compiler works... yes
checking whether we are cross compiling... no
checking for suffix of executables...
checking for suffix of object files... o
checking whether we are using the GNU C compiler... yes
checking whether gcc accepts -g... yes
checking for gcc option to accept ANSI C... none needed
checking dependency style of gcc... gcc3
checking for a sed that does not truncate output... /bin/sed
checking for egrep... grep -E
checking for ld used by gcc... /usr/bin/ld
checking if the linker (/usr/bin/ld) is GNU ld... yes
checking for /usr/bin/ld option to reload object files... -r
checking for BSD-compatible nm... /usr/bin/nm -B
checking whether ln -s works... yes
checking how to recognise dependent libraries... pass_all
checking how to run the C preprocessor... gcc -E
checking for ANSI C header files... yes
checking for sys/types.h... yes
checking for sys/stat.h... yes
checking for stdlib.h... yes
checking for string.h... yes
checking for memory.h... yes
checking for strings.h... yes
checking for inttypes.h... yes
checking for stdint.h... yes
checking for unistd.h... yes
checking dlfcn.h usability... yes
checking dlfcn.h presence... yes
checking for dlfcn.h... yes
checking for g++... g++
checking whether we are using the GNU C++ compiler... yes
checking whether g++ accepts -g... yes
checking dependency style of g++... gcc3
checking how to run the C++ preprocessor... g++ -E
checking for g77... no
checking for f77... no
checking for xlf... no
checking for frt... no
checking for pgf77... no
checking for fort77... no
checking for fl32... no
checking for af77... no
checking for f90... no
checking for xlf90... no
checking for pgf90... no
checking for epcf90... no
checking for f95... no
checking for fort... no
checking for xlf95... no
checking for ifc... no
checking for efc... no
checking for pgf95... no
checking for lf95... no
checking for gfortran... no
checking whether we are using the GNU Fortran 77 compiler... no
checking whether  accepts -g... no
checking the maximum length of command line arguments... 32768
checking command to parse /usr/bin/nm -B output from gcc object... ok
checking for objdir... .libs
checking for ar... ar
checking for ranlib... ranlib
checking for strip... strip
checking if gcc supports -fno-rtti -fno-exceptions... no
checking for gcc option to produce PIC... -fPIC
checking if gcc PIC flag -fPIC works... yes
checking if gcc static flag -static works... yes
checking if gcc supports -c -o file.o... yes
checking whether the gcc linker (/usr/bin/ld) supports shared libraries... yes
checking whether -lc should be explicitly linked in... no
checking dynamic linker characteristics... GNU/Linux ld.so
checking how to hardcode library paths into programs... immediate
checking whether stripping libraries is possible... yes
checking if libtool supports shared libraries... yes
checking whether to build shared libraries... yes
checking whether to build static libraries... no
configure: creating libtool
appending configuration tag "CXX" to libtool
checking for ld used by g++... /usr/bin/ld
checking if the linker (/usr/bin/ld) is GNU ld... yes
checking whether the g++ linker (/usr/bin/ld) supports shared libraries... yes
checking for g++ option to produce PIC... -fPIC
checking if g++ PIC flag -fPIC works... yes
checking if g++ static flag -static works... yes
checking if g++ supports -c -o file.o... yes
checking whether the g++ linker (/usr/bin/ld) supports shared libraries... yes
checking dynamic linker characteristics... GNU/Linux ld.so
checking how to hardcode library paths into programs... immediate
appending configuration tag "F77" to libtool
checking for python... /usr/bin/python
checking for python version... 2.4
checking for python platform... linux2
checking for python script directory... ${prefix}/lib/python2.4/site-packages
checking for python extension module directory... ${exec_prefix}/lib/python2.4/site-packages
checking for python >= 2.3... okay
checking for headers required to compile python extensions... found
checking for pkg-config... /usr/bin/pkg-config
checking pkg-config is at least version 0.9.0... yes
checking for GST... yes
Building against GStreamer core 0.10.6 , ignoring API additions if needed
checking for GST_BASE... yes
checking for GST_CONTROLLER... yes
checking for GST_NET... yes
checking for GST_DP... yes
checking for GST_PLUGINS_BASE... yes
checking for PYGTK... yes
checking for pygtk defs... /usr/share/pygtk/2.0/defs
checking for pygtk h2def... /usr/share/pygtk/2.0/codegen/h2def.py
checking for pygtk codegen... /usr/bin/python /usr/share/pygtk/2.0/codegen/codegen.py
checking to see if compiler understands -Wall... yes
checking to see if compiler understands -Werror... yes
configure: set ERROR_CFLAGS to -Wall -Werror
checking for valgrind... /usr/bin/valgrind
configure: creating ./config.status
config.status: creating Makefile
config.status: creating codegen/Makefile
config.status: creating gst/Makefile
config.status: creating gst/gstversion.override
config.status: creating gst/extend/Makefile
config.status: creating examples/Makefile
config.status: creating pkgconfig/Makefile
config.status: creating pkgconfig/gst-python.pc
config.status: creating pkgconfig/gst-python-uninstalled.pc
config.status: creating testsuite/Makefile
config.status: creating gst-python.spec
config.status: creating config.h
config.status: config.h is unchanged
config.status: executing depfiles commands
if test -f pygst.py; then chmod +w pygst.py; fi
sed -e "s|@PYGSTDIR\@|/home/frepe/src/gst-python_cvs/gst-python|g" \
            -e "s|@GST_MAJORMINOR\@|0.10|g" \
            pygst.py.in > pygst.py
chmod -w pygst.py
make  all-recursive
make[1]: Entering directory `/home/frepe/src/gst-python_cvs/gst-python'
Making all in codegen
make[2]: Entering directory `/home/frepe/src/gst-python_cvs/gst-python/codegen'
make[2]: Nothing to be done for `all'.
make[2]: Leaving directory `/home/frepe/src/gst-python_cvs/gst-python/codegen'
Making all in gst
make[2]: Entering directory `/home/frepe/src/gst-python_cvs/gst-python/gst'
Making all in extend
make[3]: Entering directory `/home/frepe/src/gst-python_cvs/gst-python/gst/extend'
make[3]: Nothing to be done for `all'.
make[3]: Leaving directory `/home/frepe/src/gst-python_cvs/gst-python/gst/extend'
make[3]: Entering directory `/home/frepe/src/gst-python_cvs/gst-python/gst'
(cd . \
        && python ../codegen/codegen.py \
                --load-types ./arg-types.py \
                --register ./gst-types.defs \
                --override gst.override \
                --extendpath ../gst/ \
                --prefix pygst gst.defs) > gen-gst.c \
        && cp gen-gst.c gst.c \
        && rm -f gen-gst.c
Could not write method GstSegment.set_seek: No ArgType for 'gboolean*'
Could not write method GstSegment.clip: No ArgType for 'gint64*'
Could not write method GstIndexEntry.assoc_map: No ArgType for 'gint64*'
Could not write getter for GstStaticCaps.caps: write_return not implemented for GstCaps
Could not write method GstIndex.set_filter: No ArgType for 'GstIndexFilter'
Could not write method GstIndex.set_resolver: No ArgType for 'GstIndexResolver'
Could not write method GstIndex.get_writer_id: No ArgType for 'gint*'
Could not write method GstIndex.add_associationv: No ArgType for 'const-GstIndexAssociation*'
Could not write method GstIndex.add_association: varargs functions not supported
Could not write method GstIndex.add_object: No ArgType for 'gpointer'
Could not write virtual accessor method GstIndex.get_assoc_entry: No ArgType for 'GCompareDataFunc'
Could not write virtual proxy GstIndex.get_assoc_entry: No ArgType for 'GCompareDataFunc'
Could not write virtual accessor method GstElement.get_query_types: No ArgType for 'const-GstQueryType*'
Could not write virtual accessor method GstElement.get_state: No ArgType for 'GstState*'
Could not write virtual proxy GstElement.get_query_types: No ArgType for 'const-GstQueryType*'
Could not write virtual proxy GstElement.get_state: No ArgType for 'GstState*'
Could not write method GstClock.add_observation: No ArgType for 'gdouble*'
Could not write virtual accessor method GstClock.wait: No ArgType for 'GstClockEntry*'
Could not write virtual accessor method GstClock.wait_async: No ArgType for 'GstClockEntry*'
Could not write virtual accessor method GstClock.unschedule: No ArgType for 'GstClockEntry'
Could not write virtual proxy GstClock.wait: No ArgType for 'GstClockEntry*'
Could not write virtual proxy GstClock.wait_async: No ArgType for 'GstClockEntry*'
Could not write virtual proxy GstClock.unschedule: No ArgType for 'GstClockEntry'
Could not write method GstPad.set_bufferalloc_function: No ArgType for 'GstPadBufferAllocFunction'
Could not write method GstPad.set_activate_function: No ArgType for 'GstPadActivateFunction'
Could not write method GstPad.set_activatepull_function: No ArgType for 'GstPadActivateModeFunction'
Could not write method GstPad.set_activatepush_function: No ArgType for 'GstPadActivateModeFunction'
Could not write method GstPad.set_getrange_function: No ArgType for 'GstPadGetRangeFunction'
Could not write method GstPad.set_checkgetrange_function: No ArgType for 'GstPadCheckGetRangeFunction'
Could not write method GstPad.set_unlink_function: No ArgType for 'GstPadUnlinkFunction'
Could not write method GstPad.set_acceptcaps_function: No ArgType for 'GstPadAcceptCapsFunction'
Could not write method GstPad.set_fixatecaps_function: No ArgType for 'GstPadFixateCapsFunction'
Could not write method GstPad.set_setcaps_function: No ArgType for 'GstPadSetCapsFunction'
Could not write method GstPad.start_task: No ArgType for 'GstTaskFunction'
Could not write method GstPad.set_internal_link_function: No ArgType for 'GstPadIntLinkFunction'
Could not write method GstPad.set_query_type_function: No ArgType for 'GstPadQueryTypeFunction'
Could not write method GstPad.set_query_function: No ArgType for 'GstPadQueryFunction'
Could not write method GstPad.dispatcher: No ArgType for 'GstPadDispatcherFunction'
Warning: generating old-style constructor for:gst_ghost_pad_new
Warning: generating old-style constructor for:gst_pad_template_new
Could not write method GstPluginFeature.type_name_filter: No ArgType for 'GstTypeNameData*'
Could not write method GstElementFactory.get_uri_protocols: No ArgType for 'gchar**'
Could not write method GstRegistry.plugin_filter: No ArgType for 'GstPluginFilter'
Could not write method GstRegistry.feature_filter: No ArgType for 'GstPluginFeatureFilter'
Could not write method GstTypeFindFactory.get_extensions: No ArgType for 'gchar**'
Warning: generating old-style constructor for:gst_net_client_clock_new
Warning: generating old-style constructor for:gst_net_time_provider_new
Could not write method GstController.get_all: No ArgType for 'const-GList*'
Could not write method GstController.get_value_arrays: No ArgType for 'GSList*'
Could not write method GstController.get_value_array: No ArgType for 'GstValueArray*'
Could not write method GstAdapter.peek: No ArgType for 'const-guint8*'
Could not write method GstAdapter.take: No ArgType for 'guint8*'
Could not write virtual accessor method GstBaseSink.buffer_alloc: No ArgType for 'GstBuffer**'
Could not write virtual accessor method GstBaseSink.get_times: No ArgType for 'GstClockTime*'
Could not write virtual proxy GstBaseSink.buffer_alloc: No ArgType for 'GstBuffer**'
Could not write virtual proxy GstBaseSink.get_times: No ArgType for 'GstClockTime*'
Could not write virtual accessor method GstBaseTransform.transform_size: No ArgType for 'guint*'
Could not write virtual accessor method GstBaseTransform.prepare_output_buffer: No ArgType for 'GstBuffer**'
Could not write virtual proxy GstBaseTransform.transform_size: No ArgType for 'guint*'
Could not write virtual proxy GstBaseTransform.prepare_output_buffer: No ArgType for 'GstBuffer**'
Could not write method GstCollectPads.set_function: No ArgType for 'GstCollectPadsFunction'
Could not write method GstCollectPads.add_pad: No ArgType for 'GstCollectData*'
Could not write method GstCollectPads.peek: No ArgType for 'GstCollectData*'
Could not write method GstCollectPads.pop: No ArgType for 'GstCollectData*'
Could not write method GstCollectPads.read: No ArgType for 'GstCollectData*'
Could not write method GstCollectPads.flush: No ArgType for 'GstCollectData*'
Could not write virtual accessor method GstURIHandler.get_protocols: No ArgType for 'gchar**'
Could not write interface proxy GstURIHandler.get_protocols: No ArgType for 'gchar**'
Could not write method GstTagSetter.add_tags: varargs functions not supported
Could not write method GstTagSetter.add_tag_values: varargs functions not supported
Could not write method GstTagSetter.add_tag_valist_values: No ArgType for 'va_list'
Could not write function object_control_properties: varargs functions not supported
Could not write function object_uncontrol_properties: varargs functions not supported
Could not write function object_get_value_arrays: No ArgType for 'GSList*'
Could not write function object_get_value_array: No ArgType for 'GstValueArray*'
Could not write function dp_header_from_buffer: No ArgType for 'const-GstBuffer*'
Could not write function dp_packet_from_caps: No ArgType for 'guint*'
Could not write function dp_packet_from_event: No ArgType for 'const-GstEvent*'
Could not write function type_find_helper_get_range: No ArgType for 'GstTypeFindHelperGetRangeFunction'
Could not write function debug_add_log_function: No ArgType for 'GstLogFunction'
Could not write function debug_remove_log_function: No ArgType for 'GstLogFunction'
Could not write function debug_remove_log_function_by_data: No ArgType for 'gpointer'
Could not write function debug_get_all_categories: No ArgType for 'GSList*'
Could not write function debug_remove_log_function: No ArgType for 'GstLogFunction'
Could not write function debug_remove_log_function_by_data: No ArgType for 'gpointer'
Could not write function tag_register: No ArgType for 'GstTagMergeFunc'
Could not write function tag_merge_use_first: No ArgType for 'GValue*'
Could not write function tag_merge_strings_with_comma: No ArgType for 'GValue*'
Could not write function task_create: No ArgType for 'GstTaskFunction'
Could not write function type_find_register: No ArgType for 'GstTypeFindFunction'
Warning: Constructor for GstGhostPad needs to be updated to new API
         See http://live.gnome.org/PyGTK_2fWhatsNew28#update-constructors
Warning: Constructor for GstPadTemplate needs to be updated to new API
         See http://live.gnome.org/PyGTK_2fWhatsNew28#update-constructors
Warning: Constructor for GstNetClientClock needs to be updated to new API
         See http://live.gnome.org/PyGTK_2fWhatsNew28#update-constructors
Warning: Constructor for GstNetTimeProvider needs to be updated to new API
         See http://live.gnome.org/PyGTK_2fWhatsNew28#update-constructors
Warning: Constructor for GstController needs to be updated to new API
         See http://live.gnome.org/PyGTK_2fWhatsNew28#update-constructors
***INFO*** The coverage of global functions is 86.13% (118/137)
***INFO*** The coverage of methods is 89.81% (388/432)
***INFO*** The coverage of virtual proxies is 83.33% (50/60)
***INFO*** The coverage of virtual accessors is 82.81% (53/64)
***INFO*** The coverage of interface proxies is 75.00% (3/4)
if /bin/sh ../libtool --tag=CC --mode=compile gcc -DHAVE_CONFIG_H -I. -I. -I.. -I/usr/include/python2.4   -I/usr/include/pygtk-2.0 -I/usr/include/glib-2.0 -I/usr/lib/glib-2.0/include   -pthread -I/usr/include/gstreamer-0.10 -I/usr/include/glib-2.0 -I/usr/lib/glib-2.0/include -I/usr/include/libxml2   -Wall -Werror  -fno-strict-aliasing -g -O2 -MT _gst_la-gst.lo -MD -MP -MF ".deps/_gst_la-gst.Tpo" -c -o _gst_la-gst.lo `test -f 'gst.c' || echo './'`gst.c; \
        then mv -f ".deps/_gst_la-gst.Tpo" ".deps/_gst_la-gst.Plo"; else rm -f ".deps/_gst_la-gst.Tpo"; exit 1; fi
 gcc -DHAVE_CONFIG_H -I. -I. -I.. -I/usr/include/python2.4 -I/usr/include/pygtk-2.0 -I/usr/include/glib-2.0 -I/usr/lib/glib-2.0/include -pthread -I/usr/include/gstreamer-0.10 -I/usr/include/glib-2.0 -I/usr/lib/glib-2.0/include -I/usr/include/libxml2 -Wall -Werror -fno-strict-aliasing -g -O2 -MT _gst_la-gst.lo -MD -MP -MF .deps/_gst_la-gst.Tpo -c gst.c  -fPIC -DPIC -o .libs/_gst_la-gst.o
gst.c: In function '_wrap_gst_type_find_factory_call_function':
gst.c:10926: error: 'GST_TYPE_TYPE_FIND' undeclared (first use in this function)
gst.c:10926: error: (Each undeclared identifier is reported only once
gst.c:10926: error: for each function it appears in.)
gst.c: In function 'pygst_register_classes':
gst.c:21626: error: 'GST_TYPE_TYPE_FIND' undeclared (first use in this function)
gst.c:21626: error: 'PyGstTypeFind_Type' undeclared (first use in this function)
make[3]: *** [_gst_la-gst.lo] Error 1
make[3]: Leaving directory `/home/frepe/src/gst-python_cvs/gst-python/gst'
make[2]: *** [all-recursive] Error 1
make[2]: Leaving directory `/home/frepe/src/gst-python_cvs/gst-python/gst'
make[1]: *** [all-recursive] Error 1
make[1]: Leaving directory `/home/frepe/src/gst-python_cvs/gst-python'
make: *** [all] Error 2
frepe@lovin:~/src/gst-python_cvs/gst-python$